{"text_format":"1","workbook":"xlsx","n_sheets":96,"sheets":["Menu","Banco de dados","TD 10000","TD 10310","TD 100000","TD 100060","TD 100070","TD 100090","TD 100100","TD 100200","TD 100300","TD 100400","TD 100500","TD 100600","TD 110000","TD 110200","TD 110300","TD 120000","TD 120100","TD 120200","TD 120210","TD 120400","TD 130000","TD 130100","TD 140000","TD 140020","TD 140113","TD 140117","TD 140120","TD 140132","TD 140134","TD 140510","TD 140515","TD 140530","TD 150000","TD 150070","TD 150080","TD 150090","TD 150100","TD 150200","TD 150400","TD 150600","TD 160000","TD 160001","TD 160010","TD 160050","TD 160100","TD 160102","TD 160105","TD 160106","TD 160107","TD 160110","TD 160112","TD 160114","TD 160117","TD 160119","TD 170000","TD 180000","TD 190000","TD 200000","TD 210000","TD 210100","TD 210200","TD 210300","TD 220000","TD 220100","TD 220200","TD 220300","TD 220410","TD 220500","TD 230000","TD 230100","TD 230300","TD 240000","TD 250000","TD 250020","TD 250300","TD 260000","TD 260200","TD 270000","TD 270400","TD 280000","TD 280010","TD 280100","TD 280200","TD 280300","TD 280400","TD 290000","TD 300000","TD 300001","TD 400000","TD 500030","TD 500404","TD 600000","TD por assunto","Gráfico e outros 06-03-15"],"not_rendered":{"charts":1,"images":6,"macros":1,"external_links":0,"defined_names":94,"comments":0,"pivot_tables":93},"unopened":[],"bounds":{"document_bytes":16777216,"sheet_cells":100000,"rows_first":2000,"rows_last":500,"rows_between":2000,"halvings":0,"cell_chars":16384,"cell_head_chars":4096},"cells_cut":0,"cells_raw":0,"read":"whole","date_system":"1900"}

{"sheet":"Menu","index":0,"n_rows":42,"n_cols":32,"rows_kept":42,"cut":false,"hidden":false,"merged":[[1,1,1,33],[3,11,3,13],[3,20,3,21],[3,17,3,19],[3,14,3,15]]}
[]
[null,"CONSULTA DE PEDIDOS E PROCESSOS POR CENTRO DE CUSTO 2014"]
[]
[null,null,null,null,null,null,null,null,null,null,null,"Atualizado em:",null,null,"2015-05-13",null,null,"Próxima atualização:",null,null,{"$f":"O4+15","v":"2015-05-28"}]
[]
[null,10000,null,110000,null,140010,null,140118,null,140137,null,140400,null,150200,null,160109,null,160207,null,160401,null,210200,null,240110,null,260001,null,290100,null,500010,null,600100]
[]
[null,10310,null,110100,null,140020,null,140119,null,140138,null,140401,null,150300,null,160110,null,160208,null,160402,null,210300,null,240200,null,260010,null,290200,null,500020,null,600110]
[]
[null,100000,null,110200,null,140101,null,140120,null,140139,null,140402,null,150400,null,160111,null,160209,null,160501,null,220000,null,240210,null,260020,null,290300,null,500030,null,600200]
[]
[null,100010,null,110300,null,140102,null,140121,null,140140,null,140403,null,150600,null,160112,null,160210,null,160601,null,220100,null,240300,null,260100,null,300000,null,500100,null,600210]
[]
[null,100020,null,120000,null,140103,null,140122,null,140201,null,140404,null,160000,null,160113,null,160211,null,160602,null,220110,null,240310,null,260200,null,300001,null,500201,null,600300]
[]
[null,100030,null,120010,null,140104,null,140123,null,140202,null,140510,null,160001,null,160114,null,160212,null,160603,null,220200,null,240400,null,260300,null,300010,null,500202,null,600310]
[]
[null,100031,null,120020,null,140105,null,140124,null,140203,null,140515,null,160010,null,160115,null,160213,null,170000,null,220300,null,240410,null,260310,null,300020,null,500300,null,800000]
[]
[null,100032,null,120100,null,140106,null,140125,null,140204,null,140530,null,160020,null,160116,null,160214,null,180000,null,220310,null,240500,null,270000,null,300100,null,500400,null,"Por assunto"]
[]
[null,100040,null,120200,null,140107,null,140126,null,140205,null,150000,null,160030,null,160117,null,160215,null,180010,null,220400,null,250000,null,270100,null,300200,null,500401]
[]
[null,100060,null,120210,null,140108,null,140127,null,140206,null,150010,null,160050,null,160118,null,160216,null,180020,null,220410,null,250010,null,270200,null,300210,null,500402]
[]
[null,100070,null,120300,null,140109,null,140128,null,140207,null,150020,null,160100,null,160119,null,160217,null,180030,null,220500,null,250020,null,270300,null,300220,null,500403]
[]
[null,100090,null,120400,null,140110,null,140129,null,140208,null,150030,null,160101,null,160120,null,160218,null,190000,null,230000,null,250100,null,270400,null,300230,null,500404]
[]
[null,100100,null,130000,null,140111,null,140130,null,140209,null,150040,null,160102,null,160121,null,160219,null,200000,null,230100,null,250110,null,280000,null,300300,null,500405]
[]
[null,100200,null,130100,null,140112,null,140131,null,140210,null,150050,null,160103,null,160201,null,160220,null,210000,null,230101,null,250200,null,280010,null,300400,null,500500]
[]
[null,100300,null,130200,null,140113,null,140132,null,140211,null,150060,null,160104,null,160202,null,160221,null,210010,null,230200,null,250210,null,280100,null,300500,null,500501]
[]
[null,100400,null,130300,null,140114,null,140133,null,140301,null,150070,null,160105,null,160203,null,160301,null,210020,null,230210,null,250300,null,280200,null,300600,null,500600]
[]
[null,100500,null,140000,null,140115,null,140134,null,140302,null,150080,null,160106,null,160204,null,160302,null,210030,null,230300,null,250310,null,280300,null,400000,null,500700]
[]
[null,100510,null,140001,null,140116,null,140135,null,140303,null,150090,null,160107,null,160205,null,160303,null,210100,null,240000,null,250320,null,280400,null,400100,null,500710]
[]
[null,100600,null,140002,null,140117,null,140136,null,140304,null,150100,null,160108,null,160206,null,160304,null,210101,null,240100,null,260000,null,290000,null,500000,null,600000]

{"sheet":"Banco de dados","index":1,"n_rows":1311,"n_cols":12,"rows_kept":1311,"cut":false,"hidden":false,"merged":[]}
["Reqmat","Nº DMSA","Nº do processo","Objeto","Objeto 1","Centro de Custo","Unidade","Setor requisitante","Localização atual","Data","Situação atual","Verificar"]
["10/2014","Nº DMSA","002702/2014","Aquisição de medicamentos de uso humano",{"$f":"D2","v":"Aquisição de medicamentos de uso humano"},220300,{"$f":"IFERROR(VLOOKUP(F2,$A$994:$B$1311,2,0),\"\")","v":"DEPARTAMENTO DE CIÊNCIAS FISIOLÓGICAS"},"DEPARTAMENTO DE CIÊNCIAS FISIOLÓGICAS","ASTEC","2015-05-11","Pregão n° 28/2015. houve manifestação de interesse no pregão. Elaborando Edital com as informações e quantitativo dos Órgãos participantes","VERIFICAR O ANDAMENTO DO PREGÃO\natualizado 13/05/2015"]
["68/2014",16,"002702/2014","Aquisição de medicamentos de uso humano",{"$f":"D3","v":"Aquisição de medicamentos de uso humano"},230300,"DEPARTAMENTO DE QUÍMICA","DEPARTAMENTO DE QUÍMICA","ASTEC","2015-05-11","Pregão n° 28/2015. houve manifestação de interesse no pregão. Elaborando Edital com as informações e quantitativo dos Órgãos participantes","VERIFICAR O ANDAMENTO DO PREGÃO\natualizado 13/05/2015"]
["79/2014",411,"006018/2014","Aquisição de equipamentos para laboratório (grupo 52.08)","Aquisição de equipamentos para laboratório (grupo 52.08)",230300,"DEPARTAMENTO DE QUÍMICA","DEPARTAMENTO DE QUÍMICA","DIREÇÃO DMSA","2014-10-31","Buscando informações.","Não foi localizado na sala da Direção."]
["20/2014",114,"006018/2014","Aquisição de equipamentos para laboratório (grupo 52.08)","Aquisição de equipamentos para laboratório (grupo 52.08)",280000,"INSTITUTO DE VETERINÁRIA","DIRETORIA","DIREÇÃO DMSA","2014-10-31","Buscando informações.","Não foi localizado na sala da Direção."]
["02/2014",203,"006018/2014","Aquisição de equipamentos para laboratório (grupo 52.08)","Aquisição de equipamentos para laboratório (grupo 52.08)",220300,"DEPARTAMENTO DE CIÊNCIAS FISIOLÓGICAS","DEPARTAMENTO DE CIÊNCIAS FISIOLÓGICAS","DIREÇÃO DMSA","2014-10-31","Buscando informações.","Não foi localizado na sala da Direção."]
["06/2014",262,"006018/2014","Aquisição de equipamentos para laboratório (grupo 52.08)","Aquisição de equipamentos para laboratório (grupo 52.08)",280300,"DEPTO DE MICROBIOLOGIA E IMUNOLOGIA VETERINÁRIA","DEPARTAMENTO DE MICROBIOLOGIA E IMUNOLOGIA VETERINÁRIA","DIREÇÃO DMSA","2014-10-31","Buscando informações.","Não foi localizado na sala da Direção."]
["05/2014",185,"006018/2014","Aquisição de equipamentos para laboratório (grupo 52.08)","Aquisição de equipamentos para laboratório (grupo 52.08)",280300,"DEPTO DE MICROBIOLOGIA E IMUNOLOGIA VETERINÁRIA","DEPARTAMENTO DE MICROBIOLOGIA E IMUNOLOGIA VETERINÁRIA","DIREÇÃO DMSA","2014-10-31","Buscando informações.","Não foi localizado na sala da Direção."]
["01/2013",1298,"006018/2014","Aquisição de equipamentos para laboratório (grupo 52.08)","Aquisição de equipamentos para laboratório (grupo 52.08)",100000,"REITORIA","DEQUIM - ICE","DIREÇÃO DMSA","2014-10-31","Buscando informações.","Não foi localizado na sala da Direção."]
["02/2013",1299,"006018/2014","Aquisição de equipamentos para laboratório (grupo 52.08)","Aquisição de equipamentos para laboratório (grupo 52.08)",100000,"REITORIA","DEQUIM - ICE - BIOQUÍMICA","DIREÇÃO DMSA","2014-10-31","Buscando informações.","Não foi localizado na sala da Direção."]
["10/2013",1307,"006018/2014","Aquisição de equipamentos para laboratório (grupo 52.08)","Aquisição de equipamentos para laboratório (grupo 52.08)",100000,"REITORIA","DEQUIM - ICE - FÍSICO-QUÍMICA","DIREÇÃO DMSA","2014-10-31","Buscando informações.","Não foi localizado na sala da Direção."]
["07/2013",1304,"006018/2014","Aquisição de equipamentos para laboratório (grupo 52.08)","Aquisição de equipamentos para laboratório (grupo 52.08)",100000,"REITORIA","DEQUIM - ICE - ANÁLISE INSTRUMENTAL","DIREÇÃO DMSA","2014-10-31","Buscando informações.","Não foi localizado na sala da Direção."]
["01/2014",305,"006020/2014","Aquisição de gerador de energia (grupo 52.39)","Aquisição de gerador de energia (grupo 52.39)",220300,"DEPARTAMENTO DE CIÊNCIAS FISIOLÓGICAS","DEPARTAMENTO DE CIÊNCIAS FISIOLÓGICAS","DEPARTAMENTO DE CIÊNCIAS FISIOLÓGICAS","2014-11-11","Buscando informações.","Restituiu para pedir alguma informação?"]
["09/2014",891,"006025/2014","Aquisição de dois martelos perfuradores","Aquisição de dois martelos perfuradores",130000,"PRÓ-REITORIA DE ASSUNTOS ESTUDANTIS","PRÓ-REITORIA DE ASSUNTOS ESTUDANTIS","CLOG","2015-01-12","Já houve empenho (2014NE802605) e pagamento (2015OB801678).","CPNPJ da empresa vencedora: 16.937.697/0001-61\nver no SISCNE se o material foi entregue"]
["S/Nº","S/Nº","006067/2014","Serviço de instalação e manutenção de rede elétrica, cabeamento lógico, telefônico e manutenção de grupo gerador","Serviço de instalação e manutenção de rede elétrica, cabeamento lógico, telefônico e manutenção de grupo gerador",200000,"PRÓ-REITORIA DE PLANEJAMENTO, AVALIAÇÃO E DESENVOLVIMENTO INSTITUCIONAL","PRÓ-REITORIA DE PLANEJAMENTO, AVALIAÇÃO E DESENVOLVIMENTO INSTITUCIONAL","CPACS","2014-07-31","Buscando informações."]
["13/2014",1318,"006084/2014","Aquisição de mobiliário em geral (grupo 52.42) - Mesa de refeitório para 6 pessoas (carona)","Aquisição de mobiliário em geral (grupo 52.42) - Mesa de refeitório para 6 pessoas (carona)",130000,"PRÓ-REITORIA DE ASSUNTOS ESTUDANTIS","PRÓ-REITORIA DE ASSUNTOS ESTUDANTIS","DIREÇÃO DMSA","2014-08-05","Buscando informações.","Não foi localizado na sala da Direção."]
["53/2014",1043,"006016/2014","Aquisição de cartuchos hp, toners e tintas (grupo 30.17A)","Aquisição de cartuchos hp, toners e tintas (grupo 30.17A)",280000,"INSTITUTO DE VETERINÁRIA","DIRETORIA","DMSA","2014-07-25","Buscando informações.","Por que está com apenas uma carga para o DMSA desde 25/07/14?"]
["04/2014",1087,"006016/2014","Aquisição de cartuchos hp, toners e tintas (grupo 30.17A)","Aquisição de cartuchos hp, toners e tintas (grupo 30.17A)",250300,"DEPARTAMENTO DE TEORIA E PLANEJAMENTO DE ENSINO","DEPARTAMENTO DE TEORIA E PLANEJAMENTO DE ENSINO","DMSA","2014-07-25","Buscando informações.","Por que está com apenas uma carga para o DMSA desde 25/07/14?"]
["21/2014",1060,"006016/2014","Aquisição de cartuchos hp, toners e tintas (grupo 30.17A)","Aquisição de cartuchos hp, toners e tintas (grupo 30.17A)",220300,"DEPARTAMENTO DE CIÊNCIAS FISIOLÓGICAS","DEPARTAMENTO DE CIÊNCIAS FISIOLÓGICAS","DMSA","2014-07-25","Buscando informações.","Por que está com apenas uma carga para o DMSA desde 25/07/14?"]
["21/2014",1101,"006016/2014","Aquisição de cartuchos hp, toners e tintas (grupo 30.17A)","Aquisição de cartuchos hp, toners e tintas (grupo 30.17A)",280010,"HOSPITAL VETERINÁRIO","HOSPITAL VETERINÁRIO","DMSA","2014-07-25","Buscando informações.","Por que está com apenas uma carga para o DMSA desde 25/07/14?"]
["05/2014",1052,"006016/2014","Aquisição de cartuchos hp, toners e tintas (grupo 30.17A)","Aquisição de cartuchos hp, toners e tintas (grupo 30.17A)",100600,"COORDENADORIA DE PLANEJAMENTO","COORDENADORIA DE PLANEJAMENTO","DMSA","2014-07-25","Buscando informações.","Por que está com apenas uma carga para o DMSA desde 25/07/14?"]
["07/2014",1044,"006016/2014","Aquisição de cartuchos hp, toners e tintas (grupo 30.17A)","Aquisição de cartuchos hp, toners e tintas (grupo 30.17A)",250000,"INSTITUTO DE EDUCAÇÃO","DIREÇÃO","DMSA","2014-07-25","Buscando informações.","Por que está com apenas uma carga para o DMSA desde 25/07/14?"]
["14/2014",1081,"006016/2014","Aquisição de cartuchos hp, toners e tintas (grupo 30.17A)","Aquisição de cartuchos hp, toners e tintas (grupo 30.17A)",130000,"PRÓ-REITORIA DE ASSUNTOS ESTUDANTIS","SECRETARIA","DMSA","2014-07-25","Buscando informações.","Por que está com apenas uma carga para o DMSA desde 25/07/14?"]
["26/2014",1084,"006016/2014","Aquisição de cartuchos hp, toners e tintas (grupo 30.17A)","Aquisição de cartuchos hp, toners e tintas (grupo 30.17A)",400000,"CAMPUS DA UFRRJ EM TRÊS RIOS","CAMPUS DA UFRRJ EM TRÊS RIOS","DMSA","2014-07-25","Buscando informações.","Por que está com apenas uma carga para o DMSA desde 25/07/14?"]
["06/2014",1117,"006016/2014","Aquisição de cartuchos hp, toners e tintas (grupo 30.17A)","Aquisição de cartuchos hp, toners e tintas (grupo 30.17A)",280400,"DEPARTAMENTO DE PARASITOLOGIA ANIMAL","DEPARTAMENTO DE PARASITOLOGIA ANIMAL","DMSA","2014-07-25","Buscando informações.","Por que está com apenas uma carga para o DMSA desde 25/07/14?"]
["20/2013","S/Nº","006016/2014","Aquisição de cartuchos hp, toners e tintas (grupo 30.17A)","Aquisição de cartuchos hp, toners e tintas (grupo 30.17A)",100200,"IMPRENSA UNIVERSITÁRIA","IMPRENSA UNIVERSITÁRIA","DMSA","2014-07-25","Buscando informações.","Por que está com apenas uma carga para o DMSA desde 25/07/14?"]
["01/2014",1118,"006016/2014","Aquisição de cartuchos hp, toners e tintas (grupo 30.17A)","Aquisição de cartuchos hp, toners e tintas (grupo 30.17A)",230100,"DEPARTAMENTO DE FÍSICA","ICE - DEFÍS","DMSA","2014-07-25","Buscando informações.","Por que está com apenas uma carga para o DMSA desde 25/07/14?"]
["35/2014",1317,"006016/2014","Aquisição de cartuchos hp, toners e tintas (grupo 30.17A)","Aquisição de cartuchos hp, toners e tintas (grupo 30.17A)",110000,"PRÓ-REITORIA DE ASSUNTOS ADMINISTRATIVOS","PROAD - SAPG","DMSA","2014-07-25","Buscando informações.","Por que está com apenas uma carga para o DMSA desde 25/07/14?"]
["04/2014",1020,"004814/2014","Aquisição de tablet de 10,1\" e 7\"","Aquisição de tablet de 10,1\" e 7\"",150070,"PROEXT - OBSERVATÓRIO DE POLÍTICAS DEMOCRÁTICAS DE ACESSO E PERMANÊNCIA NA EDUCAÇÃO SUPERIOR","PRÓ-REITORIA DE EXTENSÃO","PRÓ-REITORIA DE PLANEJAMENTO, AVALIAÇÃO E DESENVOLVIMENTO","2015-01-23","Enviado à COTIC para atendimento da nova legislação.","atualizado 20/03/2015"]
["87/2014",857,"004526/2014","Fornecimento e instalação de 9 persianas verticais","Fornecimento e instalação de 9 persianas verticais",150000,"PRÓ-REITORIA DE EXTENSÃO","DEPARTAMENTO DE LOGÍSTICA E INFRAESTRUTURA","PRO-REITORIA DE ASSUNTOS FINANCEIROS","2015-05-04","Pregão nº 49/2014 finalizado em 07/11/14. Analisando as insconsistências apontadas pela gestora do contrato (quantitativo e especificações do contrato) para tentar saná-las e em breve o processo será encaminhado à Direação do DMSA. (Anexado ao 5649/2013-72)","Informações obtidas com Luan Gonçalves em 05/03/14. Foi Murilo quem pediu para ele verificar essas questões junto ao pregoeiro Rafael. As respostas serão:  A resposta informará que o quatitativo a quem se deu por solicitação do próprio requerente na redução do quantitativo e quanto ao contrato, erros na hora da redação, indicando um termo aditivo de correção."]
["80/2014",405,"004521/2014","Aquisição de eletrocardiógrafo ECG, digital de 12 canais","Aquisição de eletrocardiógrafo ECG, digital de 12 canais",100070,"POSTO MÉDICO","DIVISÃO DE SAÚDE","ARQUIVO","2014-09-24","Arquivado porque já houve a compra do equipamento.","Despacho Janaína Gomes em 19/09/14."]
["02/2014",942,"004446/2014","Revisão de antenas de comunicação instaladas no interior do Campus da UFRRJ","Revisão de antenas de comunicação instaladas no interior do Campus da UFRRJ",100060,"DIVISÃO DE GUARDA E VIGILÂNCIA","DIVISÃO DE GUARDA E VIGILÂNCIA","ARQUIVO","2014-11-07","Arquivado porque houve empenho e pagamento."]
["01/2014",1073,"005136/2014","Conserto da ordenhadeira mecânica","Conserto da ordenhadeira mecânica",100500,"COORDENADORIA DE DESENVOLVIMENTO DA PRODUÇÃO","COORDENADORIA DE PRODUÇÃO ANIMAL","COORDENADORIA ESPECIAL DE PRODUÇÃO INTEGRADA ENSINO, PESQUISA E  EXTENSÃO","2014-11-04","Buscando informações.","Já houve o empenho e está no setor aguardando a entrega?"]
["04/2014",1222,"007530/2014","Aquisição de memória portátil microcomputador (grupo 30.17B)","Aquisição de memória portátil microcomputador (grupo 30.17B)",160105,{"$f":"IFERROR(VLOOKUP(F34,$A$994:$B$1311,2,0),\"\")","v":"PROAP - ENGENHARIA QUÍMICA"},"PPGEQ","COORD. DO CURSO DE POS-GRADUAÇÃO EM ENGENHARIA QUÍMICA","2015-04-13","Buscando informações.","Nenhum empenho encontrado no SISCNE."]
["89/2014",1246,"005474/2014","Fornecimento e instalação de 39m² de parede de divisória","Fornecimento e instalação de 39m² de parede de divisória",220300,"DEPARTAMENTO DE CIÊNCIAS FISIOLÓGICAS","DEPARTAMENTO DE CIÊNCIAS FISIOLÓGICAS","SPP","2015-05-13","atualização da pesquisa de preços.","atualizado 13/05/2015"]
["01/2014",1360,"006466/2014","Contratação de empresa especializada para proceder a lavagem de 8 (oito) reservatórios d'água","Contratação de empresa especializada para proceder a lavagem de 8 (oito) reservatórios d'água",300000,"CAMPUS DA UFRRJ EM NOVA IGUAÇU","SUPERINTENDÊNCIA DO CAMPUS NOVA IGUAÇU","SCD","2015-01-13","Foram solicitadas visita ténica e propostas às empresas, mas apenas duas fizeram a vistoria, mesmo tendo marcado duas datas. Somente uma enviou a proposta, porém está com o INSS vencido. Estamos tentando obter a outra proposta ou a regularização da situação no SICAF.","atualizado 13/05/2015"]
["237/2014",1421,"007037/2014","Conserto e manutenção de impressora Xerox PHASER 6180","Conserto e manutenção de impressora Xerox PHASER 6180",110300,"DEPARTAMENTO DE PESSOAL","SECRETARIA ADMINISTRATIVA","ARQUIVO","2015-02-06","Arquivado porque o Departamento de Pessoal informou não haver mais interesse em consertar a impressora, pois não há mais peça no mercado.","Despacho da Sidnéia Mattos Couto (Sectretária do DP) em 15/10/14."]
["17/2014",1456,"007599/2014","Aquisição de título: Estudo do lazer","Aquisição de título: Estudo do lazer",180000,"CTUR","CTUR","SPP","2015-03-10","Atualizando a Pesquisa de Preços e atendendo recomendações do Parecer da PROGER","atualizado 20/03/2015"]
["59/2014",1173,"005324/2014","Instalação de data show multimídia","Instalação de data show multimídia",280000,"INSTITUTO DE VETERINÁRIA","DIRETORIA DO IV","ASTEC","2014-12-16","Elaboração da minuta de edital.","atualizado 26/03/2015"]
["10/2014",1014,"005324/2014","Instalação de data show multimídia","Instalação de data show multimídia",270000,"INSTITUTO DE TECNOLOGIA","INSTITUTO DE TECNOLOGIA","ASTEC","2014-12-16","Elaboração da minuta de edital.","atualizado 26/03/2015"]
["06/2014",1199,"005473/2014","Instalação de 5 suportes para projetores","Instalação de 5 suportes para projetores",140000,"PRÓ-REITORIA DE ENSINO E GRADUAÇÃO","COORDENAÇÃO DO CURSO DE MATEMÁTICA - CAMPUS SEROPÉDICA","ANEXADO    23083.005324/2014-71","2014-11-18","Elaboração da minuta de edital (anexado ao 005324/2014).","atualizado 26/03/2015"]
["01/2014","S/Nº","000313/2014","Contratação de empresa terceirizada para prestação de serviços de vigilância e segurança armada nas dependências do Campus Campos dos Goytacazes","Contratação de empresa terceirizada para prestação de serviços de vigilância e segurança armada nas dependências do Campus Campos dos Goytacazes",190000,"CAMPUS DR. LEONEL MIRANDA","SERVIÇOS GERAIS - CAMPUS CAMPOS DOS GOYTACAZES","DIVISÃO DE ADMINISTRAÇÃO FINANCEIRA","2015-04-09","Pregão nº 83/2014 finalizado em 04/12/14. Já houve empenho (2014NE802540, ) e pagamento (2015OB801274)","verificar se houve mais empenhos \n05.234.289/0001-27 e pagamentos"]
["12/2014",1507,"007799/2014","Aquisição de estabilizador de 1000 VA características de entrada: tensão nominal 115v/220v","Aquisição de estabilizador de 1000 VA características de entrada: tensão nominal 115v/220v",260000,"INSTITUTO DE FLORESTAS","INSTITUTO DE FLORESTAS","DIREÇÃO DMSA","2015-01-26","Verificando a possibilidade de atendimento juntamente com a demanda de 2015.","atualizado 20/03/2015"]
["47/2014",1630,"008002/2014","Aquisição de impressora matricial Okidata","Aquisição de impressora matricial Okidata",110200,"SEÇÃO DE ARQUIVO E PROTOCOLO GERAL","SECAO DE ARQUIVO E PROTOCOLO GERAL","NÚCLEO DE GOVERNANÇA DA TEC. DA INF. E COMUNICAÇÃO","2014-10-27","Buscando informações.","O que faz nesse setor?"]
["18/2014",1638,"008027/2014","Recuperação de tetos em gesso nos laboratórios do DAU","Recuperação de tetos em gesso nos laboratórios do DAU",270000,"INSTITUTO DE TECNOLOGIA","DEPARTAMENTO DE ARQUITETURA E URBANISMO","DIVISÃO DE ADMINISTRAÇÃO FINANCEIRA","2015-04-22","Emissão da Nota de empenho","CNPJ da empresa vencedora 13.480.898/0001-94 VERIFICAR SE HOUVE EMPENHO"]
["05/2014",1643,"008024/2014","Aquisição de cartuchos","Aquisição de cartuchos",280010,"HOSPITAL VETERINÁRIO","HOSPITAL VETERINÁRIO","ARQUIVO","2015-03-06","Arquivado porque o material está sendo atendido pelo processo 003666/2014.","Despacho da Janaína Gomes em 29/09/14."]
["01/2014",1644,"008025/2014","Aquisição de livros","Aquisição de livros",140530,"DOCÊNCIA NA EDUCAÇÃO INFANTIL","DOCÊNCIA NA EDUCAÇÃO INFANTIL","ANEXADO    23083.007599/2014-49","2014-11-17","Atualizando a Pesquisa de Preços e atendendo recomendações do Parecer da PROGER (anexado ao 007599/2014).","atualizado 20/03/2015"]
["07/2014",1731,"008025/2014","Aquisição de livros",{"$f":"D48","v":"Aquisição de livros"},500030,"PROGRAMA INGLÊS SEM FRONTEIRAS","PROGRAMA INGLÊS SEM FRONTEIRAS","ANEXADO    23083.007599/2014-50","2014-11-17","Atualizando a Pesquisa de Preços e atendendo recomendações do Parecer da PROGER (anexado ao 007599/2014).","atualizado 20/03/2015"]
["01/2014",266,"002892/2014","Aquisição de 14 mil garrafões de 20 litros de água mineral","Aquisição de 14 mil garrafões de 20 litros de água mineral",100000,"REITORIA","ALMOXARIFADO CENTRAL","DIVISÃO DE ADMINISTRAÇÃO FINANCEIRA","2015-04-29","Pregão nº 92/2014 finalizado em 25/11/14. Já houve empenho (2014NE802501, 2015NE800192, 2015NE800193, 2015NE800194, 2015NE800195, 2015NE800196) e pagamento (2015OB801330). ","verificar se houve mais empenhos e pagamentos\n07.699.771/0001-68"]
["01/2014",308,"003855/2014","Contratação de pessoa jurídica para prestação de serviços de postos de motorista","Contratação de pessoa jurídica para prestação de serviços de postos de motorista",100300,"PREFEITURA UNIVERSITÁRIA","DIVISÃO DE SERVIÇOS GERAIS","DIREÇÃO DMSA","2014-05-28","O processo será encaminhado ao requerente para adequação do pedido à Instrução Normativa nº 02/2008.","verificar se foi encaminhado para o requerente"]
["64/2014",395,"004381/2014","Manutenção preventiva referente ao analisador genético 3500","Manutenção preventiva referente ao analisador genético 3500",160114,"PROAP - CIÊNCIAS VETERINÁRIAS","CURSO DE PÓS-GRADUAÇÃO EM CIÊNCIAS VETERINÁRIAS/LAB. DE BIOLOGIA MOLECULAR","DIVISÃO DE ADMINISTRAÇÃO FINANCEIRA","2015-05-08","Buscando informações.","anotado"]
["08/2014",418,"002372/2014","Aquisição de cartuchos","Aquisição de cartuchos",120200,"DEPARTAMENTO DE MATERIAL E SERVIÇOS AUXILIARES","DEPARTAMENTO DE MATERIAL E SERVICOS AUXILIARES","CLOG","2014-10-21","Já houve empenho (2014NE800742, 2014NE800743, 2014NE800744, 2014NE800741) e pagamento (2014OB804858, 2014OB804667, 2014OB804951).","Verificar se houve mais empenhos e pagamentos 05.114.599/0001-08 - 91.662.148/0001-47 - 13.449.663/0001-30"]
["09/2014",419,"002371/2014","Aquisição de cartucho de tinta impressora HP ref. C9388-A","Aquisição de cartucho de tinta impressora HP ref. C9388-A",120200,"DEPARTAMENTO DE MATERIAL E SERVIÇOS AUXILIARES","DEPARTAMENTO DE MATERIAL E SERVICOS AUXILIARES","CLOG","2014-10-21","Buscando informações.","Verificar com a Thais SSRP"]
["18/2014",1470,"007545/2014","Pagamento de inscrição do curso XI Semana de Administração Orçamentária Financeira e de Contratações Públicas dos servidores Marcio Bastos e Luan Lima","Pagamento de inscrição do curso XI Semana de Administração Orçamentária Financeira e de Contratações Públicas dos servidores Marcio Bastos e Luan Lima",120200,"DEPARTAMENTO DE MATERIAL E SERVIÇOS AUXILIARES","DEPARTAMENTO DE MATERIAL E SERVIÇOS AUXILIARES","SCD","2014-12-16","Buscando informações.","Juliane não encontrou no setor, tem que verificar com o Denis."]
["36/2014",1891,"010419/2014","Aquisição de liquidificador industrial","Aquisição de liquidificador industrial",180000,{"$f":"IFERROR(VLOOKUP(F55,$A$997:$B$1314,2,0),\"\")","v":"CTUR"},"CTUR","CLOG","2014-11-27","Já houve empenho (2014NE802294) e pagamento (2014OB809802)","Verificar por que não foi arquivado, visto que o material já foi entregue em sua totalidade"]
["18/2014",1786,"009040/2014","Aquisição de duas cadeiras de rodas","Aquisição de duas cadeiras de rodas",130100,{"$f":"IFERROR(VLOOKUP(F56,$A$997:$B$1314,2,0),\"\")","v":"RESTAURANTE UNIVERSITÁRIO - CAMPUS SEROPÉDICA"},"PROAES","ARQUIVO","2015-04-17","Já houve empenho (2014NE802489) e pagamento (2015OB800810)","Verificar por que não foi arquivado, visto que o material já foi entregue em sua totalidade"]
["02/2014",432,"003145/2014","Aquisição de gás liquefeito de petróleo","Aquisição de gás liquefeito de petróleo",130100,{"$f":"IFERROR(VLOOKUP(F57,$A$994:$B$1311,2,0),\"\")","v":"RESTAURANTE UNIVERSITÁRIO - CAMPUS SEROPÉDICA"},"RESTAURANTE UNIVERSITÁRIO - CAMPUS SEROPÉDICA","SEC. ADM. DO DEPTO DE CONTABILIDADE E FINANÇAS","2015-04-06","Pregão nº 94/2014 finalizado em 06/11/14. O processo está disponível na Pró-reitoria de Assuntos Estudantis para solicitar empenhos.","Verificar o número do CNPJ das empresas vencedoras\nverificar se houve empenho"]
["69/2014",409,"003153/2014","Aquisição de gás medicinal","Aquisição de gás medicinal",100070,"POSTO MÉDICO","POSTO MÉDICO","SEC. ADM. DO DEPTO DE CONTABILIDADE E FINANÇAS","2015-05-08","Pregão nº 13/2015 (antigo nº 99/2014) finalizado em 22/01/15. Está na SSRP para realizar as cópias das atas e em breve um gestor será designado.","atualizado 27/03/2015"]
["01/2014",284,"003179/2014","Aquisição de gás medicinal","Aquisição de gás medicinal",260200,"DEPARTAMENTO DE PRODUTOS FLORESTAIS","DEPARTAMENTO DE PRODUTOS FLORESTAIS","ANEXADO    23083.003153/2014-45","2014-08-14","Pregão nº 13/2015 (antigo nº 99/2014) finalizado em 22/01/15. Está na SSRP para realizar as cópias das atas e em breve um gestor será designado (anexado ao 003153/2014).","atualizado 27/03/2015"]
["05/2014",361,"003179/2014","Aquisição de gás medicinal","Aquisição de gás medicinal",220410,"LABORATÓRIO OFICIAL DE DIAGNÓSTICO FITOSSANITÁRIO","LABORATÓRIO OFICIAL DE DIAGNÓSTICO FITOSSANITÁRIO","ANEXADO    23083.003153/2014-45","2014-08-14","Pregão nº 13/2015 (antigo nº 99/2014) finalizado em 22/01/15. Está na SSRP para realizar as cópias das atas e em breve um gestor será designado (anexado ao 003153/2014).","atualizado 27/03/2015"]
["69/2014",409,"002700/2014","Aquisição de gás liquefeito de petróleo","Aquisição de gás liquefeito de petróleo",100070,"POSTO MÉDICO","POSTO MÉDICO","DIREÇÃO DMSA","2015-05-11","Pregão nº 138/2014 finalizado em 14/11/14. O processo está disponível na Seção de Sistema de Registro de Preços para solicitar empenhos.","atualizado 27/03/2015"]
["07/2014",369,"002700/2014","Aquisição de gás liquefeito de petróleo","Aquisição de gás liquefeito de petróleo",100100,"BIBLIOTECA CENTRAL","BIBLIOTECA CENTRAL","DIREÇÃO DMSA","2015-05-11","Pregão nº 138/2014 finalizado em 14/11/14. O processo está disponível na Seção de Sistema de Registro de Preços para solicitar empenhos.","atualizado 27/03/2015"]
["04/2014",346,"002700/2014","Aquisição de gás liquefeito de petróleo","Aquisição de gás liquefeito de petróleo",160000,"PRÓ-REITORIA DE PESQUISA E PÓS GRADUAÇÃO","PRÓ-REITORIA DE PESQUISA E PÓS GRADUAÇÃO","DIREÇÃO DMSA","2015-05-11","Pregão nº 138/2014 finalizado em 14/11/14. O processo está disponível na Seção de Sistema de Registro de Preços para solicitar empenhos.","atualizado 27/03/2015"]
["01/2014",387,"002700/2014","Aquisição de gás liquefeito de petróleo","Aquisição de gás liquefeito de petróleo",170000,"CAIC","CAIC","DIREÇÃO DMSA","2015-05-11","Pregão nº 138/2014 finalizado em 14/11/14. O processo está disponível na Seção de Sistema de Registro de Preços para solicitar empenhos.","atualizado 27/03/2015"]
["16/2014",430,"002700/2014","Aquisição de gás liquefeito de petróleo","Aquisição de gás liquefeito de petróleo",220000,"INSTITUTO DE BIOLOGIA","INSTITUTO DE BIOLOGIA","DIREÇÃO DMSA","2015-05-11","Pregão nº 138/2014 finalizado em 14/11/14. O processo está disponível na Seção de Sistema de Registro de Preços para solicitar empenhos.","atualizado 27/03/2015"]
["05/2014",67,"002700/2014","Aquisição de gás liquefeito de petróleo","Aquisição de gás liquefeito de petróleo",220410,"LABORATÓRIO OFICIAL DE DIAGNÓSTICO FITOSSANITÁRIO","LABORATÓRIO OFICIAL DE DIAGNÓSTICO FITOSSANITÁRIO","DIREÇÃO DMSA","2015-05-11","Pregão nº 138/2014 finalizado em 14/11/14. O processo está disponível na Seção de Sistema de Registro de Preços para solicitar empenhos.","atualizado 27/03/2015"]
["05/2014",144,"002700/2014","Aquisição de gás liquefeito de petróleo",{"$f":"D67","v":"Aquisição de gás liquefeito de petróleo"},260000,"INSTITUTO DE FLORESTAS","INSTITUTO DE FLORESTAS","DIREÇÃO DMSA","2015-05-11","Pregão nº 138/2014 finalizado em 14/11/14. O processo está disponível na Seção de Sistema de Registro de Preços para solicitar empenhos.","atualizado 27/03/2015"]
["01/2014",284,"002700/2014","Aquisição de gás liquefeito de petróleo","Aquisição de gás liquefeito de petróleo",260200,"DEPARTAMENTO DE PRODUTOS FLORESTAIS","DEPARTAMENTO DE PRODUTOS FLORESTAIS","DIREÇÃO DMSA","2015-05-11","Pregão nº 138/2014 finalizado em 14/11/14. O processo está disponível na Seção de Sistema de Registro de Preços para solicitar empenhos.","atualizado 27/03/2015"]
["01/2014",216,"002700/2014","Aquisição de gás liquefeito de petróleo","Aquisição de gás liquefeito de petróleo",270400,"DEPARTAMENTO DE TECNOLOGIA DE ALIMENTOS","DEPARTAMENTO DE TECNOLOGIA DE ALIMENTOS","DIREÇÃO DMSA","2015-05-11","Pregão nº 138/2014 finalizado em 14/11/14. O processo está disponível na Seção de Sistema de Registro de Preços para solicitar empenhos.","atualizado 27/03/2015"]
["04/2014",192,"002700/2014","Aquisição de gás liquefeito de petróleo","Aquisição de gás liquefeito de petróleo",280200,"DEPARTAMENTO DE MEDICINA E CIRURGIA VETERINÁRIA","DEPARTAMENTO DE MEDICINA E CIRURGIA VETERINÁRIA","DIREÇÃO DMSA","2015-05-11","Pregão nº 138/2014 finalizado em 14/11/14. O processo está disponível na Seção de Sistema de Registro de Preços para solicitar empenhos.","atualizado 27/03/2015"]
["01/2014",105,"002700/2014","Aquisição de gás liquefeito de petróleo","Aquisição de gás liquefeito de petróleo",280300,"DEPTO DE MICROBIOLOGIA E IMUNOLOGIA VETERINÁRIA","DEPTO DE MICROBIOLOGIA E IMUNOLOGIA VETERINÁRIA","DIREÇÃO DMSA","2015-05-11","Pregão nº 138/2014 finalizado em 14/11/14. O processo está disponível na Seção de Sistema de Registro de Preços para solicitar empenhos.","atualizado 27/03/2015"]
["01/2014",164,"002700/2014","Aquisição de gás liquefeito de petróleo","Aquisição de gás liquefeito de petróleo",290000,"INSTITUTO DE ZOOTECNIA","INSTITUTO DE ZOOTECNIA","DIREÇÃO DMSA","2015-05-11","Pregão nº 138/2014 finalizado em 14/11/14. O processo está disponível na Seção de Sistema de Registro de Preços para solicitar empenhos.","atualizado 27/03/2015"]
["14/2014",326,"002700/2014","Aquisição de gás liquefeito de petróleo","Aquisição de gás liquefeito de petróleo",290000,"INSTITUTO DE ZOOTECNIA","INSTITUTO DE ZOOTECNIA","DIREÇÃO DMSA","2015-05-11","Pregão nº 138/2014 finalizado em 14/11/14. O processo está disponível na Seção de Sistema de Registro de Preços para solicitar empenhos.","atualizado 27/03/2015"]
["01/2014",443,"002700/2014","Aquisição de gás liquefeito de petróleo","Aquisição de gás liquefeito de petróleo",600000,"INSTITUTO DE CIÊNCIAS SOCIAIS APLICADAS","INSTITUTO DE CIÊNCIAS SOCIAIS APLICADAS","DIREÇÃO DMSA","2015-05-11","Pregão nº 138/2014 finalizado em 14/11/14. O processo está disponível na Seção de Sistema de Registro de Preços para solicitar empenhos.","atualizado 27/03/2015"]
["02/2014",215,"003204/2014","Aquisição de gêneros alimentícios","Aquisição de gêneros alimentícios",270400,"DEPARTAMENTO DE TECNOLOGIA DE ALIMENTOS","DEPARTAMENTO DE TECNOLOGIA DE ALIMENTOS","DIREÇÃO DMSA","2015-05-05","Pregão nº 14/2015 (antigo nº 117/2014) iniciado em 02/02/15.","Verificar o número do CNPJ das empresas vencedoras\nverificar se houve empenho"]
["02/2014",386,"003205/2014","Aquisição de gêneros alimentícios","Aquisição de gêneros alimentícios",170000,"CAIC","CAIC","CAIC","2015-01-22","Pregão nº 135/2014 finalizado em 01/12/14. O processo está disponível no CAIC para solicitar empenhos. ","atualizado 27/03/2015"]
["06/2014",160,"002393/2014","Aquisição de pães e bolos","Aquisição de pães e bolos",130100,"RESTAURANTE UNIVERSITÁRIO - CAMPUS SEROPÉDICA","RESTAURANTE UNIVERSITÁRIO - CAMPUS SEROPÉDICA","RESTAURANTE UNIVERSITÁRIO DO CAMPUS DE NOVA IGUAÇU","2015-01-23","Era o pregão nº 74/2014, porém todos os itens foram cancelados na aceitação da proposta porque os preços foram superiores aos estipulados pela Administração. O novo pregão (nº 160/2014) foi finalizado em 16/12/14. O processo está disponível no Restaurante Universitário do Instituto Multidisciplinar para solicitar empenhos.","CNPJ da empresa vencedora: 17.392.538/0001-91\nVERIFICAR SE HOUVE MAIS EMPENHO"]
["05/2014","S/Nº","002425/2014","Aquisição de carnes","Aquisição de carnes",130100,"RESTAURANTE UNIVERSITÁRIO - CAMPUS SEROPÉDICA","RESTAURANTE UNIVERSITÁRIO - CAMPUS SEROPÉDICA","DIREÇÃO DMSA","2015-05-07","Pregão nº 87/2014 finalizado em 07/11/14. Já houve empenho (2014NE802353, 2014NE802354, 2014NE802355, 2014NE802356, 2014NE802357, 2014NE802358, 2014NE802359, 2014NE802360, 2014NE802361, 2014NE802363) e pagamento (2015OB800183, 2015OB800197). O processo está disponível na Pró-reitoria de Assuntos Estudantis para solicitar empenhos.","verificar se houve mais empenhos e pagamentos\n10.392.981/0001-13  -  40.326.381/0001-18"]
["04/2014","S/Nº","002422/2014","Aquisição de frutas, legumes e verduras","Aquisição de frutas, legumes e verduras",130100,"RESTAURANTE UNIVERSITÁRIO - CAMPUS SEROPÉDICA","RESTAURANTE UNIVERSITÁRIO - CAMPUS SEROPÉDICA","PROAES","2015-03-27","Pregão nº 71/2014 finalizado em 29/07/14. Já houve empenho (2014NE801281, 2014NE801282, 2014NE801283, 2014NE801284, 2014NE801285, 2014NE801511, 2014NE801512, 2014NE801513, 2014NE801514, 2014NE801515, 2014NE801516, 2014NE801517, 2014NE801518, 2014NE801519, 2014NE801520, 2014NE1908, 2014NE801909, 2014NE801910, 2014NE801911, 2014NE801912, 2014NE802220, 2014NE802221, 2014NE802222, 2014NE802223, 2014NE802224, 2014NE802260, 2014NE802261, 2014NE802338, 2014NE802339, 2014NE802340, 2014NE802341, 2014NE802619, 2014NE802633, 2014NE802640, 2014NE802642, 2014NE802644, 2014NE802646, 2014NE801286, 2014NE801287, 2014NE801288, 2014NE801289, 2014NE801290, 2014NE801291, 2014NE801292, 2014NE801522, 2014NE801523, 2014NE801524, 2014NE801525, 2014NE801526, 2014NE801527, 2014NE801528, 2014NE801529, 2014NE801913, 2014NE801914, 2014NE801915, 2014NE801916, 2014NE801917, 2014NE802225, 2014NE802226, 2014NE802227, 2014NE802228, 2014NE802229, 2014NE802262, 2014NE802336, 2014NE802337, 2014NE802342, 2014NE802635, 2014NE802638, 2015NE800292, 2015NE800293, 2015NE800294, 2015NE800295) e pagamento (2014OB808371, 2014OB808637, 2014OB000067, 2014OB808800, 2014OB000069, 2014OB808801, 2014OB809315, 2014OB809697, 2014OB809698, 2014OB809701, 2014OB809824, 2014OB809825, 2014OB809826, 2014OB809827, 2014OB809828, 2014OB809829, 2014OB809838, 2014OB806690, 2014OB806810, 2014OB807480, 2014OB807481, 2014OB808040, 2014OB808344, 2014OB809137, 2015OB800533 ). O processo está disponível na Pró-reitoria de Assuntos Estudantis para solicitar empenhos.","Verificar se houve mais empenhos e pagamentos 40.326.381/0001-18 , 42.425.389/0001-67"]
["06/2014",611,"003009/2014","Aquisição de alimentos estocáveis","Aquisição de alimentos estocáveis",130100,"RESTAURANTE UNIVERSITÁRIO - CAMPUS SEROPÉDICA","RESTAURANTE UNIVERSITÁRIO - CAMPUS SEROPÉDICA","PROAES","2015-04-22","Pregão nº 153/2014 finalizado em 22/12/14. Já houve empenho (2015NE800218, 2015NE800219, 2015NE800213, 2015NE800214, 2015NE800215, 2015NE800216, 2015NE800217). O processo está disponível no Restaurante Universitário de Seropédica para solicitar empenhos.","Verificar se houve mais empenhos 01.220.638/0001-09, \n02.768.278/0001-39, 40.326.381/0001-18"]
["08/2014",448,"002658/2014","Aquisição de carnes","Aquisição de carnes",300001,"RESTAURANTE UNIVERSITÁRIO - NOVA IGUAÇU","RESTAURANTE UNIVERSITÁRIO - NOVA IGUAÇU","SSRP","2015-03-09","Pregão nº 82/2014 finalizado em 21/11/14. Já houve empenho (2015NE800248, 2015NE800249, 2015NE800250, 2015NE800251, 2015NE800252, 2015NE800253). O processo está disponível no Restaurante Universitário do Instituto Multidisciplinar para solicitar empenhos.","Verificar se houve mais empenhos 02.768.278/0001-39 , 03.948.499/0001-51 , 04.613.751/0004-87 , 10.392.981/0001-13 , 14.426.255/0001-25 , 17.392.538/0001-91 , 40.326.381/0001-18 , "]
["09/2014",449,"002657/2014","Aquisição de frutas, legumes e verduras","Aquisição de frutas, legumes e verduras",300001,"RESTAURANTE UNIVERSITÁRIO - NOVA IGUAÇU","RESTAURANTE UNIVERSITÁRIO - NOVA IGUAÇU","RESTAURANTE UNIVERSITÁRIO DO CAMPUS DE NOVA IGUAÇU","2014-08-27","Pregão nº 89/2014 finalizado em 30/07/14. O processo está disponível no Restaurante Universitário do Instituto Multidisciplinar para solicitar empenhos.","CNPJ de empresas vencedoras: 10.988.435/0001-40 ,  14.426.255/0001-25 , 40.326.381/0001-18"]
["08/2014",377,"002394/2014","Aquisição de gêneros alimentícios","Aquisição de gêneros alimentícios",180000,"CTUR","CTUR","DIVISÃO DE ADMINISTRAÇÃO FINANCEIRA","2015-05-11","Pregão nº 81/2014 finalizado em 25/11/14. O processo está disponível no Colégio Técnico da UFRRJ para solicitar empenhos.","CNPJ de empresas vencedoras\n01.220.638/0001-09 , 02.768.278/0001-39 , 16.685.979/0001-19"]
["65/2014",297,"002701/2014","Aquisição de café, açúcar, coador e adoçante","Aquisição de café, açúcar, coador e adoçante",100000,"REITORIA","REITORIA","CLOG","2015-04-06","Pregão nº 88/2014 finalizado em 03/11/14. Já houve empenho (2014NE802417, 2015NE800302) e pagamento (2015OB800319). O processo está disponível na Seção de Sistema de Registro de Preços para solicitar empenhos.","Verificar se houe mais empenhos e pagamentos\n17.389.608/0001-52 , 40.326.381/0001-18\nSISCNE"]
["70/2014",398,"002701/2014","Aquisição de café, açúcar, coador e adoçante","Aquisição de café, açúcar, coador e adoçante",100070,"POSTO MÉDICO","POSTO MÉDICO","CLOG","2015-04-06","Pregão nº 88/2014 finalizado em 03/11/14. Já houve empenho (2014NE802417, 2015NE800302) e pagamento (2015OB800319). O processo está disponível na Seção de Sistema de Registro de Preços para solicitar empenhos.","Verificar se houve mais empenhos e pagamentos 17.389.608/0001-52 , 40.326.381/0001-18"]
["32/2014",136,"002701/2014","Aquisição de café, açúcar, coador e adoçante","Aquisição de café, açúcar, coador e adoçante",100090,"PRAÇA DE DESPORTOS","PRAÇA DE DESPORTOS","CLOG","2015-04-06","Pregão nº 88/2014 finalizado em 03/11/14. Já houve empenho (2014NE802417, 2015NE800302) e pagamento (2015OB800319). O processo está disponível na Seção de Sistema de Registro de Preços para solicitar empenhos.","Verificar se houve mais empenhos e pagamentos 17.389.608/0001-52 , 40.326.381/0001-18"]
["01/2014",375,"002701/2014","Aquisição de café, açúcar, coador e adoçante","Aquisição de café, açúcar, coador e adoçante",100100,"BIBLIOTECA CENTRAL","BIBLIOTECA CENTRAL","CLOG","2015-04-06","Pregão nº 88/2014 finalizado em 03/11/14. Já houve empenho (2014NE802417, 2015NE800302) e pagamento (2015OB800319). O processo está disponível na Seção de Sistema de Registro de Preços para solicitar empenhos.","Verificar se houve mais empenhos e pagamentos 17.389.608/0001-52 , 40.326.381/0001-18"]
["02/2014",363,"002701/2014","Aquisição de café, açúcar, coador e adoçante","Aquisição de café, açúcar, coador e adoçante",100200,"IMPRENSA UNIVERSITÁRIA","IMPRENSA UNIVERSITÁRIA","CLOG","2015-04-06","Pregão nº 88/2014 finalizado em 03/11/14. Já houve empenho (2014NE802417, 2015NE800302) e pagamento (2015OB800319). O processo está disponível na Seção de Sistema de Registro de Preços para solicitar empenhos.","Verificar se houve mais empenhos e pagamentos 17.389.608/0001-52 , 40.326.381/0001-18"]
["01/2014",347,"002701/2014","Aquisição de café, açúcar, coador e adoçante","Aquisição de café, açúcar, coador e adoçante",100300,"PREFEITURA UNIVERSITÁRIA","PREFEITURA","CLOG","2015-04-06","Pregão nº 88/2014 finalizado em 03/11/14. Já houve empenho (2014NE802417, 2015NE800302) e pagamento (2015OB800319). O processo está disponível na Seção de Sistema de Registro de Preços para solicitar empenhos.","Verificar se houve mais empenhos e pagamentos 17.389.608/0001-52 , 40.326.381/0001-18"]
["26/2014",323,"002701/2014","Aquisição de café, açúcar, coador e adoçante","Aquisição de café, açúcar, coador e adoçante",110000,"PRÓ-REITORIA DE ASSUNTOS ADMINISTRATIVOS","PRÓ-REITORIA DE ASSUNTOS ADMINISTRATIVOS","CLOG","2015-04-06","Pregão nº 88/2014 finalizado em 03/11/14. Já houve empenho (2014NE802417, 2015NE800302) e pagamento (2015OB800319). O processo está disponível na Seção de Sistema de Registro de Preços para solicitar empenhos.","Verificar se houve mais empenhos e pagamentos 17.389.608/0001-52 , 40.326.381/0001-18"]
["06/2014",422,"002701/2014","Aquisição de café, açúcar, coador e adoçante","Aquisição de café, açúcar, coador e adoçante",110200,"SEÇÃO DE ARQUIVO E PROTOCOLO GERAL","SEÇÃO DE ARQUIVO E PROTOCOLO GERAL","CLOG","2015-04-06","Pregão nº 88/2014 finalizado em 03/11/14. Já houve empenho (2014NE802417, 2015NE800302) e pagamento (2015OB800319). O processo está disponível na Seção de Sistema de Registro de Preços para solicitar empenhos.","Verificar se houve mais empenhos e pagamentos 17.389.608/0001-52 , 40.326.381/0001-18"]
["102/2014",56,"002701/2014","Aquisição de café, açúcar, coador e adoçante","Aquisição de café, açúcar, coador e adoçante",110300,"DEPARTAMENTO DE PESSOAL","DEPARTAMENTO DE PESSOAL","CLOG","2015-04-06","Pregão nº 88/2014 finalizado em 03/11/14. Já houve empenho (2014NE802417, 2015NE800302) e pagamento (2015OB800319). O processo está disponível na Seção de Sistema de Registro de Preços para solicitar empenhos.","Verificar se houve mais empenhos e pagamentos 17.389.608/0001-52 , 40.326.381/0001-18"]
["02/2014",267,"002701/2014","Aquisição de café, açúcar, coador e adoçante","Aquisição de café, açúcar, coador e adoçante",120200,"DEPARTAMENTO DE MATERIAL E SERVIÇOS AUXILIARES","DEPARTAMENTO DE MATERIAL E SERVIÇOS AUXILIARES","CLOG","2015-04-06","Pregão nº 88/2014 finalizado em 03/11/14. Já houve empenho (2014NE802417, 2015NE800302) e pagamento (2015OB800319). O processo está disponível na Seção de Sistema de Registro de Preços para solicitar empenhos.","Verificar se houve mais empenhos e pagamentos 17.389.608/0001-52 , 40.326.381/0001-18"]
["01/2014",251,"002701/2014","Aquisição de café, açúcar, coador e adoçante","Aquisição de café, açúcar, coador e adoçante",120400,"LAVANDERIA","LAVANDERIA","CLOG","2015-04-06","Pregão nº 88/2014 finalizado em 03/11/14. Já houve empenho (2014NE802417, 2015NE800302) e pagamento (2015OB800319). O processo está disponível na Seção de Sistema de Registro de Preços para solicitar empenhos.","Verificar se houve mais empenhos e pagamentos 17.389.608/0001-52 , 40.326.381/0001-18"]
["01/2014",352,"002701/2014","Aquisição de café, açúcar, coador e adoçante","Aquisição de café, açúcar, coador e adoçante",130000,"PRÓ-REITORIA DE ASSUNTOS ESTUDANTIS","PRÓ-REITORIA DE ASSUNTOS ESTUDANTIS","CLOG","2015-04-06","Pregão nº 88/2014 finalizado em 03/11/14. Já houve empenho (2014NE802417, 2015NE800302) e pagamento (2015OB800319). O processo está disponível na Seção de Sistema de Registro de Preços para solicitar empenhos.","Verificar se houve mais empenhos e pagamentos 17.389.608/0001-52 , 40.326.381/0001-18"]
["03/2014",226,"002701/2014","Aquisição de café, açúcar, coador e adoçante","Aquisição de café, açúcar, coador e adoçante",140000,"PRÓ-REITORIA DE ENSINO E GRADUAÇÃO","PRÓ-REITORIA DE ENSINO E GRADUAÇÃO","CLOG","2015-04-06","Pregão nº 88/2014 finalizado em 03/11/14. Já houve empenho (2014NE802417, 2015NE800302) e pagamento (2015OB800319). O processo está disponível na Seção de Sistema de Registro de Preços para solicitar empenhos.","Verificar se houve mais empenhos e pagamentos 17.389.608/0001-52 , 40.326.381/0001-18"]
["03/2014",242,"002701/2014","Aquisição de café, açúcar, coador e adoçante","Aquisição de café, açúcar, coador e adoçante",140120,"ENGENHARIA FLORESTAL","ENGENHARIA FLORESTAL","CLOG","2015-04-06","Pregão nº 88/2014 finalizado em 03/11/14. Já houve empenho (2014NE802417, 2015NE800302) e pagamento (2015OB800319). O processo está disponível na Seção de Sistema de Registro de Preços para solicitar empenhos.","Verificar se houve mais empenhos e pagamentos 17.389.608/0001-52 , 40.326.381/0001-18"]
["13/2014",450,"002701/2014","Aquisição de café, açúcar, coador e adoçante","Aquisição de café, açúcar, coador e adoçante",150000,"PRÓ-REITORIA DE EXTENSÃO","PRÓ-REITORIA DE EXTENSÃO","CLOG","2015-04-06","Pregão nº 88/2014 finalizado em 03/11/14. Já houve empenho (2014NE802417, 2015NE800302) e pagamento (2015OB800319). O processo está disponível na Seção de Sistema de Registro de Preços para solicitar empenhos.","Verificar se houve mais empenhos e pagamentos 17.389.608/0001-52 , 40.326.381/0001-18"]
["52/2014",236,"002701/2014","Aquisição de café, açúcar, coador e adoçante","Aquisição de café, açúcar, coador e adoçante",150000,"PRÓ-REITORIA DE EXTENSÃO","PRÓ-REITORIA DE EXTENSÃO","CLOG","2015-04-06","Pregão nº 88/2014 finalizado em 03/11/14. Já houve empenho (2014NE802417, 2015NE800302) e pagamento (2015OB800319). O processo está disponível na Seção de Sistema de Registro de Preços para solicitar empenhos.","Verificar se houve mais empenhos e pagamentos 17.389.608/0001-52 , 40.326.381/0001-18"]
["02/2014",344,"002701/2014","Aquisição de café, açúcar, coador e adoçante","Aquisição de café, açúcar, coador e adoçante",160000,"PRÓ-REITORIA DE PESQUISA E PÓS GRADUAÇÃO","PRÓ-REITORIA DE PESQUISA E PÓS GRADUAÇÃO","CLOG","2015-04-06","Pregão nº 88/2014 finalizado em 03/11/14. Já houve empenho (2014NE802417, 2015NE800302) e pagamento (2015OB800319). O processo está disponível na Seção de Sistema de Registro de Preços para solicitar empenhos.","Verificar se houve mais empenhos e pagamentos 17.389.608/0001-52 , 40.326.381/0001-18"]
["70/2014","S/Nº","002701/2014","Aquisição de café, açúcar, coador e adoçante","Aquisição de café, açúcar, coador e adoçante",160010,"EDITORA UNIVERSIDADE RURAL","EDITORA UNIVERSIDADE RURAL","CLOG","2015-04-06","Pregão nº 88/2014 finalizado em 03/11/14. Já houve empenho (2014NE802417, 2015NE800302) e pagamento (2015OB800319). O processo está disponível na Seção de Sistema de Registro de Preços para solicitar empenhos.","Verificar se houve mais empenhos e pagamentos 17.389.608/0001-52 , 40.326.381/0001-18"]
["09/2014",186,"002701/2014","Aquisição de café, açúcar, coador e adoçante","Aquisição de café, açúcar, coador e adoçante",160010,"EDITORA UNIVERSIDADE RURAL","EDITORA UNIVERSIDADE RURAL","CLOG","2015-04-06","Pregão nº 88/2014 finalizado em 03/11/14. Já houve empenho (2014NE802417, 2015NE800302) e pagamento (2015OB800319). O processo está disponível na Seção de Sistema de Registro de Preços para solicitar empenhos.","Verificar se houve mais empenhos e pagamentos 17.389.608/0001-52 , 40.326.381/0001-18"]
["03/2014",388,"002701/2014","Aquisição de café, açúcar, coador e adoçante","Aquisição de café, açúcar, coador e adoçante",170000,"CAIC","CAIC","CLOG","2015-04-06","Pregão nº 88/2014 finalizado em 03/11/14. Já houve empenho (2014NE802417, 2015NE800302) e pagamento (2015OB800319). O processo está disponível na Seção de Sistema de Registro de Preços para solicitar empenhos.","Verificar se houve mais empenhos e pagamentos 17.389.608/0001-52 , 40.326.381/0001-18"]
["02/2014",277,"002701/2014","Aquisição de café, açúcar, coador e adoçante","Aquisição de café, açúcar, coador e adoçante",180000,"CTUR","CTUR","CLOG","2015-04-06","Pregão nº 88/2014 finalizado em 03/11/14. Já houve empenho (2014NE802417, 2015NE800302) e pagamento (2015OB800319). O processo está disponível na Seção de Sistema de Registro de Preços para solicitar empenhos.","Verificar se houve mais empenhos e pagamentos 17.389.608/0001-52 , 40.326.381/0001-18"]
["02/2014",244,"002701/2014","Aquisição de café, açúcar, coador e adoçante","Aquisição de café, açúcar, coador e adoçante",190000,"CAMPUS DR. LEONEL MIRANDA","CAMPUS DR. LEONEL MIRANDA","CLOG","2015-04-06","Pregão nº 88/2014 finalizado em 03/11/14. Já houve empenho (2014NE802417, 2015NE800302) e pagamento (2015OB800319). O processo está disponível na Seção de Sistema de Registro de Preços para solicitar empenhos.","Verificar se houve mais empenhos e pagamentos 17.389.608/0001-52 , 40.326.381/0001-18"]
["01/2014",302,"002701/2014","Aquisição de café, açúcar, coador e adoçante","Aquisição de café, açúcar, coador e adoçante",210000,"INSTITUTO DE AGRONOMIA","INSTITUTO DE AGRONOMIA","CLOG","2015-04-06","Pregão nº 88/2014 finalizado em 03/11/14. Já houve empenho (2014NE802417, 2015NE800302) e pagamento (2015OB800319). O processo está disponível na Seção de Sistema de Registro de Preços para solicitar empenhos.","Verificar se houve mais empenhos e pagamentos 17.389.608/0001-52 , 40.326.381/0001-18"]
["22/2014",95,"002701/2014","Aquisição de café, açúcar, coador e adoçante","Aquisição de café, açúcar, coador e adoçante",210100,"DEPARTAMENTO DE FITOTECNIA","DEPARTAMENTO DE FITOTECNIA","CLOG","2015-04-06","Pregão nº 88/2014 finalizado em 03/11/14. Já houve empenho (2014NE802417, 2015NE800302) e pagamento (2015OB800319). O processo está disponível na Seção de Sistema de Registro de Preços para solicitar empenhos.","Verificar se houve mais empenhos e pagamentos 17.389.608/0001-52 , 40.326.381/0001-18"]
["01/2014",333,"002701/2014","Aquisição de café, açúcar, coador e adoçante","Aquisição de café, açúcar, coador e adoçante",210200,"DEPARTAMENTO DE GEOCIÊNCIAS","DEPARTAMENTO DE GEOCIÊNCIAS","CLOG","2015-04-06","Pregão nº 88/2014 finalizado em 03/11/14. Já houve empenho (2014NE802417, 2015NE800302) e pagamento (2015OB800319). O processo está disponível na Seção de Sistema de Registro de Preços para solicitar empenhos.","Verificar se houve mais empenhos e pagamentos 17.389.608/0001-52 , 40.326.381/0001-18"]
["01/2014",275,"002701/2014","Aquisição de café, açúcar, coador e adoçante","Aquisição de café, açúcar, coador e adoçante",220000,"INSTITUTO DE BIOLOGIA","INSTITUTO DE BIOLOGIA","CLOG","2015-04-06","Pregão nº 88/2014 finalizado em 03/11/14. Já houve empenho (2014NE802417, 2015NE800302) e pagamento (2015OB800319). O processo está disponível na Seção de Sistema de Registro de Preços para solicitar empenhos.","Verificar se houve mais empenhos e pagamentos 17.389.608/0001-52 , 40.326.381/0001-18"]
["17/2014",257,"002701/2014","Aquisição de café, açúcar, coador e adoçante","Aquisição de café, açúcar, coador e adoçante",220000,"INSTITUTO DE BIOLOGIA","INSTITUTO DE BIOLOGIA","CLOG","2015-04-06","Pregão nº 88/2014 finalizado em 03/11/14. Já houve empenho (2014NE802417, 2015NE800302) e pagamento (2015OB800319). O processo está disponível na Seção de Sistema de Registro de Preços para solicitar empenhos.","Verificar se houve mais empenhos e pagamentos 17.389.608/0001-52 , 40.326.381/0001-18"]
["01/2014",183,"002701/2014","Aquisição de café, açúcar, coador e adoçante","Aquisição de café, açúcar, coador e adoçante",230100,"DEPARTAMENTO DE FÍSICA","DEPARTAMENTO DE FÍSICA","CLOG","2015-04-06","Pregão nº 88/2014 finalizado em 03/11/14. Já houve empenho (2014NE802417, 2015NE800302) e pagamento (2015OB800319). O processo está disponível na Seção de Sistema de Registro de Preços para solicitar empenhos.","Verificar se houve mais empenhos e pagamentos 17.389.608/0001-52 , 40.326.381/0001-18"]
["63/2014",129,"002701/2014","Aquisição de café, açúcar, coador e adoçante","Aquisição de café, açúcar, coador e adoçante",230300,"DEPARTAMENTO DE QUÍMICA","DEPARTAMENTO DE QUÍMICA","CLOG","2015-04-06","Pregão nº 88/2014 finalizado em 03/11/14. Já houve empenho (2014NE802417, 2015NE800302) e pagamento (2015OB800319). O processo está disponível na Seção de Sistema de Registro de Preços para solicitar empenhos.","Verificar se houve mais empenhos e pagamentos 17.389.608/0001-52 , 40.326.381/0001-18"]
["01/2014","S/Nº","002701/2014","Aquisição de café, açúcar, coador e adoçante","Aquisição de café, açúcar, coador e adoçante",240000,"INSTITUTO DE CIÊNCIAS HUMANAS E SOCIAIS","INSTITUTO DE CIÊNCIAS HUMANAS E SOCIAIS","CLOG","2015-04-06","Pregão nº 88/2014 finalizado em 03/11/14. Já houve empenho (2014NE802417, 2015NE800302) e pagamento (2015OB800319). O processo está disponível na Seção de Sistema de Registro de Preços para solicitar empenhos.","Verificar se houve mais empenhos e pagamentos 17.389.608/0001-52 , 40.326.381/0001-18"]
["05/2014",154,"002701/2014","Aquisição de café, açúcar, coador e adoçante","Aquisição de café, açúcar, coador e adoçante",250000,"INSTITUTO DE EDUCAÇÃO","INSTITUTO DE EDUCAÇÃO","CLOG","2015-04-06","Pregão nº 88/2014 finalizado em 03/11/14. Já houve empenho (2014NE802417, 2015NE800302) e pagamento (2015OB800319). O processo está disponível na Seção de Sistema de Registro de Preços para solicitar empenhos.","Verificar se houve mais empenhos e pagamentos 17.389.608/0001-52 , 40.326.381/0001-18"]
["06/2014",145,"002701/2014","Aquisição de café, açúcar, coador e adoçante","Aquisição de café, açúcar, coador e adoçante",260000,"INSTITUTO DE FLORESTAS","INSTITUTO DE FLORESTAS","CLOG","2015-04-06","Pregão nº 88/2014 finalizado em 03/11/14. Já houve empenho (2014NE802417, 2015NE800302) e pagamento (2015OB800319). O processo está disponível na Seção de Sistema de Registro de Preços para solicitar empenhos.","Verificar se houve mais empenhos e pagamentos 17.389.608/0001-52 , 40.326.381/0001-18"]
["02/2014",285,"002701/2014","Aquisição de café, açúcar, coador e adoçante","Aquisição de café, açúcar, coador e adoçante",260200,"DEPARTAMENTO DE PRODUTOS FLORESTAIS","DEPARTAMENTO DE PRODUTOS FLORESTAIS","CLOG","2015-04-06","Pregão nº 88/2014 finalizado em 03/11/14. Já houve empenho (2014NE802417, 2015NE800302) e pagamento (2015OB800319). O processo está disponível na Seção de Sistema de Registro de Preços para solicitar empenhos.","Verificar se houve mais empenhos e pagamentos 17.389.608/0001-52 , 40.326.381/0001-18"]
["06/2014",217,"002701/2014","Aquisição de café, açúcar, coador e adoçante","Aquisição de café, açúcar, coador e adoçante",270400,"DEPARTAMENTO DE TECNOLOGIA DE ALIMENTOS","DEPARTAMENTO DE TECNOLOGIA DE ALIMENTOS","CLOG","2015-04-06","Pregão nº 88/2014 finalizado em 03/11/14. Já houve empenho (2014NE802417, 2015NE800302) e pagamento (2015OB800319). O processo está disponível na Seção de Sistema de Registro de Preços para solicitar empenhos.","Verificar se houve mais empenhos e pagamentos 17.389.608/0001-52 , 40.326.381/0001-18"]
["22/2014",72,"002701/2014","Aquisição de café, açúcar, coador e adoçante","Aquisição de café, açúcar, coador e adoçante",280000,"INSTITUTO DE VETERINÁRIA","INSTITUTO DE VETERINÁRIA","CLOG","2015-04-06","Pregão nº 88/2014 finalizado em 03/11/14. Já houve empenho (2014NE802417, 2015NE800302) e pagamento (2015OB800319). O processo está disponível na Seção de Sistema de Registro de Preços para solicitar empenhos.","Verificar se houve mais empenhos e pagamentos 17.389.608/0001-52 , 40.326.381/0001-18"]
["01/2014",491,"002701/2014","Aquisição de café, açúcar, coador e adoçante","Aquisição de café, açúcar, coador e adoçante",280010,"HOSPITAL VETERINÁRIO","HOSPITAL VETERINÁRIO","CLOG","2015-04-06","Pregão nº 88/2014 finalizado em 03/11/14. Já houve empenho (2014NE802417, 2015NE800302) e pagamento (2015OB800319). O processo está disponível na Seção de Sistema de Registro de Preços para solicitar empenhos.","Verificar se houve mais empenhos e pagamentos 17.389.608/0001-52 , 40.326.381/0001-18"]
["44/2014",199,"002701/2014","Aquisição de café, açúcar, coador e adoçante","Aquisição de café, açúcar, coador e adoçante",280100,"DEPARTAMENTO DE EPIDEMIOLOGIA E SAÚDE PÚBLICA","DEPARTAMENTO DE EPIDEMIOLOGIA E SAÚDE PÚBLICA","CLOG","2015-04-06","Pregão nº 88/2014 finalizado em 03/11/14. Já houve empenho (2014NE802417, 2015NE800302) e pagamento (2015OB800319). O processo está disponível na Seção de Sistema de Registro de Preços para solicitar empenhos.","Verificar se houve mais empenhos e pagamentos 17.389.608/0001-52 , 40.326.381/0001-18"]
["01/2014",195,"002701/2014","Aquisição de café, açúcar, coador e adoçante","Aquisição de café, açúcar, coador e adoçante",280200,{"$f":"IFERROR(VLOOKUP(F121,$A$994:$B$1311,2,0),\"\")","v":"DEPARTAMENTO DE MEDICINA E CIRURGIA VETERINÁRIA"},"DEPARTAMENTO DE MEDICINA E CIRURGIA VETERINÁRIA","CLOG","2015-04-06","Pregão nº 88/2014 finalizado em 03/11/14. Já houve empenho (2014NE802417, 2015NE800302) e pagamento (2015OB800319). O processo está disponível na Seção de Sistema de Registro de Preços para solicitar empenhos.","Verificar se houve mais empenhos e pagamentos 17.389.608/0001-52 , 40.326.381/0001-18"]
["01/2014",368,"002701/2014","Aquisição de café, açúcar, coador e adoçante","Aquisição de café, açúcar, coador e adoçante",280400,"DEPARTAMENTO DE PARASITOLOGIA ANIMAL","DEPARTAMENTO DE PARASITOLOGIA ANIMAL","CLOG","2015-04-06","Pregão nº 88/2014 finalizado em 03/11/14. Já houve empenho (2014NE802417, 2015NE800302) e pagamento (2015OB800319). O processo está disponível na Seção de Sistema de Registro de Preços para solicitar empenhos.","Verificar se houve mais empenhos e pagamentos 17.389.608/0001-52 , 40.326.381/0001-18"]
["15/2014",327,"002701/2014","Aquisição de café, açúcar, coador e adoçante","Aquisição de café, açúcar, coador e adoçante",290000,"INSTITUTO DE ZOOTECNIA","INSTITUTO DE ZOOTECNIA","CLOG","2015-04-06","Pregão nº 88/2014 finalizado em 03/11/14. Já houve empenho (2014NE802417, 2015NE800302) e pagamento (2015OB800319). O processo está disponível na Seção de Sistema de Registro de Preços para solicitar empenhos.","Verificar se houve mais empenhos e pagamentos 17.389.608/0001-52 , 40.326.381/0001-18"]
["16/2014",328,"002701/2014","Aquisição de café, açúcar, coador e adoçante","Aquisição de café, açúcar, coador e adoçante",290000,"INSTITUTO DE ZOOTECNIA","INSTITUTO DE ZOOTECNIA","CLOG","2015-04-06","Pregão nº 88/2014 finalizado em 03/11/14. Já houve empenho (2014NE802417, 2015NE800302) e pagamento (2015OB800319). O processo está disponível na Seção de Sistema de Registro de Preços para solicitar empenhos.","Verificar se houve mais empenhos e pagamentos 17.389.608/0001-52 , 40.326.381/0001-18"]
["02/2014",165,"002701/2014","Aquisição de café, açúcar, coador e adoçante","Aquisição de café, açúcar, coador e adoçante",290000,"INSTITUTO DE ZOOTECNIA","INSTITUTO DE ZOOTECNIA","CLOG","2015-04-06","Pregão nº 88/2014 finalizado em 03/11/14. Já houve empenho (2014NE802417, 2015NE800302) e pagamento (2015OB800319). O processo está disponível na Seção de Sistema de Registro de Preços para solicitar empenhos.","Verificar se houve mais empenhos e pagamentos 17.389.608/0001-52 , 40.326.381/0001-18\nSISCNE"]
["03/2014",166,"002701/2014","Aquisição de café, açúcar, coador e adoçante","Aquisição de café, açúcar, coador e adoçante",290000,"INSTITUTO DE ZOOTECNIA","INSTITUTO DE ZOOTECNIA","CLOG","2015-04-06","Pregão nº 88/2014 finalizado em 03/11/14. Já houve empenho (2014NE802417, 2015NE800302) e pagamento (2015OB800319). O processo está disponível na Seção de Sistema de Registro de Preços para solicitar empenhos.","Verificar se houve mais empenhos e pagamentos 17.389.608/0001-52 , 40.326.381/0001-18\nSISCNE"]
["03/2014",172,"002701/2014","Aquisição de café, açúcar, coador e adoçante","Aquisição de café, açúcar, coador e adoçante",300000,"CAMPUS DA UFRRJ EM NOVA IGUAÇU","CAMPUS DA UFRRJ EM NOVA IGUAÇU","CLOG","2015-04-06","Pregão nº 88/2014 finalizado em 03/11/14. Já houve empenho (2014NE802417, 2015NE800302) e pagamento (2015OB800319). O processo está disponível na Seção de Sistema de Registro de Preços para solicitar empenhos.","Verificar se houve mais empenhos e pagamentos 17.389.608/0001-52 , 40.326.381/0001-18\nSISCNE"]
["06/2014","S/Nº","002701/2014","Aquisição de café, açúcar, coador e adoçante","Aquisição de café, açúcar, coador e adoçante",400000,"CAMPUS DA UFRRJ EM TRÊS RIOS","CAMPUS DA UFRRJ EM TRÊS RIOS","CLOG","2015-04-06","Pregão nº 88/2014 finalizado em 03/11/14. Já houve empenho (2014NE802417, 2015NE800302) e pagamento (2015OB800319). O processo está disponível na Seção de Sistema de Registro de Preços para solicitar empenhos.","Verificar se houve mais empenhos e pagamentos 17.389.608/0001-52 , 40.326.381/0001-18\nSISCNE"]
["02/2014",444,"002701/2014","Aquisição de café, açúcar, coador e adoçante","Aquisição de café, açúcar, coador e adoçante",600000,"INSTITUTO DE CIÊNCIAS SOCIAIS APLICADAS","INSTITUTO DE CIÊNCIAS SOCIAIS APLICADAS","CLOG","2015-04-06","Pregão nº 88/2014 finalizado em 03/11/14. Já houve empenho (2014NE802417, 2015NE800302) e pagamento (2015OB800319). O processo está disponível na Seção de Sistema de Registro de Preços para solicitar empenhos.","Verificar se houve mais empenhos e pagamentos 17.389.608/0001-52 , 40.326.381/0001-18\nSISCNE"]
["61/2014",115,"003178/2014","Aquisição de medicamentos de uso humano","Aquisição de medicamentos de uso humano",100070,"POSTO MÉDICO","POSTO MÉDICO","ANEXADO    23083.002702/2014-64","2015-01-20","Elaboração da minuta de edital (anexado ao 002702/2014).","VERIFICAR O ANDAMENTO DO PREGÃO"]
["02/2014",500,"003182/2014","Aquisição de medicamentos de uso humano",{"$f":"D131","v":"Aquisição de medicamentos de uso humano"},280010,"HOSPITAL VETERINÁRIO","HOSPITAL VETERINÁRIO","SPP","2014-05-20","Pesquisa de preço.","Verificar p q está na pesquisa ainda"]
["68/2014",389,"002699/2014","Aquisição de material de expediente","Aquisição de material de expediente",100000,"REITORIA","REITORIA","DIREÇÃO DMSA","2015-01-26","Verificando a possibilidade de atendimento juntamente com a demanda de 2015.","atualizado 27/03/2015"]
["71/2014",399,"002699/2014","Aquisição de material de expediente","Aquisição de material de expediente",100070,"POSTO MÉDICO","POSTO MÉDICO","DIREÇÃO DMSA","2015-01-26","Verificando a possibilidade de atendimento juntamente com a demanda de 2015.","atualizado 27/03/2015"]
["37/2014",131,"002699/2014","Aquisição de material de expediente","Aquisição de material de expediente",100090,"PRAÇA DE DESPORTOS","PRAÇA DE DESPORTOS","DIREÇÃO DMSA","2015-01-26","Verificando a possibilidade de atendimento juntamente com a demanda de 2015.","atualizado 27/03/2015"]
["02/2014",374,"002699/2014","Aquisição de material de expediente","Aquisição de material de expediente",100100,"BIBLIOTECA CENTRAL","BIBLIOTECA CENTRAL","DIREÇÃO DMSA","2015-01-26","Verificando a possibilidade de atendimento juntamente com a demanda de 2015.","atualizado 27/03/2015"]
["27/2014",322,"002699/2014","Aquisição de material de expediente","Aquisição de material de expediente",110000,"PRÓ-REITORIA DE ASSUNTOS ADMINISTRATIVOS","PRÓ-REITORIA DE ASSUNTOS ADMINISTRATIVOS","DIREÇÃO DMSA","2015-01-26","Verificando a possibilidade de atendimento juntamente com a demanda de 2015.","atualizado 27/03/2015"]
["101/2014",575,"002699/2014","Aquisição de material de expediente","Aquisição de material de expediente",110300,"DEPARTAMENTO DE PESSOAL","DEPARTAMENTO DE PESSOAL","DIREÇÃO DMSA","2015-01-26","Verificando a possibilidade de atendimento juntamente com a demanda de 2015.","atualizado 27/03/2015"]
["03/2014",268,"002699/2014","Aquisição de material de expediente","Aquisição de material de expediente",120200,"DEPARTAMENTO DE MATERIAL E SERVIÇOS AUXILIARES","DEPARTAMENTO DE MATERIAL E SERVIÇOS AUXILIARES","DIREÇÃO DMSA","2015-01-26","Verificando a possibilidade de atendimento juntamente com a demanda de 2015.","atualizado 27/03/2015"]
["02/2014",254,"002699/2014","Aquisição de material de expediente","Aquisição de material de expediente",120400,"LAVANDERIA","LAVANDERIA","DIREÇÃO DMSA","2015-01-26","Verificando a possibilidade de atendimento juntamente com a demanda de 2015.","atualizado 27/03/2015"]
["05/2014",354,"002699/2014","Aquisição de material de expediente","Aquisição de material de expediente",130000,"PRÓ-REITORIA DE ASSUNTOS ESTUDANTIS","PRÓ-REITORIA DE ASSUNTOS ESTUDANTIS","DIREÇÃO DMSA","2015-01-26","Verificando a possibilidade de atendimento juntamente com a demanda de 2015.","atualizado 27/03/2015"]
["01/2014",228,"002699/2014","Aquisição de material de expediente","Aquisição de material de expediente",140000,"PRÓ-REITORIA DE ENSINO E GRADUAÇÃO","PRÓ-REITORIA DE ENSINO E GRADUAÇÃO","DIREÇÃO DMSA","2015-01-26","Verificando a possibilidade de atendimento juntamente com a demanda de 2015.","atualizado 27/03/2015"]
["01/2014",240,"002699/2014","Aquisição de material de expediente","Aquisição de material de expediente",140120,"ENGENHARIA FLORESTAL","ENGENHARIA FLORESTAL","DIREÇÃO DMSA","2015-01-26","Verificando a possibilidade de atendimento juntamente com a demanda de 2015.","atualizado 27/03/2015"]
["74/2014",279,"002699/2014","Aquisição de material de expediente","Aquisição de material de expediente",140132,"MEDICINA VETERINÁRIA","MEDICINA VETERINÁRIA","DIREÇÃO DMSA","2015-01-26","Verificando a possibilidade de atendimento juntamente com a demanda de 2015.","atualizado 27/03/2015"]
["01/2014",278,"002699/2014","Aquisição de material de expediente","Aquisição de material de expediente",140134,"PSICOLOGIA","PSICOLOGIA","DIREÇÃO DMSA","2015-01-26","Verificando a possibilidade de atendimento juntamente com a demanda de 2015.","atualizado 27/03/2015"]
["17/2014",454,"002699/2014","Aquisição de material de expediente","Aquisição de material de expediente",150000,"PRÓ-REITORIA DE EXTENSÃO","PRÓ-REITORIA DE EXTENSÃO","DIREÇÃO DMSA","2015-01-26","Verificando a possibilidade de atendimento juntamente com a demanda de 2015.","atualizado 27/03/2015"]
["50/2014",232,"002699/2014","Aquisição de material de expediente","Aquisição de material de expediente",150000,"PRÓ-REITORIA DE EXTENSÃO","PRÓ-REITORIA DE EXTENSÃO","DIREÇÃO DMSA","2015-01-26","Verificando a possibilidade de atendimento juntamente com a demanda de 2015.","atualizado 27/03/2015"]
["06/2014",342,"002699/2014","Aquisição de material de expediente","Aquisição de material de expediente",160000,"PRÓ-REITORIA DE PESQUISA E PÓS GRADUAÇÃO","PRÓ-REITORIA DE PESQUISA E PÓS GRADUAÇÃO","DIREÇÃO DMSA","2015-01-26","Verificando a possibilidade de atendimento juntamente com a demanda de 2015.","atualizado 27/03/2015"]
["11/2014",187,"002699/2014","Aquisição de material de expediente","Aquisição de material de expediente",160010,"EDITORA UNIVERSIDADE RURAL","EDITORA UNIVERSIDADE RURAL","DIREÇÃO DMSA","2015-01-26","Verificando a possibilidade de atendimento juntamente com a demanda de 2015.","atualizado 27/03/2015"]
["04/2014",389,"002699/2014","Aquisição de material de expediente","Aquisição de material de expediente",170000,"CAIC","CAIC","DIREÇÃO DMSA","2015-01-26","Verificando a possibilidade de atendimento juntamente com a demanda de 2015.","atualizado 27/03/2015"]
["03/2014",276,"002699/2014","Aquisição de material de expediente","Aquisição de material de expediente",180000,"CTUR","CTUR","DIREÇÃO DMSA","2015-01-26","Verificando a possibilidade de atendimento juntamente com a demanda de 2015.","atualizado 27/03/2015"]
["03/2014",246,"002699/2014","Aquisição de material de expediente","Aquisição de material de expediente",190000,"CAMPUS DR. LEONEL MIRANDA","CAMPUS DR. LEONEL MIRANDA","DIREÇÃO DMSA","2015-01-26","Verificando a possibilidade de atendimento juntamente com a demanda de 2015.","atualizado 27/03/2015"]
["05/2014",311,"002699/2014","Aquisição de material de expediente","Aquisição de material de expediente",210000,"INSTITUTO DE AGRONOMIA","INSTITUTO DE AGRONOMIA","DIREÇÃO DMSA","2015-01-26","Verificando a possibilidade de atendimento juntamente com a demanda de 2015.","atualizado 27/03/2015"]
["23/2014",96,"002699/2014","Aquisição de material de expediente","Aquisição de material de expediente",210100,"DEPARTAMENTO DE FITOTECNIA","DEPARTAMENTO DE FITOTECNIA","DIREÇÃO DMSA","2015-01-26","Verificando a possibilidade de atendimento juntamente com a demanda de 2015.","atualizado 27/03/2015"]
["03/2014",357,"002699/2014","Aquisição de material de expediente","Aquisição de material de expediente",210200,"DEPARTAMENTO DE GEOCIÊNCIAS","DEPARTAMENTO DE GEOCIÊNCIAS","DIREÇÃO DMSA","2015-01-26","Verificando a possibilidade de atendimento juntamente com a demanda de 2015.","atualizado 27/03/2015"]
["18/2014",274,"002699/2014","Aquisição de material de expediente","Aquisição de material de expediente",220000,"INSTITUTO DE BIOLOGIA","INSTITUTO DE BIOLOGIA","DIREÇÃO DMSA","2015-01-26","Verificando a possibilidade de atendimento juntamente com a demanda de 2015.","atualizado 27/03/2015"]
["01/2014",120,"002699/2014","Aquisição de material de expediente","Aquisição de material de expediente",220100,"DEPARTAMENTO DE BIOLOGIA ANIMAL","DEPARTAMENTO DE BIOLOGIA ANIMAL","DIREÇÃO DMSA","2015-01-26","Verificando a possibilidade de atendimento juntamente com a demanda de 2015.","atualizado 27/03/2015"]
["06/2014",243,"002699/2014","Aquisição de material de expediente","Aquisição de material de expediente",220300,"DEPARTAMENTO DE CIÊNCIAS FISIOLÓGICAS","DEPARTAMENTO DE CIÊNCIAS FISIOLÓGICAS","DIREÇÃO DMSA","2015-01-26","Verificando a possibilidade de atendimento juntamente com a demanda de 2015.","atualizado 27/03/2015"]
["01/2014",71,"002699/2014","Aquisição de material de expediente","Aquisição de material de expediente",220410,"LABORATÓRIO OFICIAL DE DIAGNÓSTICO FITOSSANITÁRIO","LABORATÓRIO OFICIAL DE DIAGNÓSTICO FITOSSANITÁRIO","DIREÇÃO DMSA","2015-01-26","Verificando a possibilidade de atendimento juntamente com a demanda de 2015.","atualizado 27/03/2015"]
["02/2014",152,"002699/2014","Aquisição de material de expediente","Aquisição de material de expediente",230100,"DEPARTAMENTO DE FÍSICA","DEPARTAMENTO DE FÍSICA","DIREÇÃO DMSA","2015-01-26","Verificando a possibilidade de atendimento juntamente com a demanda de 2015.","atualizado 27/03/2015"]
["69/2014",125,"002699/2014","Aquisição de material de expediente","Aquisição de material de expediente",230300,"DEPARTAMENTO DE QUÍMICA","DEPARTAMENTO DE QUÍMICA","DIREÇÃO DMSA","2015-01-26","Verificando a possibilidade de atendimento juntamente com a demanda de 2015.","atualizado 27/03/2015"]
["02/2014",115,"002699/2014","Aquisição de material de expediente","Aquisição de material de expediente",240000,"INSTITUTO DE CIÊNCIAS HUMANAS E SOCIAIS","INSTITUTO DE CIÊNCIAS HUMANAS E SOCIAIS","DIREÇÃO DMSA","2015-01-26","Verificando a possibilidade de atendimento juntamente com a demanda de 2015.","atualizado 27/03/2015"]
["02/2014",151,"002699/2014","Aquisição de material de expediente","Aquisição de material de expediente",250000,"INSTITUTO DE EDUCAÇÃO","INSTITUTO DE EDUCAÇÃO","DIREÇÃO DMSA","2015-01-26","Verificando a possibilidade de atendimento juntamente com a demanda de 2015.","atualizado 27/03/2015"]
["01/2014",319,"002699/2014","Aquisição de material de expediente","Aquisição de material de expediente",250020,"LICENCIATURA EM EDUCAÇÃO DO CAMPO - PROCAMPO","LICENCIATURA EM EDUCAÇÃO DO CAMPO - PROCAMPO","DIREÇÃO DMSA","2015-01-26","Verificando a possibilidade de atendimento juntamente com a demanda de 2015.","atualizado 27/03/2015"]
["01/2014",314,"002699/2014","Aquisição de material de expediente","Aquisição de material de expediente",260000,"INSTITUTO DE FLORESTAS","INSTITUTO DE FLORESTAS","DIREÇÃO DMSA","2015-01-26","Verificando a possibilidade de atendimento juntamente com a demanda de 2015.","atualizado 27/03/2015"]
["07/2014",146,"002699/2014","Aquisição de material de expediente","Aquisição de material de expediente",260000,"INSTITUTO DE FLORESTAS","INSTITUTO DE FLORESTAS","DIREÇÃO DMSA","2015-01-26","Verificando a possibilidade de atendimento juntamente com a demanda de 2015.","atualizado 27/03/2015"]
["03/2014",286,"002699/2014","Aquisição de material de expediente","Aquisição de material de expediente",260200,"DEPARTAMENTO DE PRODUTOS FLORESTAIS","DEPARTAMENTO DE PRODUTOS FLORESTAIS","DIREÇÃO DMSA","2015-01-26","Verificando a possibilidade de atendimento juntamente com a demanda de 2015.","atualizado 27/03/2015"]
["01/2014",424,"002699/2014","Aquisição de material de expediente","Aquisição de material de expediente",270000,"INSTITUTO DE TECNOLOGIA","INSTITUTO DE TECNOLOGIA","DIREÇÃO DMSA","2015-01-26","Verificando a possibilidade de atendimento juntamente com a demanda de 2015.","atualizado 27/03/2015"]
["03/2014",220,"002699/2014","Aquisição de material de expediente","Aquisição de material de expediente",270400,"DEPARTAMENTO DE TECNOLOGIA DE ALIMENTOS","DEPARTAMENTO DE TECNOLOGIA DE ALIMENTOS","DIREÇÃO DMSA","2015-01-26","Verificando a possibilidade de atendimento juntamente com a demanda de 2015.","atualizado 27/03/2015"]
["25/2014",75,"002699/2014","Aquisição de material de expediente","Aquisição de material de expediente",280000,"INSTITUTO DE VETERINÁRIA","INSTITUTO DE VETERINÁRIA","DIREÇÃO DMSA","2015-01-26","Verificando a possibilidade de atendimento juntamente com a demanda de 2015.","atualizado 27/03/2015"]
["03/2014",490,"002699/2014","Aquisição de material de expediente","Aquisição de material de expediente",280010,"HOSPITAL VETERINÁRIO","HOSPITAL VETERINÁRIO","DIREÇÃO DMSA","2015-01-26","Verificando a possibilidade de atendimento juntamente com a demanda de 2015.","atualizado 27/03/2015"]
["02/2014",194,"002699/2014","Aquisição de material de expediente","Aquisição de material de expediente",280200,"DEPARTAMENTO DE MEDICINA E CIRURGIA VETERINÁRIA","DEPARTAMENTO DE MEDICINA E CIRURGIA VETERINÁRIA","DIREÇÃO DMSA","2015-01-26","Verificando a possibilidade de atendimento juntamente com a demanda de 2015.","atualizado 27/03/2015"]
["02/2014",103,"002699/2014","Aquisição de material de expediente","Aquisição de material de expediente",280300,"DEPTO DE MICROBIOLOGIA E IMUNOLOGIA VETERINÁRIA","DEPTO DE MICROBIOLOGIA E IMUNOLOGIA VETERINÁRIA","DIREÇÃO DMSA","2015-01-26","Verificando a possibilidade de atendimento juntamente com a demanda de 2015.","atualizado 27/03/2015"]
["06/2014",169,"002699/2014","Aquisição de material de expediente","Aquisição de material de expediente",290000,"INSTITUTO DE ZOOTECNIA","INSTITUTO DE ZOOTECNIA","DIREÇÃO DMSA","2015-01-26","Verificando a possibilidade de atendimento juntamente com a demanda de 2015.","atualizado 27/03/2015"]
["19/2014",331,"002699/2014","Aquisição de material de expediente","Aquisição de material de expediente",290000,"INSTITUTO DE ZOOTECNIA","INSTITUTO DE ZOOTECNIA","DIREÇÃO DMSA","2015-01-26","Verificando a possibilidade de atendimento juntamente com a demanda de 2015.","atualizado 27/03/2015"]
["22/2014",163,"002699/2014","Aquisição de material de expediente","Aquisição de material de expediente",290000,"INSTITUTO DE ZOOTECNIA","INSTITUTO DE ZOOTECNIA","DIREÇÃO DMSA","2015-01-26","Verificando a possibilidade de atendimento juntamente com a demanda de 2015.","atualizado 27/03/2015"]
["01/2014",175,"002699/2014","Aquisição de material de expediente","Aquisição de material de expediente",300000,"CAMPUS DA UFRRJ EM NOVA IGUAÇU","CAMPUS DA UFRRJ EM NOVA IGUAÇU","DIREÇÃO DMSA","2015-01-26","Verificando a possibilidade de atendimento juntamente com a demanda de 2015.","atualizado 27/03/2015"]
["04/2014",113,"002699/2014","Aquisição de material de expediente","Aquisição de material de expediente",300001,"RESTAURANTE UNIVERSITÁRIO - NOVA IGUAÇU","RESTAURANTE UNIVERSITÁRIO - NOVA IGUAÇU","DIREÇÃO DMSA","2015-01-26","Verificando a possibilidade de atendimento juntamente com a demanda de 2015.","atualizado 27/03/2015"]
["02/2014",484,"002699/2014","Aquisição de material de expediente","Aquisição de material de expediente",400000,"CAMPUS DA UFRRJ EM TRÊS RIOS","CAMPUS DA UFRRJ EM TRÊS RIOS","DIREÇÃO DMSA","2015-01-26","Verificando a possibilidade de atendimento juntamente com a demanda de 2015.","atualizado 27/03/2015"]
["04/2014",445,"002699/2014","Aquisição de material de expediente","Aquisição de material de expediente",600000,"INSTITUTO DE CIÊNCIAS SOCIAIS APLICADAS","INSTITUTO DE CIÊNCIAS SOCIAIS APLICADAS","DIREÇÃO DMSA","2015-01-26","Verificando a possibilidade de atendimento juntamente com a demanda de 2015.","atualizado 27/03/2015"]
["36/2014",132,"002703/2014","Aquisição de material de artes gráficas e desenho","Aquisição de material de artes gráficas e desenho",100090,"PRAÇA DE DESPORTOS","PRAÇA DE DESPORTOS","SSRP","2015-03-27","Será atendido junto com a Demanda de 2015 - equipe do projeto","atualizado 30/03/2015"]
["03/2014",373,"002703/2014","Aquisição de material de artes gráficas e desenho","Aquisição de material de artes gráficas e desenho",100100,"BIBLIOTECA CENTRAL","BIBLIOTECA CENTRAL","SSRP","2015-03-27","Será atendido junto com a Demanda de 2015 - equipe do projeto","atualizado 30/03/2015"]
["03/2014","S/Nº","002703/2014","Aquisição de material de artes gráficas e desenho","Aquisição de material de artes gráficas e desenho",100200,"IMPRENSA UNIVERSITÁRIA","IMPRENSA UNIVERSITÁRIA","SSRP","2015-03-27","Será atendido junto com a Demanda de 2015 - equipe do projeto","atualizado 30/03/2015"]
["02/2014",356,"002703/2014","Aquisição de material de artes gráficas e desenho","Aquisição de material de artes gráficas e desenho",130000,"PRÓ-REITORIA DE ASSUNTOS ESTUDANTIS","PRÓ-REITORIA DE ASSUNTOS ESTUDANTIS","SSRP","2015-03-27","Será atendido junto com a Demanda de 2015 - equipe do projeto","atualizado 30/03/2015"]
["05/2014",397,"002703/2014","Aquisição de material de artes gráficas e desenho","Aquisição de material de artes gráficas e desenho",140000,"PRÓ-REITORIA DE ENSINO E GRADUAÇÃO","PRÓ-REITORIA DE ENSINO E GRADUAÇÃO","SSRP","2015-03-27","Será atendido junto com a Demanda de 2015 - equipe do projeto","atualizado 30/03/2015"]
["19/2014",455,"002703/2014","Aquisição de material de artes gráficas e desenho","Aquisição de material de artes gráficas e desenho",150000,{"$f":"IFERROR(VLOOKUP(F185,$A$994:$B$1311,2,0),\"\")","v":"PRÓ-REITORIA DE EXTENSÃO"},"PRÓ-REITORIA DE EXTENSÃO","SSRP","2015-03-27","Será atendido junto com a Demanda de 2015 - equipe do projeto","atualizado 30/03/2015"]
["14/2014",188,"002703/2014","Aquisição de material de artes gráficas e desenho","Aquisição de material de artes gráficas e desenho",160010,"EDITORA UNIVERSIDADE RURAL","EDITORA UNIVERSIDADE RURAL","SSRP","2015-03-27","Será atendido junto com a Demanda de 2015 - equipe do projeto","atualizado 30/03/2015"]
["05/2014",390,"002703/2014","Aquisição de material de artes gráficas e desenho","Aquisição de material de artes gráficas e desenho",170000,"CAIC","CAIC","SSRP","2015-03-27","Será atendido junto com a Demanda de 2015 - equipe do projeto","atualizado 30/03/2015"]
["04/2014",304,"002703/2014","Aquisição de material de artes gráficas e desenho","Aquisição de material de artes gráficas e desenho",210000,"INSTITUTO DE AGRONOMIA","INSTITUTO DE AGRONOMIA","SSRP","2015-03-27","Será atendido junto com a Demanda de 2015 - equipe do projeto","atualizado 30/03/2015"]
["02/2014",121,"002703/2014","Aquisição de material de artes gráficas e desenho","Aquisição de material de artes gráficas e desenho",220100,"DEPARTAMENTO DE BIOLOGIA ANIMAL","DEPARTAMENTO DE BIOLOGIA ANIMAL","SSRP","2015-03-27","Será atendido junto com a Demanda de 2015 - equipe do projeto","atualizado 30/03/2015"]
["02/2014",317,"002703/2014","Aquisição de material de artes gráficas e desenho","Aquisição de material de artes gráficas e desenho",250020,"LICENCIATURA EM EDUCAÇÃO DO CAMPO - PROCAMPO","LICENCIATURA EM EDUCAÇÃO DO CAMPO - PROCAMPO","SSRP","2015-03-27","Será atendido junto com a Demanda de 2015 - equipe do projeto","atualizado 30/03/2015"]
["04/2014",287,"002703/2014","Aquisição de material de artes gráficas e desenho","Aquisição de material de artes gráficas e desenho",260200,"DEPARTAMENTO DE PRODUTOS FLORESTAIS","DEPARTAMENTO DE PRODUTOS FLORESTAIS","SSRP","2015-03-27","Será atendido junto com a Demanda de 2015 - equipe do projeto","atualizado 30/03/2015"]
["05/2014",423,"002703/2014","Aquisição de material de artes gráficas e desenho","Aquisição de material de artes gráficas e desenho",270000,"INSTITUTO DE TECNOLOGIA","INSTITUTO DE TECNOLOGIA","SSRP","2015-03-27","Será atendido junto com a Demanda de 2015 - equipe do projeto","atualizado 30/03/2015"]
["06/2014",196,"002703/2014","Aquisição de material de artes gráficas e desenho","Aquisição de material de artes gráficas e desenho",280200,"DEPARTAMENTO DE MEDICINA E CIRURGIA VETERINÁRIA","DEPARTAMENTO DE MEDICINA E CIRURGIA VETERINÁRIA","SSRP","2015-03-27","Será atendido junto com a Demanda de 2015 - equipe do projeto","atualizado 30/03/2015"]
["03/2014",485,"002703/2014","Aquisição de material de artes gráficas e desenho","Aquisição de material de artes gráficas e desenho",400000,"CAMPUS DA UFRRJ EM TRÊS RIOS","CAMPUS DA UFRRJ EM TRÊS RIOS","SSRP","2015-03-27","Será atendido junto com a Demanda de 2015 - equipe do projeto","atualizado 30/03/2015"]
["67/2014",294,"002704/2014","Aquisição de material de expediente (papel A4, carta, ofício, etc)",{"$f":"D195","v":"Aquisição de material de expediente (papel A4, carta, ofício, etc)"},100000,"REITORIA","SECRETARIA DA REITORIA","CPACS","2015-03-10","Consolidar Pesquisas de Preços","atualizado 30/03/2015"]
["72/2014",400,"002704/2014","Aquisição de material de expediente (papel A4, carta, ofício, etc)","Aquisição de material de expediente (papel A4, carta, ofício, etc)",100070,"POSTO MÉDICO","DIVISÃO DE SAÚDE","CPACS","2015-03-10","Consolidar Pesquisas de Preços","atualizado 30/03/2015"]
["33/2014",135,"002704/2014","Aquisição de material de expediente (papel A4, carta, ofício, etc)","Aquisição de material de expediente (papel A4, carta, ofício, etc)",100090,"PRAÇA DE DESPORTOS","DEPARTAMENTO DE ESPORTES E LAZER","CPACS","2015-03-10","Consolidar Pesquisas de Preços","atualizado 30/03/2015"]
["04/2014",372,"002704/2014","Aquisição de material de expediente (papel A4, carta, ofício, etc)","Aquisição de material de expediente (papel A4, carta, ofício, etc)",100100,"BIBLIOTECA CENTRAL","BIBLIOTECA CENTRAL","CPACS","2015-03-10","Consolidar Pesquisas de Preços","atualizado 30/03/2015"]
["01/2014",362,"002704/2014","Aquisição de material de expediente (papel A4, carta, ofício, etc)","Aquisição de material de expediente (papel A4, carta, ofício, etc)",100200,"IMPRENSA UNIVERSITÁRIA","IMPRENSA UNIVERSITÁRIA","CPACS","2015-03-10","Consolidar Pesquisas de Preços","atualizado 30/03/2015"]
["04/2014",350,"002704/2014","Aquisição de material de expediente (papel A4, carta, ofício, etc)","Aquisição de material de expediente (papel A4, carta, ofício, etc)",100300,"PREFEITURA UNIVERSITÁRIA","SECRETARIA","CPACS","2015-03-10","Consolidar Pesquisas de Preços","atualizado 30/03/2015"]
["01/2014",261,"002704/2014","Aquisição de material de expediente (papel A4, carta, ofício, etc)","Aquisição de material de expediente (papel A4, carta, ofício, etc)",100600,"COORDENADORIA DE PLANEJAMENTO","COORDENADORIA DE PLANEJAMENTO","CPACS","2015-03-10","Consolidar Pesquisas de Preços","atualizado 30/03/2015"]
["28/2014",321,"002704/2014","Aquisição de material de expediente (papel A4, carta, ofício, etc)","Aquisição de material de expediente (papel A4, carta, ofício, etc)",110000,"PRÓ-REITORIA DE ASSUNTOS ADMINISTRATIVOS","DIVISÃO DE CONCURSOS","CPACS","2015-03-10","Consolidar Pesquisas de Preços","atualizado 30/03/2015"]
["04/2014",429,"002704/2014","Aquisição de material de expediente (papel A4, carta, ofício, etc)","Aquisição de material de expediente (papel A4, carta, ofício, etc)",110000,"PRÓ-REITORIA DE ASSUNTOS ADMINISTRATIVOS","SEÇÃO DE ARQUIVO E PROTOCOLO GERAL","CPACS","2015-03-10","Consolidar Pesquisas de Preços","atualizado 30/03/2015"]
["103/2014",58,"002704/2014","Aquisição de material de expediente (papel A4, carta, ofício, etc)","Aquisição de material de expediente (papel A4, carta, ofício, etc)",110300,"DEPARTAMENTO DE PESSOAL","SECRETARIA ADMINISTRATIVA","CPACS","2015-03-10","Consolidar Pesquisas de Preços","atualizado 30/03/2015"]
["03/2014",355,"002704/2014","Aquisição de material de expediente (papel A4, carta, ofício, etc)","Aquisição de material de expediente (papel A4, carta, ofício, etc)",130000,"PRÓ-REITORIA DE ASSUNTOS ESTUDANTIS","SECRETARIA","CPACS","2015-03-10","Consolidar Pesquisas de Preços","atualizado 30/03/2015"]
["02/2014",239,"002704/2014","Aquisição de material de expediente (papel A4, carta, ofício, etc)","Aquisição de material de expediente (papel A4, carta, ofício, etc)",140120,"ENGENHARIA FLORESTAL","COORDENAÇÃO DO CURSO DE ENGENHARIA FLORESTAL","CPACS","2015-03-10","Consolidar Pesquisas de Preços","atualizado 30/03/2015"]
["75/2014",280,"002704/2014","Aquisição de material de expediente (papel A4, carta, ofício, etc)","Aquisição de material de expediente (papel A4, carta, ofício, etc)",140132,"MEDICINA VETERINÁRIA","MEDICINA VETERINÁRIA","CPACS","2015-03-10","Consolidar Pesquisas de Preços","atualizado 30/03/2015"]
["14/2014",451,"002704/2014","Aquisição de material de expediente (papel A4, carta, ofício, etc)","Aquisição de material de expediente (papel A4, carta, ofício, etc)",150000,"PRÓ-REITORIA DE EXTENSÃO","DEPARTAMENTO DE ARTE E CULTURA","CPACS","2015-03-10","Consolidar Pesquisas de Preços","atualizado 30/03/2015"]
["53/2014",233,"002704/2014","Aquisição de material de expediente (papel A4, carta, ofício, etc)","Aquisição de material de expediente (papel A4, carta, ofício, etc)",150000,"PRÓ-REITORIA DE EXTENSÃO","DEPARTAMENTO DE LOGÍSTICA E INFRAESTRUTURA","CPACS","2015-03-10","Consolidar Pesquisas de Preços","atualizado 30/03/2015"]
["12/2014",189,"002704/2014","Aquisição de material de expediente (papel A4, carta, ofício, etc)","Aquisição de material de expediente (papel A4, carta, ofício, etc)",160010,"EDITORA UNIVERSIDADE RURAL","EDITORA UNIVERSIDADE RURAL","CPACS","2015-03-10","Consolidar Pesquisas de Preços","atualizado 30/03/2015"]
["06/2014",391,"002704/2014","Aquisição de material de expediente (papel A4, carta, ofício, etc)","Aquisição de material de expediente (papel A4, carta, ofício, etc)",170000,"CAIC","CAIC","CPACS","2015-03-10","Consolidar Pesquisas de Preços","atualizado 30/03/2015"]
["04/2014",324,"002704/2014","Aquisição de material de expediente (papel A4, carta, ofício, etc)","Aquisição de material de expediente (papel A4, carta, ofício, etc)",180000,"CTUR","CTUR","CPACS","2015-03-10","Consolidar Pesquisas de Preços","atualizado 30/03/2015"]
["03/2014",303,"002704/2014","Aquisição de material de expediente (papel A4, carta, ofício, etc)","Aquisição de material de expediente (papel A4, carta, ofício, etc)",210000,"INSTITUTO DE AGRONOMIA","SECRETARIA ADMINISTRATIVA DO INSTITUTO","CPACS","2015-03-10","Consolidar Pesquisas de Preços","atualizado 30/03/2015"]
["24/2014",97,"002704/2014","Aquisição de material de expediente (papel A4, carta, ofício, etc)","Aquisição de material de expediente (papel A4, carta, ofício, etc)",210100,"DEPARTAMENTO DE FITOTECNIA","DEPARTAMENTO DE FITOTECNIA","CPACS","2015-03-10","Consolidar Pesquisas de Preços","atualizado 30/03/2015"]
["05/2014",360,"002704/2014","Aquisição de material de expediente (papel A4, carta, ofício, etc)","Aquisição de material de expediente (papel A4, carta, ofício, etc)",210200,"DEPARTAMENTO DE GEOCIÊNCIAS","DEPARTAMENTO DE GEOCIÊNCIAS","CPACS","2015-03-10","Consolidar Pesquisas de Preços","atualizado 30/03/2015"]
["07/2014",177,"002704/2014","Aquisição de material de expediente (papel A4, carta, ofício, etc)","Aquisição de material de expediente (papel A4, carta, ofício, etc)",220300,"DEPARTAMENTO DE CIÊNCIAS FISIOLÓGICAS","SECRETARIA","CPACS","2015-03-10","Consolidar Pesquisas de Preços","atualizado 30/03/2015"]
["02/2014",70,"002704/2014","Aquisição de material de expediente (papel A4, carta, ofício, etc)","Aquisição de material de expediente (papel A4, carta, ofício, etc)",220410,"LABORATÓRIO OFICIAL DE DIAGNÓSTICO FITOSSANITÁRIO","LABORATÓRIO OFICIAL DE DIAGNÓSTICO FITOSSANITÁRIO","CPACS","2015-03-10","Consolidar Pesquisas de Preços","atualizado 30/03/2015"]
["03/2014",184,"002704/2014","Aquisição de material de expediente (papel A4, carta, ofício, etc)","Aquisição de material de expediente (papel A4, carta, ofício, etc)",230100,"DEPARTAMENTO DE FÍSICA","DEPARTAMENTO DE FÍSICA","CPACS","2015-03-10","Consolidar Pesquisas de Preços","atualizado 30/03/2015"]
["71/2014",124,"002704/2014","Aquisição de material de expediente (papel A4, carta, ofício, etc)","Aquisição de material de expediente (papel A4, carta, ofício, etc)",230300,"DEPARTAMENTO DE QUÍMICA","DEPARTAMENTO DE QUÍMICA","CPACS","2015-03-10","Consolidar Pesquisas de Preços","atualizado 30/03/2015"]
["03/2014",116,"002704/2014","Aquisição de material de expediente (papel A4, carta, ofício, etc)","Aquisição de material de expediente (papel A4, carta, ofício, etc)",240000,"INSTITUTO DE CIÊNCIAS HUMANAS E SOCIAIS","DIREÇÃO","CPACS","2015-03-10","Consolidar Pesquisas de Preços","atualizado 30/03/2015"]
["03/2014",152,"002704/2014","Aquisição de material de expediente (papel A4, carta, ofício, etc)","Aquisição de material de expediente (papel A4, carta, ofício, etc)",250000,"INSTITUTO DE EDUCAÇÃO","DIREÇÃO","CPACS","2015-03-10","Consolidar Pesquisas de Preços","atualizado 30/03/2015"]
["03/2014",318,"002704/2014","Aquisição de material de expediente (papel A4, carta, ofício, etc)","Aquisição de material de expediente (papel A4, carta, ofício, etc)",250020,"LICENCIATURA EM EDUCAÇÃO DO CAMPO - PROCAMPO","INSTITUTO DE EDUCAÇÃO - DEPARTAMENTO DE TEORIA E PLANEJAMENTO DE ENSINO (DTPE)","CPACS","2015-03-10","Consolidar Pesquisas de Preços","atualizado 30/03/2015"]
["02/2014",315,"002704/2014","Aquisição de material de expediente (papel A4, carta, ofício, etc)","Aquisição de material de expediente (papel A4, carta, ofício, etc)",260000,"INSTITUTO DE FLORESTAS","PPGPDS - PROGRAMA DE PÓS-GRADUAÇÃO EM DESENVOLVIMENTO SUSTENTÁVEL","CPACS","2015-03-10","Consolidar Pesquisas de Preços","atualizado 30/03/2015"]
["08/2014",147,"002704/2014","Aquisição de material de expediente (papel A4, carta, ofício, etc)","Aquisição de material de expediente (papel A4, carta, ofício, etc)",260000,"INSTITUTO DE FLORESTAS","DIRETORIA","CPACS","2015-03-10","Consolidar Pesquisas de Preços","atualizado 30/03/2015"]
["05/2014",288,"002704/2014","Aquisição de material de expediente (papel A4, carta, ofício, etc)","Aquisição de material de expediente (papel A4, carta, ofício, etc)",260200,"DEPARTAMENTO DE PRODUTOS FLORESTAIS","DEPARTAMENTO DE PRODUTOS FLORESTAIS","CPACS","2015-03-10","Consolidar Pesquisas de Preços","atualizado 30/03/2015"]
["02/2014",210,"002704/2014","Aquisição de material de expediente (papel A4, carta, ofício, etc)","Aquisição de material de expediente (papel A4, carta, ofício, etc)",270000,"INSTITUTO DE TECNOLOGIA","DIRETORIA","CPACS","2015-03-10","Consolidar Pesquisas de Preços","atualizado 30/03/2015"]
["04/2014",425,"002704/2014","Aquisição de material de expediente (papel A4, carta, ofício, etc)","Aquisição de material de expediente (papel A4, carta, ofício, etc)",270000,"INSTITUTO DE TECNOLOGIA","DEPARTAMENTO DE ARQUITETURA E URBANISMO","CPACS","2015-03-10","Consolidar Pesquisas de Preços","atualizado 30/03/2015"]
["05/2014",219,"002704/2014","Aquisição de material de expediente (papel A4, carta, ofício, etc)","Aquisição de material de expediente (papel A4, carta, ofício, etc)",270400,"DEPARTAMENTO DE TECNOLOGIA DE ALIMENTOS","DEPARTAMENTOS DE TECNOLOGIA DE ALIMENTOS","CPACS","2015-03-10","Consolidar Pesquisas de Preços","atualizado 30/03/2015"]
["24/2014",74,"002704/2014","Aquisição de material de expediente (papel A4, carta, ofício, etc)","Aquisição de material de expediente (papel A4, carta, ofício, etc)",280000,"INSTITUTO DE VETERINÁRIA","SECRETARIA DA DIRETORIA","CPACS","2015-03-10","Consolidar Pesquisas de Preços","atualizado 30/03/2015"]
["04/2014",489,"002704/2014","Aquisição de material de expediente (papel A4, carta, ofício, etc)","Aquisição de material de expediente (papel A4, carta, ofício, etc)",280010,"HOSPITAL VETERINÁRIO","HOSPITAL VETERINÁRIO","CPACS","2015-03-10","Consolidar Pesquisas de Preços","atualizado 30/03/2015"]
["45/2014",198,"002704/2014","Aquisição de material de expediente (papel A4, carta, ofício, etc)","Aquisição de material de expediente (papel A4, carta, ofício, etc)",280100,"DEPARTAMENTO DE EPIDEMIOLOGIA E SAÚDE PÚBLICA","DEPARTAMENTO DE EPIDEMIOLOGIA E SAÚDE PÚBLICA","CPACS","2015-03-10","Consolidar Pesquisas de Preços","atualizado 30/03/2015"]
["05/2014",334,"002704/2014","Aquisição de material de expediente (papel A4, carta, ofício, etc)","Aquisição de material de expediente (papel A4, carta, ofício, etc)",280200,"DEPARTAMENTO DE MEDICINA E CIRURGIA VETERINÁRIA","DEPARTAMENTO DE MEDICINA E CIRURGIA VETERINÁRIA","CPACS","2015-03-10","Consolidar Pesquisas de Preços","atualizado 30/03/2015"]
["04/2014",101,"002704/2014","Aquisição de material de expediente (papel A4, carta, ofício, etc)","Aquisição de material de expediente (papel A4, carta, ofício, etc)",280300,"DEPTO DE MICROBIOLOGIA E IMUNOLOGIA VETERINÁRIA","DEPARTAMENTO DE MICROBIOLOGIA","CPACS","2015-03-10","Consolidar Pesquisas de Preços","atualizado 30/03/2015"]
["17/2014",329,"002704/2014","Aquisição de material de expediente (papel A4, carta, ofício, etc)","Aquisição de material de expediente (papel A4, carta, ofício, etc)",290000,"INSTITUTO DE ZOOTECNIA","DNAP","CPACS","2015-03-10","Consolidar Pesquisas de Preços","atualizado 30/03/2015"]
["24/2014",159,"002704/2014","Aquisição de material de expediente (papel A4, carta, ofício, etc)","Aquisição de material de expediente (papel A4, carta, ofício, etc)",290000,"INSTITUTO DE ZOOTECNIA","DEPARTAMENTO DE REPRODUÇÃO E AVALIAÇÃO ANIMAL - DRAA","CPACS","2015-03-10","Consolidar Pesquisas de Preços","atualizado 30/03/2015"]
["04/2014",167,"002704/2014","Aquisição de material de expediente (papel A4, carta, ofício, etc)","Aquisição de material de expediente (papel A4, carta, ofício, etc)",290000,"INSTITUTO DE ZOOTECNIA","DIRETORIA DO IZ","CPACS","2015-03-10","Consolidar Pesquisas de Preços","atualizado 30/03/2015"]
["02/2014",173,"002704/2014","Aquisição de material de expediente (papel A4, carta, ofício, etc)","Aquisição de material de expediente (papel A4, carta, ofício, etc)",300000,"CAMPUS DA UFRRJ EM NOVA IGUAÇU","SUPERINTÊNDENCIA DO CAMPUS NOVA IGUAÇU","CPACS","2015-03-10","Consolidar Pesquisas de Preços","atualizado 30/03/2015"]
["05/2014",112,"002704/2014","Aquisição de material de expediente (papel A4, carta, ofício, etc)","Aquisição de material de expediente (papel A4, carta, ofício, etc)",300001,"RESTAURANTE UNIVERSITÁRIO - NOVA IGUAÇU","RESTAURANTE UNIVERSITÁRIO - NOVA IGUAÇU","CPACS","2015-03-10","Consolidar Pesquisas de Preços","atualizado 30/03/2015"]
["01/2014",483,"002704/2014","Aquisição de material de expediente (papel A4, carta, ofício, etc)","Aquisição de material de expediente (papel A4, carta, ofício, etc)",400000,"CAMPUS DA UFRRJ EM TRÊS RIOS","CAMPUS DA UFRRJ EM TRÊS RIOS","CPACS","2015-03-10","Consolidar Pesquisas de Preços","atualizado 30/03/2015"]
["05/2014",446,"002704/2014","Aquisição de material de expediente (papel A4, carta, ofício, etc)","Aquisição de material de expediente (papel A4, carta, ofício, etc)",600000,"INSTITUTO DE CIÊNCIAS SOCIAIS APLICADAS","DIREÇÃO","CPACS","2015-03-10","Consolidar Pesquisas de Preços","atualizado 30/03/2015"]
["05/2014",501,"003188/2014","Aquisição de medicamentos de uso veterinário","Aquisição de medicamentos de uso veterinário",280010,"HOSPITAL VETERINÁRIO","HOSPITAL VETERINÁRIO","SEÇÃO DE CONTROLE","2015-04-30","Pregão nº 142/2014 finalizado em 29/12/14. O processo está disponível na Seção de Sistema de Registro de Preços para solicitar empenhos. ","O Délcio foi nomeado gestor, o processo ficará aqui na sala da SSRP até ele retornar de férias para analisar.\nVerificar se houve mais empenhos e pagamentos\n00.479.418/0001-23 - 07.266.548/0001-27 - 07.296.219/0001-29 - 10.983.202/0001-54 - 13.232.701/0001-06 - 16.630.178/0001-56"]
["07/2014","S/Nº","002705/2014","Aquisição de medicamentos de uso veterinário","Aquisição de medicamentos de uso veterinário",220300,"DEPARTAMENTO DE CIÊNCIAS FISIOLÓGICAS","DEPARTAMENTO DE CIÊNCIAS FISIOLÓGICAS","SPP","2015-03-16","Realizando ajustes após emissão de parecer jurídico.","atualizado 30/03/2015"]
["26/2014","S/Nº","002705/2014","Aquisição de medicamentos de uso veterinário","Aquisição de medicamentos de uso veterinário",290000,"INSTITUTO DE ZOOTECNIA","INSTITUTO DE ZOOTECNIA","SPP","2015-03-16","Realizando ajustes após emissão de parecer jurídico.","atualizado 30/03/2015"]
["69/2014",293,"002707/2014","Aquisição de artigos de copa e cozinha","Aquisição de artigos de copa e cozinha",100000,"REITORIA","REITORIA","SPP","2015-04-29","Verificando a possibilidade de atendimento juntamente com a demanda de 2015.","atualizado 30/03/2015"]
["73/2014",401,"002707/2014","Aquisição de artigos de copa e cozinha","Aquisição de artigos de copa e cozinha",100070,"POSTO MÉDICO","POSTO MÉDICO","SPP","2015-04-29","Verificando a possibilidade de atendimento juntamente com a demanda de 2015.","atualizado 30/03/2015"]
["34/2014",134,"002707/2014","Aquisição de artigos de copa e cozinha","Aquisição de artigos de copa e cozinha",100090,"PRAÇA DE DESPORTOS","PRAÇA DE DESPORTOS","SPP","2015-04-29","Verificando a possibilidade de atendimento juntamente com a demanda de 2015.","atualizado 30/03/2015"]
["06/2014",370,"002707/2014","Aquisição de artigos de copa e cozinha","Aquisição de artigos de copa e cozinha",100100,"BIBLIOTECA CENTRAL","BIBLIOTECA CENTRAL","SPP","2015-04-29","Verificando a possibilidade de atendimento juntamente com a demanda de 2015.","atualizado 30/03/2015"]
["02/2014",348,"002707/2014","Aquisição de artigos de copa e cozinha","Aquisição de artigos de copa e cozinha",100300,"PREFEITURA UNIVERSITÁRIA","PREFEITURA","SPP","2015-04-29","Verificando a possibilidade de atendimento juntamente com a demanda de 2015.","atualizado 30/03/2015"]
["07/2014",421,"002707/2014","Aquisição de artigos de copa e cozinha","Aquisição de artigos de copa e cozinha",110200,{"$f":"IFERROR(VLOOKUP(F249,$A$994:$B$1311,2,0),\"\")","v":"SEÇÃO DE ARQUIVO E PROTOCOLO GERAL"},"SEÇÃO DE ARQUIVO E PROTOCOLO GERAL","SPP","2015-04-29","Verificando a possibilidade de atendimento juntamente com a demanda de 2015.","atualizado 30/03/2015"]
["04/2014",269,"002707/2014","Aquisição de artigos de copa e cozinha","Aquisição de artigos de copa e cozinha",120200,"DEPARTAMENTO DE MATERIAL E SERVIÇOS AUXILIARES","DEPARTAMENTO DE MATERIAL E SERVIÇOS AUXILIARES","SPP","2015-04-29","Verificando a possibilidade de atendimento juntamente com a demanda de 2015.","atualizado 30/03/2015"]
["04/2014",252,"002707/2014","Aquisição de artigos de copa e cozinha","Aquisição de artigos de copa e cozinha",120400,"LAVANDERIA","LAVANDERIA","SPP","2015-04-29","Verificando a possibilidade de atendimento juntamente com a demanda de 2015.","atualizado 30/03/2015"]
["06/2014",351,"002707/2014","Aquisição de artigos de copa e cozinha","Aquisição de artigos de copa e cozinha",130000,"PRÓ-REITORIA DE ASSUNTOS ESTUDANTIS","PRÓ-REITORIA DE ASSUNTOS ESTUDANTIS","SPP","2015-04-29","Verificando a possibilidade de atendimento juntamente com a demanda de 2015.","atualizado 30/03/2015"]
["04/2014",225,"002707/2014","Aquisição de artigos de copa e cozinha","Aquisição de artigos de copa e cozinha",140000,"PRÓ-REITORIA DE ENSINO E GRADUAÇÃO","PRÓ-REITORIA DE ENSINO E GRADUAÇÃO","SPP","2015-04-29","Verificando a possibilidade de atendimento juntamente com a demanda de 2015.","atualizado 30/03/2015"]
["04/2014",241,"002707/2014","Aquisição de artigos de copa e cozinha","Aquisição de artigos de copa e cozinha",140120,"ENGENHARIA FLORESTAL","ENGENHARIA FLORESTAL","SPP","2015-04-29","Verificando a possibilidade de atendimento juntamente com a demanda de 2015.","atualizado 30/03/2015"]
["15/2014",452,"002707/2014","Aquisição de artigos de copa e cozinha","Aquisição de artigos de copa e cozinha",150000,"PRÓ-REITORIA DE EXTENSÃO","PRÓ-REITORIA DE EXTENSÃO","SPP","2015-04-29","Verificando a possibilidade de atendimento juntamente com a demanda de 2015.","atualizado 30/03/2015"]
["54/2014",231,"002707/2014","Aquisição de artigos de copa e cozinha","Aquisição de artigos de copa e cozinha",150000,"PRÓ-REITORIA DE EXTENSÃO","PRÓ-REITORIA DE EXTENSÃO","SPP","2015-04-29","Verificando a possibilidade de atendimento juntamente com a demanda de 2015.","atualizado 30/03/2015"]
["15/2014",190,"002707/2014","Aquisição de artigos de copa e cozinha","Aquisição de artigos de copa e cozinha",160010,"EDITORA UNIVERSIDADE RURAL","EDITORA UNIVERSIDADE RURAL","SPP","2015-04-29","Verificando a possibilidade de atendimento juntamente com a demanda de 2015.","atualizado 30/03/2015"]
["07/2014",392,"002707/2014","Aquisição de artigos de copa e cozinha","Aquisição de artigos de copa e cozinha",170000,"CAIC","CAIC","SPP","2015-04-29","Verificando a possibilidade de atendimento juntamente com a demanda de 2015.","atualizado 30/03/2015"]
["07/2014",299,"002707/2014","Aquisição de artigos de copa e cozinha",{"$f":"D259","v":"Aquisição de artigos de copa e cozinha"},180000,"CTUR","CTUR","SPP","2015-04-29","Verificando a possibilidade de atendimento juntamente com a demanda de 2015.","atualizado 30/03/2015"]
["09/2014",340,"002707/2014","Aquisição de artigos de copa e cozinha","Aquisição de artigos de copa e cozinha",180000,"CTUR","CTUR","SPP","2015-04-29","Verificando a possibilidade de atendimento juntamente com a demanda de 2015.","atualizado 30/03/2015"]
["26/2014",99,"002707/2014","Aquisição de artigos de copa e cozinha","Aquisição de artigos de copa e cozinha",210100,"DEPARTAMENTO DE FITOTECNIA","DEPARTAMENTO DE FITOTECNIA","SPP","2015-04-29","Verificando a possibilidade de atendimento juntamente com a demanda de 2015.","atualizado 30/03/2015"]
["06/2014",359,"002707/2014","Aquisição de artigos de copa e cozinha","Aquisição de artigos de copa e cozinha",210200,"DEPARTAMENTO DE GEOCIÊNCIAS","DEPARTAMENTO DE GEOCIÊNCIAS","SPP","2015-04-29","Verificando a possibilidade de atendimento juntamente com a demanda de 2015.","atualizado 30/03/2015"]
["20/2014",260,"002707/2014","Aquisição de artigos de copa e cozinha","Aquisição de artigos de copa e cozinha",220000,"INSTITUTO DE BIOLOGIA","INSTITUTO DE BIOLOGIA","SPP","2015-04-29","Verificando a possibilidade de atendimento juntamente com a demanda de 2015.","atualizado 30/03/2015"]
["08/2014",178,"002707/2014","Aquisição de artigos de copa e cozinha","Aquisição de artigos de copa e cozinha",220300,"DEPARTAMENTO DE CIÊNCIAS FISIOLÓGICAS","DEPARTAMENTO DE CIÊNCIAS FISIOLÓGICAS","SPP","2015-04-29","Verificando a possibilidade de atendimento juntamente com a demanda de 2015.","atualizado 30/03/2015"]
["03/2014","S/Nº","002707/2014","Aquisição de artigos de copa e cozinha","Aquisição de artigos de copa e cozinha",220410,"LABORATÓRIO OFICIAL DE DIAGNÓSTICO FITOSSANITÁRIO","LABORATÓRIO OFICIAL DE DIAGNÓSTICO FITOSSANITÁRIO","SPP","2015-04-29","Verificando a possibilidade de atendimento juntamente com a demanda de 2015.","atualizado 30/03/2015"]
["67/2014",127,"002707/2014","Aquisição de artigos de copa e cozinha","Aquisição de artigos de copa e cozinha",230000,"INSTITUTO DE CIÊNCIAS EXATAS","INSTITUTO DE CIÊNCIAS EXATAS","SPP","2015-04-29","Verificando a possibilidade de atendimento juntamente com a demanda de 2015.","atualizado 30/03/2015"]
["04/2014",181,"002707/2014","Aquisição de artigos de copa e cozinha","Aquisição de artigos de copa e cozinha",230100,"DEPARTAMENTO DE FÍSICA","DEPARTAMENTO DE FÍSICA","SPP","2015-04-29","Verificando a possibilidade de atendimento juntamente com a demanda de 2015.","atualizado 30/03/2015"]
["04/2014",119,"002707/2014","Aquisição de artigos de copa e cozinha","Aquisição de artigos de copa e cozinha",240000,"INSTITUTO DE CIÊNCIAS HUMANAS E SOCIAIS","INSTITUTO DE CIÊNCIAS HUMANAS E SOCIAIS","SPP","2015-04-29","Verificando a possibilidade de atendimento juntamente com a demanda de 2015.","atualizado 30/03/2015"]
["04/2014",153,"002707/2014","Aquisição de artigos de copa e cozinha","Aquisição de artigos de copa e cozinha",250000,"INSTITUTO DE EDUCAÇÃO","INSTITUTO DE EDUCAÇÃO","SPP","2015-04-29","Verificando a possibilidade de atendimento juntamente com a demanda de 2015.","atualizado 30/03/2015"]
["04/2014",313,"002707/2014","Aquisição de artigos de copa e cozinha","Aquisição de artigos de copa e cozinha",260000,"INSTITUTO DE FLORESTAS","INSTITUTO DE FLORESTAS","SPP","2015-04-29","Verificando a possibilidade de atendimento juntamente com a demanda de 2015.","atualizado 30/03/2015"]
["09/2014",148,"002707/2014","Aquisição de artigos de copa e cozinha","Aquisição de artigos de copa e cozinha",260000,"INSTITUTO DE FLORESTAS","INSTITUTO DE FLORESTAS","SPP","2015-04-29","Verificando a possibilidade de atendimento juntamente com a demanda de 2015.","atualizado 30/03/2015"]
["06/2014",289,"002707/2014","Aquisição de artigos de copa e cozinha","Aquisição de artigos de copa e cozinha",260200,"DEPARTAMENTO DE PRODUTOS FLORESTAIS","DEPARTAMENTO DE PRODUTOS FLORESTAIS","SPP","2015-04-29","Verificando a possibilidade de atendimento juntamente com a demanda de 2015.","atualizado 30/03/2015"]
["03/2014",427,"002707/2014","Aquisição de artigos de copa e cozinha","Aquisição de artigos de copa e cozinha",270000,"INSTITUTO DE TECNOLOGIA","INSTITUTO DE TECNOLOGIA","SPP","2015-04-29","Verificando a possibilidade de atendimento juntamente com a demanda de 2015.","atualizado 30/03/2015"]
["03/2014",209,"002707/2014","Aquisição de artigos de copa e cozinha","Aquisição de artigos de copa e cozinha",270000,"INSTITUTO DE TECNOLOGIA","INSTITUTO DE TECNOLOGIA","SPP","2015-04-29","Verificando a possibilidade de atendimento juntamente com a demanda de 2015.","atualizado 30/03/2015"]
["26/2014",76,"002707/2014","Aquisição de artigos de copa e cozinha","Aquisição de artigos de copa e cozinha",280000,"INSTITUTO DE VETERINÁRIA","INSTITUTO DE VETERINÁRIA","SPP","2015-04-29","Verificando a possibilidade de atendimento juntamente com a demanda de 2015.","atualizado 30/03/2015"]
["46/2014",200,"002707/2014","Aquisição de artigos de copa e cozinha","Aquisição de artigos de copa e cozinha",280100,"DEPARTAMENTO DE EPIDEMIOLOGIA E SAÚDE PÚBLICA","DEPARTAMENTO DE EPIDEMIOLOGIA E SAÚDE PÚBLICA","SPP","2015-04-29","Verificando a possibilidade de atendimento juntamente com a demanda de 2015.","atualizado 30/03/2015"]
["02/2014",367,"002707/2014","Aquisição de artigos de copa e cozinha","Aquisição de artigos de copa e cozinha",280400,"DEPARTAMENTO DE PARASITOLOGIA ANIMAL","DEPARTAMENTO DE PARASITOLOGIA ANIMAL","SPP","2015-04-29","Verificando a possibilidade de atendimento juntamente com a demanda de 2015.","atualizado 30/03/2015"]
["21/2014",332,"002707/2014","Aquisição de artigos de copa e cozinha","Aquisição de artigos de copa e cozinha",290000,"INSTITUTO DE ZOOTECNIA","INSTITUTO DE ZOOTECNIA","SPP","2015-04-29","Verificando a possibilidade de atendimento juntamente com a demanda de 2015.","atualizado 30/03/2015"]
["25/2014",158,"002707/2014","Aquisição de artigos de copa e cozinha","Aquisição de artigos de copa e cozinha",290000,"INSTITUTO DE ZOOTECNIA","INSTITUTO DE ZOOTECNIA","SPP","2015-04-29","Verificando a possibilidade de atendimento juntamente com a demanda de 2015.","atualizado 30/03/2015"]
["07/2014",170,"002707/2014","Aquisição de artigos de copa e cozinha","Aquisição de artigos de copa e cozinha",290000,"INSTITUTO DE ZOOTECNIA","INSTITUTO DE ZOOTECNIA","SPP","2015-04-29","Verificando a possibilidade de atendimento juntamente com a demanda de 2015.","atualizado 30/03/2015"]
["01/2014",176,"002707/2014","Aquisição de artigos de copa e cozinha","Aquisição de artigos de copa e cozinha",300000,"CAMPUS DA UFRRJ EM NOVA IGUAÇU","CAMPUS DA UFRRJ EM NOVA IGUAÇU","SPP","2015-04-29","Verificando a possibilidade de atendimento juntamente com a demanda de 2015.","atualizado 30/03/2015"]
["07/2014",416,"002707/2014","Aquisição de artigos de copa e cozinha","Aquisição de artigos de copa e cozinha",300000,"CAMPUS DA UFRRJ EM NOVA IGUAÇU","CAMPUS DA UFRRJ EM NOVA IGUAÇU","SPP","2015-04-29","Verificando a possibilidade de atendimento juntamente com a demanda de 2015.","atualizado 30/03/2015"]
["04/2014",486,"002707/2014","Aquisição de artigos de copa e cozinha","Aquisição de artigos de copa e cozinha",400000,"CAMPUS DA UFRRJ EM TRÊS RIOS","CAMPUS DA UFRRJ EM TRÊS RIOS","SPP","2015-04-29","Verificando a possibilidade de atendimento juntamente com a demanda de 2015.","atualizado 30/03/2015"]
["03/2014",442,"002707/2014","Aquisição de artigos de copa e cozinha","Aquisição de artigos de copa e cozinha",600000,"INSTITUTO DE CIÊNCIAS SOCIAIS APLICADAS","INSTITUTO DE CIÊNCIAS SOCIAIS APLICADAS","SPP","2015-04-29","Verificando a possibilidade de atendimento juntamente com a demanda de 2015.","atualizado 30/03/2015"]
["66/2014",295,"002706/2014","Aquisição de artigos de higiene e conservação","Aquisição de artigos de higiene e conservação",100000,"REITORIA","SECRETARIA DA REITORIA","SPP","2015-04-29","Verificando a possibilidade de atendimento juntamente com a demanda de 2015.","atualizado 30/03/2015"]
["74/2014",402,"002706/2014","Aquisição de artigos de higiene e conservação","Aquisição de artigos de higiene e conservação",100070,"POSTO MÉDICO","DIVISÃO DE SAÚDE","SPP","2015-04-29","Verificando a possibilidade de atendimento juntamente com a demanda de 2015.","atualizado 30/03/2015"]
["35/2014",133,"002706/2014","Aquisição de artigos de higiene e conservação","Aquisição de artigos de higiene e conservação",100090,"PRAÇA DE DESPORTOS","DEPARTAMENTO DE ESPORTES E LAZER","SPP","2015-04-29","Verificando a possibilidade de atendimento juntamente com a demanda de 2015.","atualizado 30/03/2015"]
["05/2014",371,"002706/2014","Aquisição de artigos de higiene e conservação","Aquisição de artigos de higiene e conservação",100100,"BIBLIOTECA CENTRAL","BIBLIOTECA CENTRAL","SPP","2015-04-29","Verificando a possibilidade de atendimento juntamente com a demanda de 2015.","atualizado 30/03/2015"]
["04/2014",565,"002706/2014","Aquisição de artigos de higiene e conservação","Aquisição de artigos de higiene e conservação",100200,"IMPRENSA UNIVERSITÁRIA","IMPRENSA UNIVERSITÁRIA","SPP","2015-04-29","Verificando a possibilidade de atendimento juntamente com a demanda de 2015.","atualizado 30/03/2015"]
["03/2014",349,"002706/2014","Aquisição de artigos de higiene e conservação","Aquisição de artigos de higiene e conservação",100300,"PREFEITURA UNIVERSITÁRIA","SECRETARIA","SPP","2015-04-29","Verificando a possibilidade de atendimento juntamente com a demanda de 2015.","atualizado 30/03/2015"]
["29/2014",320,"002706/2014","Aquisição de artigos de higiene e conservação","Aquisição de artigos de higiene e conservação",110000,"PRÓ-REITORIA DE ASSUNTOS ADMINISTRATIVOS","DIVISÃO DE CONCURSOS","SPP","2015-04-29","Verificando a possibilidade de atendimento juntamente com a demanda de 2015.","atualizado 30/03/2015"]
["104/2014",55,"002706/2014","Aquisição de artigos de higiene e conservação","Aquisição de artigos de higiene e conservação",110300,"DEPARTAMENTO DE PESSOAL","SECRETARIA DO DEPARTAMENTO DE PESSOAL","SPP","2015-04-29","Verificando a possibilidade de atendimento juntamente com a demanda de 2015.","atualizado 30/03/2015"]
["05/2014",270,"002706/2014","Aquisição de artigos de higiene e conservação","Aquisição de artigos de higiene e conservação",120200,"DEPARTAMENTO DE MATERIAL E SERVIÇOS AUXILIARES","SEÇÃO DE CONTROLE / ALMOXARIFADO CENTRAL / SETOR DE COBRANÇAS","SPP","2015-04-29","Verificando a possibilidade de atendimento juntamente com a demanda de 2015.","atualizado 30/03/2015"]
["03/2014",253,"002706/2014","Aquisição de artigos de higiene e conservação","Aquisição de artigos de higiene e conservação",120400,"LAVANDERIA","LAVANDERIA","SPP","2015-04-29","Verificando a possibilidade de atendimento juntamente com a demanda de 2015.","atualizado 30/03/2015"]
["04/2014",353,"002706/2014","Aquisição de artigos de higiene e conservação","Aquisição de artigos de higiene e conservação",130000,"PRÓ-REITORIA DE ASSUNTOS ESTUDANTIS","SECRETARIA","SPP","2015-04-29","Verificando a possibilidade de atendimento juntamente com a demanda de 2015.","atualizado 30/03/2015"]
["02/2014",227,"002706/2014","Aquisição de artigos de higiene e conservação","Aquisição de artigos de higiene e conservação",140000,"PRÓ-REITORIA DE ENSINO E GRADUAÇÃO","PROGRAD/DEST/PAT","SPP","2015-04-29","Verificando a possibilidade de atendimento juntamente com a demanda de 2015.","atualizado 30/03/2015"]
["16/2014",453,"002706/2014","Aquisição de artigos de higiene e conservação","Aquisição de artigos de higiene e conservação",150000,"PRÓ-REITORIA DE EXTENSÃO","DEPARTAMENTO DE ARTE E CULTURA","SPP","2015-04-29","Verificando a possibilidade de atendimento juntamente com a demanda de 2015.","atualizado 30/03/2015"]
["55/2014",234,"002706/2014","Aquisição de artigos de higiene e conservação","Aquisição de artigos de higiene e conservação",150000,"PRÓ-REITORIA DE EXTENSÃO","PRÓ-REITORIA DE EXTENSÃO","SPP","2015-04-29","Verificando a possibilidade de atendimento juntamente com a demanda de 2015.","atualizado 30/03/2015"]
["03/2014",345,"002706/2014","Aquisição de artigos de higiene e conservação","Aquisição de artigos de higiene e conservação",160000,"PRÓ-REITORIA DE PESQUISA E PÓS GRADUAÇÃO","PRÓ-REITORIA DE PESQUISA E PÓS GRADUAÇÃO","SPP","2015-04-29","Verificando a possibilidade de atendimento juntamente com a demanda de 2015.","atualizado 30/03/2015"]
["10/2014",191,"002706/2014","Aquisição de artigos de higiene e conservação","Aquisição de artigos de higiene e conservação",160010,"EDITORA UNIVERSIDADE RURAL","EDITORA UNIVERSIDADE RURAL","SPP","2015-04-29","Verificando a possibilidade de atendimento juntamente com a demanda de 2015.","atualizado 30/03/2015"]
["08/2014",393,"002706/2014","Aquisição de artigos de higiene e conservação","Aquisição de artigos de higiene e conservação",170000,"CAIC","CAIC","SPP","2015-04-29","Verificando a possibilidade de atendimento juntamente com a demanda de 2015.","atualizado 30/03/2015"]
["05/2014",298,"002706/2014","Aquisição de artigos de higiene e conservação","Aquisição de artigos de higiene e conservação",180000,"CTUR","CTUR","SPP","2015-04-29","Verificando a possibilidade de atendimento juntamente com a demanda de 2015.","atualizado 30/03/2015"]
["04/2014",245,"002706/2014","Aquisição de artigos de higiene e conservação","Aquisição de artigos de higiene e conservação",190000,"CAMPUS DR. LEONEL MIRANDA","DIREÇÃO","SPP","2015-04-29","Verificando a possibilidade de atendimento juntamente com a demanda de 2015.","atualizado 30/03/2015"]
["02/2014",310,"002706/2014","Aquisição de artigos de higiene e conservação","Aquisição de artigos de higiene e conservação",210000,"INSTITUTO DE AGRONOMIA","SECRETARIA ADMINISTRATIVA DO INSTITUTO","SPP","2015-04-29","Verificando a possibilidade de atendimento juntamente com a demanda de 2015.","atualizado 30/03/2015"]
["25/2014",98,"002706/2014","Aquisição de artigos de higiene e conservação","Aquisição de artigos de higiene e conservação",210100,"DEPARTAMENTO DE FITOTECNIA","DEPARTAMENTO DE FITOTECNIA","SPP","2015-04-29","Verificando a possibilidade de atendimento juntamente com a demanda de 2015.","atualizado 30/03/2015"]
["07/2014",358,"002706/2014","Aquisição de artigos de higiene e conservação","Aquisição de artigos de higiene e conservação",210200,"DEPARTAMENTO DE GEOCIÊNCIAS","DEPARTAMENTO DE GEOCIÊNCIAS","SPP","2015-04-29","Verificando a possibilidade de atendimento juntamente com a demanda de 2015.","atualizado 30/03/2015"]
["19/2014",259,"002706/2014","Aquisição de artigos de higiene e conservação","Aquisição de artigos de higiene e conservação",220000,"INSTITUTO DE BIOLOGIA","DEPARTAMENTO DE GENÉTICA","SPP","2015-04-29","Verificando a possibilidade de atendimento juntamente com a demanda de 2015.","atualizado 30/03/2015"]
["03/2014",122,"002706/2014","Aquisição de artigos de higiene e conservação","Aquisição de artigos de higiene e conservação",220100,"DEPARTAMENTO DE BIOLOGIA ANIMAL","DEPARTAMENTO DE BIOLOGIA ANIMAL","SPP","2015-04-29","Verificando a possibilidade de atendimento juntamente com a demanda de 2015.","atualizado 30/03/2015"]
["09/2014",179,"002706/2014","Aquisição de artigos de higiene e conservação","Aquisição de artigos de higiene e conservação",220300,"DEPARTAMENTO DE CIÊNCIAS FISIOLÓGICAS","DEPARTAMENTO DE CIÊNCIAS FISIOLÓGICAS","SPP","2015-04-29","Verificando a possibilidade de atendimento juntamente com a demanda de 2015.","atualizado 30/03/2015"]
["13/2014",180,"002706/2014","Aquisição de artigos de higiene e conservação","Aquisição de artigos de higiene e conservação",220300,"DEPARTAMENTO DE CIÊNCIAS FISIOLÓGICAS","DEPARTAMENTO DE CIÊNCIAS FISIOLÓGICAS","SPP","2015-04-29","Verificando a possibilidade de atendimento juntamente com a demanda de 2015.","atualizado 30/03/2015"]
["09/2014",179,"002706/2014","Aquisição de artigos de higiene e conservação","Aquisição de artigos de higiene e conservação",220300,"DEPARTAMENTO DE CIÊNCIAS FISIOLÓGICAS","SECRETARIA","SPP","2015-04-29","Verificando a possibilidade de atendimento juntamente com a demanda de 2015.","atualizado 30/03/2015"]
["04/2014",60,"002706/2014","Aquisição de artigos de higiene e conservação","Aquisição de artigos de higiene e conservação",220410,"LABORATÓRIO OFICIAL DE DIAGNÓSTICO FITOSSANITÁRIO","LABORATÓRIO OFICIAL DE DIAGNÓSTICO FITOSSANITÁRIO","SPP","2015-04-29","Verificando a possibilidade de atendimento juntamente com a demanda de 2015.","atualizado 30/03/2015"]
["05/2014",180,"002706/2014","Aquisição de artigos de higiene e conservação","Aquisição de artigos de higiene e conservação",230100,{"$f":"IFERROR(VLOOKUP(F313,$A$994:$B$1311,2,0),\"\")","v":"DEPARTAMENTO DE FÍSICA"},"DEPARTAMENTO DE FÍSICA","SPP","2015-04-29","Verificando a possibilidade de atendimento juntamente com a demanda de 2015.","atualizado 30/03/2015"]
["66/2014",128,"002706/2014","Aquisição de artigos de higiene e conservação","Aquisição de artigos de higiene e conservação",230300,"DEPARTAMENTO DE QUÍMICA","DEPARTAMENTO DE QUÍMICA","SPP","2015-04-29","Verificando a possibilidade de atendimento juntamente com a demanda de 2015.","atualizado 30/03/2015"]
["05/2014",117,"002706/2014","Aquisição de artigos de higiene e conservação","Aquisição de artigos de higiene e conservação",240000,"INSTITUTO DE CIÊNCIAS HUMANAS E SOCIAIS","DIREÇÃO","SPP","2015-04-29","Verificando a possibilidade de atendimento juntamente com a demanda de 2015.","atualizado 30/03/2015"]
["01/2014",150,"002706/2014","Aquisição de artigos de higiene e conservação","Aquisição de artigos de higiene e conservação",250000,"INSTITUTO DE EDUCAÇÃO","DIREÇÃO","SPP","2015-04-29","Verificando a possibilidade de atendimento juntamente com a demanda de 2015.","atualizado 30/03/2015"]
["03/2014",312,"002706/2014","Aquisição de artigos de higiene e conservação","Aquisição de artigos de higiene e conservação",260000,"INSTITUTO DE FLORESTAS","PPGPDS - PROGRAMA DE PÓS-GRADUAÇÃO EM DESENVOLVIMENTO SUSTENTÁVEL","SPP","2015-04-29","Verificando a possibilidade de atendimento juntamente com a demanda de 2015.","atualizado 30/03/2015"]
["04/2014",143,"002706/2014","Aquisição de artigos de higiene e conservação","Aquisição de artigos de higiene e conservação",260000,"INSTITUTO DE FLORESTAS","DIRETORIA","SPP","2015-04-29","Verificando a possibilidade de atendimento juntamente com a demanda de 2015.","atualizado 30/03/2015"]
["07/2014",290,"002706/2014","Aquisição de artigos de higiene e conservação","Aquisição de artigos de higiene e conservação",260200,"DEPARTAMENTO DE PRODUTOS FLORESTAIS","DEPARTAMENTO DE PRODUTOS FLORESTAIS","SPP","2015-04-29","Verificando a possibilidade de atendimento juntamente com a demanda de 2015.","atualizado 30/03/2015"]
["02/2014",426,"002706/2014","Aquisição de artigos de higiene e conservação","Aquisição de artigos de higiene e conservação",270000,"INSTITUTO DE TECNOLOGIA","DEPARTAMENTO DE ARQUITETURA E URBANISMO","SPP","2015-04-29","Verificando a possibilidade de atendimento juntamente com a demanda de 2015.","atualizado 30/03/2015"]
["04/2014",218,"002706/2014","Aquisição de artigos de higiene e conservação","Aquisição de artigos de higiene e conservação",270400,"DEPARTAMENTO DE TECNOLOGIA DE ALIMENTOS","DEPARTAMENTO DE TECNOLOGIA DE ALIMENTOS","SPP","2015-04-29","Verificando a possibilidade de atendimento juntamente com a demanda de 2015.","atualizado 30/03/2015"]
["23/2014",73,"002706/2014","Aquisição de artigos de higiene e conservação","Aquisição de artigos de higiene e conservação",280000,"INSTITUTO DE VETERINÁRIA","SECRETARIA DA DIRETORIA","SPP","2015-04-29","Verificando a possibilidade de atendimento juntamente com a demanda de 2015.","atualizado 30/03/2015"]
["06/2014",492,"002706/2014","Aquisição de artigos de higiene e conservação",{"$f":"D323","v":"Aquisição de artigos de higiene e conservação"},280010,"HOSPITAL VETERINÁRIO","HOSPITAL VETERINÁRIO","SPP","2015-04-29","Verificando a possibilidade de atendimento juntamente com a demanda de 2015.","atualizado 30/03/2015"]
["47/2014",201,"002706/2014","Aquisição de artigos de higiene e conservação","Aquisição de artigos de higiene e conservação",280100,"DEPARTAMENTO DE EPIDEMIOLOGIA E SAÚDE PÚBLICA","DEPARTAMENTO DE EPIDEMIOLOGIA E SAÚDE PÚBLICA","SPP","2015-04-29","Verificando a possibilidade de atendimento juntamente com a demanda de 2015.","atualizado 30/03/2015"]
["03/2014",193,"002706/2014","Aquisição de artigos de higiene e conservação","Aquisição de artigos de higiene e conservação",280200,"DEPARTAMENTO DE MEDICINA E CIRURGIA VETERINÁRIA","DEPARTAMENTO DE MEDICINA E CIRURGIA VETERINÁRIA","SPP","2015-04-29","Verificando a possibilidade de atendimento juntamente com a demanda de 2015.","atualizado 30/03/2015"]
["03/2014",102,"002706/2014","Aquisição de artigos de higiene e conservação","Aquisição de artigos de higiene e conservação",280300,"DEPTO DE MICROBIOLOGIA E IMUNOLOGIA VETERINÁRIA","DEPTO DE MICROBIOLOGIA E IMUNOLOGIA VETERINÁRIA","SPP","2015-04-29","Verificando a possibilidade de atendimento juntamente com a demanda de 2015.","atualizado 30/03/2015"]
["03/2014",366,"002706/2014","Aquisição de artigos de higiene e conservação","Aquisição de artigos de higiene e conservação",280400,"DEPARTAMENTO DE PARASITOLOGIA ANIMAL","DEPARTAMENTO DE PARASITOLOGIA ANIMAL","SPP","2015-04-29","Verificando a possibilidade de atendimento juntamente com a demanda de 2015.","atualizado 30/03/2015"]
["08/2014",171,"002706/2014","Aquisição de artigos de higiene e conservação","Aquisição de artigos de higiene e conservação",290000,"INSTITUTO DE ZOOTECNIA","GABINETE DA REITORIA","SPP","2015-04-29","Verificando a possibilidade de atendimento juntamente com a demanda de 2015.","atualizado 30/03/2015"]
["18/2014",330,"002706/2014","Aquisição de artigos de higiene e conservação","Aquisição de artigos de higiene e conservação",290000,"INSTITUTO DE ZOOTECNIA","DNAP","SPP","2015-04-29","Verificando a possibilidade de atendimento juntamente com a demanda de 2015.","atualizado 30/03/2015"]
["23/2014",162,"002706/2014","Aquisição de artigos de higiene e conservação","Aquisição de artigos de higiene e conservação",290000,"INSTITUTO DE ZOOTECNIA","DEPARTAMENTO DE REPRODUÇÃO E AVALIAÇÃO ANIMAL - DRAA","SPP","2015-04-29","Verificando a possibilidade de atendimento juntamente com a demanda de 2015.","atualizado 30/03/2015"]
["05/2014",168,"002706/2014","Aquisição de artigos de higiene e conservação","Aquisição de artigos de higiene e conservação",290000,"INSTITUTO DE ZOOTECNIA","DIRETORIA DO IZ","SPP","2015-04-29","Verificando a possibilidade de atendimento juntamente com a demanda de 2015.","atualizado 30/03/2015"]
["04/2014",174,"002706/2014","Aquisição de artigos de higiene e conservação","Aquisição de artigos de higiene e conservação",300000,"CAMPUS DA UFRRJ EM NOVA IGUAÇU","SUPERINTENDÊNCIA DO CAMPUS","SPP","2015-04-29","Verificando a possibilidade de atendimento juntamente com a demanda de 2015.","atualizado 30/03/2015"]
["03/2014",111,"002706/2014","Aquisição de artigos de higiene e conservação","Aquisição de artigos de higiene e conservação",300001,"RESTAURANTE UNIVERSITÁRIO - NOVA IGUAÇU","RESTAURANTE UNIVERSITÁRIO - NOVA IGUAÇU","SPP","2015-04-29","Verificando a possibilidade de atendimento juntamente com a demanda de 2015.","atualizado 30/03/2015"]
["05/2014",487,"002706/2014","Aquisição de artigos de higiene e conservação","Aquisição de artigos de higiene e conservação",400000,"CAMPUS DA UFRRJ EM TRÊS RIOS","DIREÇÃO, TRANSPORTE, PROTOCOLO/PROGRAD/DEST, BIBLIOTECA, DP, NPJ E INFORMÁTICA","SPP","2015-04-29","Verificando a possibilidade de atendimento juntamente com a demanda de 2015.","atualizado 30/03/2015"]
["08/2014",441,"002706/2014","Aquisição de artigos de higiene e conservação","Aquisição de artigos de higiene e conservação",600000,"INSTITUTO DE CIÊNCIAS SOCIAIS APLICADAS","DIREÇÃO","SPP","2015-04-29","Verificando a possibilidade de atendimento juntamente com a demanda de 2015.","atualizado 30/03/2015"]
["21/2014",1042,"006008/2014","Aquisição de material hidráulico (grupo 30.24)","Aquisição de material hidráulico (grupo 30.24)",100300,"PREFEITURA UNIVERSITÁRIA","DIVISÃO DE SERVIÇOS GERAIS","ASTEC","2015-03-19","Elaboração da minuta de edital.","atualizado 14/04/2015"]
["15/2014",1287,"006008/2014","Aquisição de material hidráulico (grupo 30.24)","Aquisição de material hidráulico (grupo 30.24)",130000,"PRÓ-REITORIA DE ASSUNTOS ESTUDANTIS","SETOR DE RESIDÊNCIA ESTUDANTIL","ASTEC","2015-03-19","Elaboração da minuta de edital.","atualizado 14/04/2015"]
["54/2014",1148,"006008/2014","Aquisição de material hidráulico (grupo 30.24)","Aquisição de material hidráulico (grupo 30.24)",280000,"INSTITUTO DE VETERINÁRIA","DIRETORIA","ASTEC","2015-03-19","Elaboração da minuta de edital.","atualizado 14/04/2015"]
["13/2014",1054,"006008/2014","Aquisição de material hidráulico (grupo 30.24)","Aquisição de material hidráulico (grupo 30.24)",180000,"CTUR","CTUR","ASTEC","2015-03-19","Elaboração da minuta de edital.","atualizado 14/04/2015"]
["38/2014",1413,"006008/2014","Aquisição de material hidráulico (grupo 30.24)","Aquisição de material hidráulico (grupo 30.24)",100090,"PRAÇA DE DESPORTOS","DEPARTAMENTO DE ESPORTE E LAZER","ASTEC","2015-03-19","Elaboração da minuta de edital.","atualizado 14/04/2015"]
["05/2014","S/Nº","006008/2014","Aquisição de material hidráulico (grupo 30.24)","Aquisição de material hidráulico (grupo 30.24)",210300,"DEPARTAMENTO DE SOLOS","DEPARTAMENTO DE SOLOS","ASTEC","2015-03-19","Elaboração da minuta de edital.","atualizado 14/04/2015"]
["05/2014",912,"006021/2014","Aquisição de equipamentos agrícolas (grupo 52.40)","Aquisição de equipamentos agrícolas (grupo 52.40)",160050,"JARDIM BOTÂNICO","JARDIM BOTÂNICO","ASTEC","2015-04-13","Pregão 34/2015 - Elaboração da minuta de edital.","atualizado 14/04/2015"]
["10/2014",926,"006021/2014","Aquisição de equipamentos agrícolas (grupo 52.40)","Aquisição de equipamentos agrícolas (grupo 52.40)",130000,"PRÓ-REITORIA DE ASSUNTOS ESTUDANTIS","PRÓ-REITORIA DE ASSUNTOS ESTUDANTIS","ASTEC","2015-04-13","Pregão 34/2015 - Elaboração da minuta de edital.","atualizado 14/04/2015"]
["11/2014",939,"006022/2014","Aquisição de equipamentos eletro-eletrônicos (grupo 52.33)","Aquisição de equipamentos eletro-eletrônicos (grupo 52.33)",170000,"CAIC","CAIC","SPP","2014-08-11","Pesquisa de preço.","atualizado 30/03/2015"]
["01/2014",917,"006022/2014","Aquisição de equipamentos eletro-eletrônicos (grupo 52.33)","Aquisição de equipamentos eletro-eletrônicos (grupo 52.33)",150000,"PRÓ-REITORIA DE EXTENSÃO","DEPARTAMENTO DE LOGÍSTICA E INFRAESTRUTURA","SPP","2014-08-11","Pesquisa de preço.","atualizado 30/03/2015"]
["80/2014",413,"006022/2014","Aquisição de equipamentos eletro-eletrônicos (grupo 52.33)","Aquisição de equipamentos eletro-eletrônicos (grupo 52.33)",230300,"DEPARTAMENTO DE QUÍMICA","DEPARTAMENTO DE QUÍMICA","SPP","2014-08-11","Pesquisa de preço.","atualizado 30/03/2015"]
["81/2014",407,"006022/2014","Aquisição de equipamentos eletro-eletrônicos (grupo 52.33)","Aquisição de equipamentos eletro-eletrônicos (grupo 52.33)",100070,"POSTO MÉDICO","DIVISÃO DE SAÚDE","SPP","2014-08-11","Pesquisa de preço.","atualizado 30/03/2015"]
["07/2014",416,"006022/2014","Aquisição de equipamentos eletro-eletrônicos (grupo 52.33)","Aquisição de equipamentos eletro-eletrônicos (grupo 52.33)",300000,"CAMPUS DA UFRRJ EM NOVA IGUAÇU","SUPERINTENDÊNCIA DO CAMPUS","SPP","2014-08-11","Pesquisa de preço.","atualizado 30/03/2015"]
["84/2014",461,"006022/2014","Aquisição de equipamentos eletro-eletrônicos (grupo 52.33)","Aquisição de equipamentos eletro-eletrônicos (grupo 52.33)",100000,"REITORIA","SECRETARIA DOS ÓRGÃOS COLEGIADOS","SPP","2014-08-11","Pesquisa de preço.","atualizado 30/03/2015"]
["03/2014",293,"005919/2014","Pagamento de inscrição da Profª. Katia Cilene Tabai no XXIV Congresso Brasileiro de Ciência e Tecnologia de Alimentos","Pagamento de inscrição da Profª. Katia Cilene Tabai no XXIV Congresso Brasileiro de Ciência e Tecnologia de Alimentos",600000,"INSTITUTO DE CIÊNCIAS SOCIAIS APLICADAS","ICSA - DEDH","SAPG","2015-03-25","Já houve empenho (2014NE801400) e pagamento (2015OB800581).","atualizado 30/03/2015"]
["01/2014",949,"005867/2014","Aquisição de aparelhos e utensílios domésticos (grupo 52.12)","Aquisição de aparelhos e utensílios domésticos (grupo 52.12)",120100,"DEPARTAMENTO DE CONTABILIDADE E FINANÇAS","DEPARTAMENTO DE CONTABILIDADE E FINANÇAS","SPP","2015-04-10","Realizando ajustes após emissão de parecer jurídico.","atualizado 14/04/2015"]
["79/2014",404,"005867/2014","Aquisição de aparelhos e utensílios domésticos (grupo 52.12)","Aquisição de aparelhos e utensílios domésticos (grupo 52.12)",100070,"POSTO MÉDICO","DIVISÃO DE SAÚDE","SPP","2015-04-10","Realizando ajustes após emissão de parecer jurídico.","atualizado 14/04/2015"]
["82/2014",459,"005867/2014","Aquisição de aparelhos e utensílios domésticos (grupo 52.12)","Aquisição de aparelhos e utensílios domésticos (grupo 52.12)",100000,"REITORIA","SECRETARIA DOS ÓRGÃOS COLEGIADOS","SPP","2015-04-10","Realizando ajustes após emissão de parecer jurídico.","atualizado 14/04/2015"]
["01/2014",909,"005867/2014","Aquisição de aparelhos e utensílios domésticos (grupo 52.12)","Aquisição de aparelhos e utensílios domésticos (grupo 52.12)",140113,"DIREITO","COORDENAÇÃO DE DIREITO - ICHS","SPP","2015-04-10","Realizando ajustes após emissão de parecer jurídico.","atualizado 14/04/2015"]
["81/2014",410,"005867/2014","Aquisição de aparelhos e utensílios domésticos (grupo 52.12)","Aquisição de aparelhos e utensílios domésticos (grupo 52.12)",230300,"DEPARTAMENTO DE QUÍMICA","DEPARTAMENTO DE QUÍMICA","SPP","2015-04-10","Realizando ajustes após emissão de parecer jurídico.","atualizado 14/04/2015"]
["66/2014",457,"005867/2014","Aquisição de aparelhos e utensílios domésticos (grupo 52.12)","Aquisição de aparelhos e utensílios domésticos (grupo 52.12)",150000,"PRÓ-REITORIA DE EXTENSÃO","DEPARTAMENTO DE LOGÍSTICA E INFRAESTRUTURA","SPP","2015-04-10","Realizando ajustes após emissão de parecer jurídico.","atualizado 14/04/2015"]
["06/2014",415,"005867/2014","Aquisição de aparelhos e utensílios domésticos (grupo 52.12)","Aquisição de aparelhos e utensílios domésticos (grupo 52.12)",300000,"CAMPUS DA UFRRJ EM NOVA IGUAÇU","SUPERINTENDÊNCIA DO CAMPUS","SPP","2015-04-10","Realizando ajustes após emissão de parecer jurídico.","atualizado 14/04/2015"]
["05/2014",1309,"005967/2014","Pagamento de inscrição de Cristiane Venâncio de Oliveira Martins no 8º Congresso Empresarial Aberje Rio de Janeiro","Pagamento de inscrição de Cristiane Venâncio de Oliveira Martins no 8º Congresso Empresarial Aberje Rio de Janeiro",100000,"REITORIA","COORDENADORIA DE COMUNICAÇÃO SOCIAL","ARQUIVO","2015-03-06","Arquivado porque  houve empenho (2014NE801736) e pagamento (2014OB806917).","atualizado 30/03/2015"]
["02/2014",1294,"006000/2014","Pagamento de inscrição da Profª. Katia Cilene Tabai no XXIII Congresso Brasileiro de Nutrição","Pagamento de inscrição da Profª. Katia Cilene Tabai no XXIII Congresso Brasileiro de Nutrição",600000,"INSTITUTO DE CIÊNCIAS SOCIAIS APLICADAS","ICSA - DEDH","SETOR DE COBRANÇA","2015-03-05","Já houve empenho (2014NE801382), mas o pagamento ainda não foi efetuado.","atualizado 30/03/2015"]
["127/2014",1043,"005968/2014","Aquisição de mobiliário em geral (grupo 52.42)","Aquisição de mobiliário em geral (grupo 52.42)",150000,"PRÓ-REITORIA DE EXTENSÃO","DEPARTAMENTO DE LOGÍSTICA E INFRAESTRUTURA","DIREÇÃO DMSA","2015-01-30","Verificando a possibilidade de atendimento juntamente com a demanda de 2015.","atualizado 30/03/2015"]
["12/2014",1111,"005968/2014","Aquisição de mobiliário em geral (grupo 52.42)","Aquisição de mobiliário em geral (grupo 52.42)",170000,"CAIC","CAIC","DIREÇÃO DMSA","2015-01-30","Verificando a possibilidade de atendimento juntamente com a demanda de 2015.","atualizado 30/03/2015"]
["25/2014",1085,"005968/2014","Aquisição de mobiliário em geral (grupo 52.42)","Aquisição de mobiliário em geral (grupo 52.42)",400000,"CAMPUS DA UFRRJ EM TRÊS RIOS","CAMPUS DA UFRRJ EM TRES RIOS","DIREÇÃO DMSA","2015-01-30","Verificando a possibilidade de atendimento juntamente com a demanda de 2015.","atualizado 30/03/2015"]
["04/2014",1028,"005968/2014","Aquisição de mobiliário em geral (grupo 52.42)","Aquisição de mobiliário em geral (grupo 52.42)",160107,"PROAP - MEDICINA VETERINÁRIA","PROGRAMA DE PÓS-GRADUAÇÃO EM MEDICINA VETERINÁRIA","DIREÇÃO DMSA","2015-01-30","Verificando a possibilidade de atendimento juntamente com a demanda de 2015.","atualizado 30/03/2015"]
["03/2014",1320,"005968/2014","Aquisição de mobiliário em geral (grupo 52.42)","Aquisição de mobiliário em geral (grupo 52.42)",160106,"PROAP - FITOTECNIA","PROGRAMA DE PÓS-GRADUAÇÃO EM FITOTECNIA","DIREÇÃO DMSA","2015-01-30","Verificando a possibilidade de atendimento juntamente com a demanda de 2015.","atualizado 30/03/2015"]
["07/2014",1110,"005968/2014","Aquisição de mobiliário em geral (grupo 52.42)","Aquisição de mobiliário em geral (grupo 52.42)",210000,"INSTITUTO DE AGRONOMIA","DIRETORIA","DIREÇÃO DMSA","2015-01-30","Verificando a possibilidade de atendimento juntamente com a demanda de 2015.","atualizado 30/03/2015"]
["13/2014",1054,"005968/2014","Aquisição de mobiliário em geral (grupo 52.42)","Aquisição de mobiliário em geral (grupo 52.42)",130000,"PRÓ-REITORIA DE ASSUNTOS ESTUDANTIS","SECRETARIA","DIREÇÃO DMSA","2015-01-30","Verificando a possibilidade de atendimento juntamente com a demanda de 2015.","atualizado 30/03/2015"]
["16/2014",1255,"005968/2014","Aquisição de mobiliário em geral (grupo 52.42)","Aquisição de mobiliário em geral (grupo 52.42)",180000,"CTUR","CTUR","DIREÇÃO DMSA","2015-01-30","Verificando a possibilidade de atendimento juntamente com a demanda de 2015.","atualizado 30/03/2015"]
["40/2014",1028,"005968/2014","Aquisição de mobiliário em geral (grupo 52.42)","Aquisição de mobiliário em geral (grupo 52.42)",100090,"PRAÇA DE DESPORTOS","DEPARTAMENTO DE ESPORTE E LAZER","DIREÇÃO DMSA","2015-01-30","Verificando a possibilidade de atendimento juntamente com a demanda de 2015.","atualizado 30/03/2015"]
["20/2014",1041,"006045/2014","Aquisição de material de construção (grupo 30.24A)","Aquisição de material de construção (grupo 30.24A)",100300,"PREFEITURA UNIVERSITÁRIA","DIVISÃO DE SERVIÇOS GERAIS","PREGÃO","2015-03-16","Pregão 30/2015 agendado para abertura 27/03/2015.","atualizado 30/03/2015"]
["01/2014",1062,"006045/2014","Aquisição de material de construção (grupo 30.24A)","Aquisição de material de construção (grupo 30.24A)",130000,"PRÓ-REITORIA DE ASSUNTOS ESTUDANTIS","SETOR DE RESIDÊNCIA ESTUDANTIL","PREGÃO","2015-03-16","Pregão 30/2015 agendado para abertura 27/03/2015.","atualizado 30/03/2015"]
["14/2014",1053,"006045/2014","Aquisição de material de construção (grupo 30.24A)","Aquisição de material de construção (grupo 30.24A)",180000,"CTUR","CTUR","PREGÃO","2015-03-16","Pregão 30/2015 agendado para abertura 27/03/2015.","atualizado 30/03/2015"]
["39/2014",1414,"006045/2014","Aquisição de material de construção (grupo 30.24A)","Aquisição de material de construção (grupo 30.24A)",100090,"PRAÇA DE DESPORTOS","DEPARTAMENTO DE ESPORTE E LAZER","PREGÃO","2015-03-16","Pregão 30/2015 agendado para abertura 27/03/2015.","atualizado 30/03/2015"]
["02/2014",1080,"006058/2014","Conserto de câmaras de germinação","Conserto de câmaras de germinação",160106,"PROAP - FITOTECNIA","INSTITUTO DE AGRONOMIA - PROGRAMA DE PÓS-GRADUAÇÃO EM FITOTECNIA","SAPG","2015-05-06","O empenho já foi emitido (2014NE802290) e transmitido à empresa. A prestação do serviço já pode ser iniciada (20 dias para execução).","verificar CNPJ da empresa vencedora\nverificar se houve pagamento"]
["01/2014",78,"006056/2014","Aquisição de material de artes gráficas, desenho e expediente (grupos 30.16 e 30.16B)","Aquisição de material de artes gráficas, desenho e expediente (grupos 30.16 e 30.16B)",160112,"PROAP - ZOOTECNIA","PROGRAMA DE PÓS-GRADUAÇÃO EM ZOOTECNIA","SSRP","2015-03-27","Verificando a possibilidade de atendimento juntamente com a demanda de 2015.","O Rafael vai sugerir juntar com outros processos de material de expediente ( 6343/2014, 2703/2014 e 2704/2014), pois a solicitação de aumento de quantidades não foi fundamentada, somente diz que é por ser SRP."]
["02/2014",138,"006056/2014","Aquisição de material de artes gráficas, desenho e expediente (grupos 30.16 e 30.16B)","Aquisição de material de artes gráficas, desenho e expediente (grupos 30.16 e 30.16B)",160117,"PROAP - MULTICÊNTRICO EM CIÊNCIAS FISIOLÓGICAS","INSTITUTO DE BIOLOGIA","SSRP","2015-03-27","Verificando a possibilidade de atendimento juntamente com a demanda de 2015.","O Rafael vai sugerir juntar com outros processos de material de expediente ( 6343/2014, 2703/2014 e 2704/2014), pois a solicitação de aumento de quantidades não foi fundamentada, somente diz que é por ser SRP."]
["02/2014",224,"006056/2014","Aquisição de material de artes gráficas, desenho e expediente (grupos 30.16 e 30.16B)","Aquisição de material de artes gráficas, desenho e expediente (grupos 30.16 e 30.16B)",160102,"PROAP - CIÊNCIAS AMBIENTAIS E FLORESTAIS","PROGRAMA DE PÓS-GRADUAÇÃO EM CIÊNCIAS AMBIENTAIS E FLORESTAIS","SSRP","2015-03-27","Verificando a possibilidade de atendimento juntamente com a demanda de 2015.","O Rafael vai sugerir juntar com outros processos de material de expediente ( 6343/2014, 2703/2014 e 2704/2014), pois a solicitação de aumento de quantidades não foi fundamentada, somente diz que é por ser SRP."]
["01/2014",324,"006056/2014","Aquisição de material de artes gráficas, desenho e expediente (grupos 30.16 e 30.16B)","Aquisição de material de artes gráficas, desenho e expediente (grupos 30.16 e 30.16B)",160119,{"$f":"IFERROR(VLOOKUP(F377,$A$994:$B$1311,2,0),\"\")","v":"PROAP - PSICOLOGIA"},"PROGRAMA DE PÓS-GRADUAÇÃO EM PSICOLOGIA","SSRP","2015-03-27","Verificando a possibilidade de atendimento juntamente com a demanda de 2015.","O Rafael vai sugerir juntar com outros processos de material de expediente ( 6343/2014, 2703/2014 e 2704/2014), pois a solicitação de aumento de quantidades não foi fundamentada, somente diz que é por ser SRP."]
["02/2014",79,"006056/2014","Aquisição de material de artes gráficas, desenho e expediente (grupos 30.16 e 30.16B)","Aquisição de material de artes gráficas, desenho e expediente (grupos 30.16 e 30.16B)",160112,"PROAP - ZOOTECNIA","PROGRAMA DE PÓS-GRADUAÇÃO EM ZOOTECNIA","SSRP","2015-03-27","Verificando a possibilidade de atendimento juntamente com a demanda de 2015.","O Rafael vai sugerir juntar com outros processos de material de expediente ( 6343/2014, 2703/2014 e 2704/2014), pois a solicitação de aumento de quantidades não foi fundamentada, somente diz que é por ser SRP."]
["56/2014",139,"006056/2014","Aquisição de material de artes gráficas, desenho e expediente (grupos 30.16 e 30.16B)","Aquisição de material de artes gráficas, desenho e expediente (grupos 30.16 e 30.16B)",160114,"PROAP - CIÊNCIAS VETERINÁRIAS","CURSO DE PÓS-GRADUAÇÃO EM CIÊNCIAS VETERINÁRIAS","SSRP","2015-03-27","Verificando a possibilidade de atendimento juntamente com a demanda de 2015.","O Rafael vai sugerir juntar com outros processos de material de expediente ( 6343/2014, 2703/2014 e 2704/2014), pois a solicitação de aumento de quantidades não foi fundamentada, somente diz que é por ser SRP."]
["01/2014",139,"006056/2014","Aquisição de material de artes gráficas, desenho e expediente (grupos 30.16 e 30.16B)","Aquisição de material de artes gráficas, desenho e expediente (grupos 30.16 e 30.16B)",160117,"PROAP - MULTICÊNTRICO EM CIÊNCIAS FISIOLÓGICAS","INSTITUTO DE BIOLOGIA","SSRP","2015-03-27","Verificando a possibilidade de atendimento juntamente com a demanda de 2015.","O Rafael vai sugerir juntar com outros processos de material de expediente ( 6343/2014, 2703/2014 e 2704/2014), pois a solicitação de aumento de quantidades não foi fundamentada, somente diz que é por ser SRP."]
["02/2014",212,"006056/2014","Aquisição de material de artes gráficas, desenho e expediente (grupos 30.16 e 30.16B)","Aquisição de material de artes gráficas, desenho e expediente (grupos 30.16 e 30.16B)",160119,"PROAP - PSICOLOGIA","PROGRAMA DE PÓS-GRADUAÇÃO EM PSICOLOGIA","SSRP","2015-03-27","Verificando a possibilidade de atendimento juntamente com a demanda de 2015.","O Rafael vai sugerir juntar com outros processos de material de expediente ( 6343/2014, 2703/2014 e 2704/2014), pois a solicitação de aumento de quantidades não foi fundamentada, somente diz que é por ser SRP."]
["03/2014",223,"006056/2014","Aquisição de material de artes gráficas, desenho e expediente (grupos 30.16 e 30.16B)","Aquisição de material de artes gráficas, desenho e expediente (grupos 30.16 e 30.16B)",160102,"PROAP - CIÊNCIAS AMBIENTAIS E FLORESTAIS","PROGRAMA DE PÓS-GRADUAÇÃO EM CIÊNCIAS AMBIENTAIS E FLORESTAIS","SSRP","2015-03-27","Verificando a possibilidade de atendimento juntamente com a demanda de 2015.","O Rafael vai sugerir juntar com outros processos de material de expediente ( 6343/2014, 2703/2014 e 2704/2014), pois a solicitação de aumento de quantidades não foi fundamentada, somente diz que é por ser SRP."]
["03/2014",1030,"006085/2014","Serviço de instalação de aparelhos de ar condicionado","Serviço de instalação de aparelhos de ar condicionado",160107,"PROAP - MEDICINA VETERINÁRIA","PROGRAMA DE PÓS-GRADUAÇÃO EM MEDICINA VETERINÁRIA","SAPG","2015-05-06","O empenho já foi emitido (2014NE802065) e a empresa está realizando o serviço.","CNPJ da empresa vencedora: 15.453.7190001-55 Verificar se houve mais empenho"]
["05/2014",980,"006017/2014","Aquisição de artigos de esporte e recreação (grupo 30.14)","Aquisição de artigos de esporte e recreação (grupo 30.14)",150080,"PROEXT-MEC 2014 - MÃOS QUE CRIAM - PROJETO DE CAPACITAÇÃO PARA PROMOÇÃO SOCIAL","PRÓ-REITORIAS DE EXTENSÃO","SEÇÃO DE CONTROLE","2014-11-07","Já houve empenho (2014NE802103), mas o prazo de entrega está vencido e um ofício de cobrança foi emitido à empresa em 09/12/14.","CNPJ da empresa vencedora: 18.752.712/0001-22\nVerificar se houve pagamento"]
["10/2014",1467,"007152/2014","Aquisição de veículos de transporte não especializado tipo Pick-up","Aquisição de veículos de transporte não especializado tipo Pick-up",240000,{"$f":"IFERROR(VLOOKUP(F385,$A$994:$B$1311,2,0),\"\")","v":"INSTITUTO DE CIÊNCIAS HUMANAS E SOCIAIS"},"DIREÇÃO","ANEXADO    23083.004907/2014-84 ","2014-10-09","Já houve empenho (2014NE801998, 2014NE801999, 2014NE802192), pagamentos (2015OB800232 , 2015OB800413 e 2015DF800135, 2015DF800207) e foi entregue no Almoxarifado em 19/12/14. (anexado ao 004907/2014).","CNPJ da empresa vencedora: 54.305.743/0011-70\nverificar se houve empenho"]
["S/Nº","S/Nº","007152/2014","Aquisição de veículos de transporte não especializado tipo Pick-up","Aquisição de veículos de transporte não especializado tipo Pick-up",100060,"DIVISÃO DE GUARDA E VIGILÂNCIA","DIVISÃO DE GUARDA E VIGILÂNCIA","ANEXADO    23083.004907/2014-85","2014-10-09","Já houve empenho (2014NE801998, 2014NE801999, 2014NE802192), pagamentos (2015OB800232 , 2015OB800413 e 2015DF800135, 2015DF800207) e foi entregue no Almoxarifado em 19/12/14. (anexado ao 004907/2014).","CNPJ da empresa vencedora: 54.305.743/0011-70\nverificar se houve empenho"]
["145/2014",1419,"006679/2014","Pagamento de inscrição das servidoras Kate Hellen e Ana Carolina no 8º Congresso de Secretários das Universidades Brasileiras",{"$f":"D387","v":"Pagamento de inscrição das servidoras Kate Hellen e Ana Carolina no 8º Congresso de Secretários das Universidades Brasileiras"},150000,"PRÓ-REITORIA DE EXTENSÃO","PRÓ-REITORIA DE EXTENSÃO","ARQUIVO","2015-03-06","Desarquivado pela CODEP para realizar o relatório anual de cursos  do Governo Federal e em breve será novamente arquivado.\nArquivado porque  houve empenho (2014NE801506) e pagamento (2014GR800127).","atualizado 31/03/2015"]
["01/2014",34,"001799/2014","Aquisição de material de limpeza para o Restaurante Universitário","Aquisição de material de limpeza para o Restaurante Universitário",130100,"RESTAURANTE UNIVERSITÁRIO - CAMPUS SEROPÉDICA","RESTAURANTE UNIVERSITÁRIO - CAMPUS SEROPÉDICA","ASTEC","2015-05-11","Pregão nº 11/2015 (antigo nº 115/2014) com provável abertura em 10/02/15.","atualizado 14/04/2015"]
["08/2014",944,"004667/2014","Instalação de 26 pontos de rede RJ 45 - CAT6","Instalação de 26 pontos de rede RJ 45 - CAT6",240000,"INSTITUTO DE CIÊNCIAS HUMANAS E SOCIAIS","DIREÇÃO","SEÇÃO DE CONTROLE","2015-05-11","O empenho foi emitido (2014NE802428) e transmitido à empresa. Está nas fases de liquidação e pagamento da despesa.","verificar com a Juh o CNPJ da empresa vencedora\nverificar se houve pagamento"]
["11/2014",854,"004588/2014","Conserto de sistema de circuito fechado de segurança do Instituto de Florestas","Conserto de sistema de circuito fechado de segurança do Instituto de Florestas",260000,"INSTITUTO DE FLORESTAS","DIREÇÃO","DIVISÃO DE ADMINISTRAÇÃO FINANCEIRA","2015-04-08","Pregão nº 108/2014 finalizado em 23/10/14. Já houve empenho (2014NE802108) e o serviço está sendo prestado.","verificar o CNPJ da empresa vencedora\nverificar se houve empenho"]
["06/2014",301,"004522/2014","Aquisição de torrador, descascador e moinho para café (grupo 52.28)","Aquisição de torrador, descascador e moinho para café (grupo 52.28)",210000,"INSTITUTO DE AGRONOMIA","DIREÇÃO","SEÇÃO DE CONTROLE","2014-11-28","Pregão nº 118/2014 finalizado em 18/11/14. Já houve empenho do descascador (2014NE802456) e a data prevista de entrega é até 06/01/15. Já houve empenho do torrador e do moinho para café (2014NE802454) e a data prevista de entrega é até 16/01/15.","verificar CNPJ da empresa vencedora\nverificar se houve pagamento"]
["08/2014",1401,"006576/2014","Pagamento de inscrição do servidor Edmilson Rangel no evento PCASP - Entendendo o plano de contas plicado ao setor público","Pagamento de inscrição do servidor Edmilson Rangel no evento PCASP - Entendendo o plano de contas plicado ao setor público",10310,"CAPACITAÇÃO DE SERVIDORES - RECURSOS ESPECÍFICOS","DEPARTAMENTO DE CONTABILIDADE E FINANÇAS","ARQUIVO","2015-03-06","Desarquivado pela CODEP para realizar o relatório anual de cursos  do Governo Federal e em breve será novamente arquivado.\nArquivado porque  houve empenho (2014NE801904) e pagamento (2014OB807497).","atualizado 14/04/2015"]
["05/2014",1078,"005135/2014","Aquisição de plaqueta laminada de patrimônio (grupo 30.59)","Aquisição de plaqueta laminada de patrimônio (grupo 30.59)",120200,"DEPARTAMENTO DE MATERIAL E SERVIÇOS AUXILIARES","CLOG / ALMOXARIFADO CENTRAL","CLOG","2014-11-17","Pregão nº 114/2014 finalizado em 06/11/14. Já houve empenho (2014NE802206), mas o prazo de entrega está vencido e um ofício de cobrança foi emitido à empresa em 16/12/14","verificar CNPJ da empresa vencedora\nverificar se houve pagamento"]
["03/2014",205,"002709/2014","Aquisição de gaiolas metabólicas para ratos","Aquisição de gaiolas metabólicas para ratos",220300,"DEPARTAMENTO DE CIÊNCIAS FISIOLÓGICAS","DEPARTAMENTO DE CIÊNCIAS FISIOLÓGICAS","SEÇÃO DE CONTROLE","2015-01-06","Pregão nº 110/2014 finalizado em 24/11/14. Já houve empenho (2014NE802604) e a data prevista de entrega é até 16/04/15. ","verificar CNPJ da empresa vencedora\nverificar se houve pagamento"]
["05/2014",852,"003361/2014","Contratação de pessoa jurídica para assistência técnica e manutenção de dois grupos geradores e painéis eletrônicos","Contratação de pessoa jurídica para assistência técnica e manutenção de dois grupos geradores e painéis eletrônicos",100300,"PREFEITURA UNIVERSITÁRIA","DIVISÃO DE SERVIÇOS GERAIS","SPP","2015-03-06","Realizando ajustes após emissão de parecer jurídico.","atualizado 14/04/2015"]
["11/2014",1046,"004957/2014","Kit artroscopia veterinária","Kit artroscopia veterinária",280010,"HOSPITAL VETERINÁRIO","HOSPITAL VETERINÁRIO","SEC. ADM. DO DEPTO DE CONTABILIDADE E FINANÇAS","2015-05-12","Realizando ajustes após emissão de parecer jurídico.","atualizado 14/04/2015"]
["13/2014",1047,"004957/2014","Tronco de concentração para equinos","Tronco de concentração para equinos",280010,"HOSPITAL VETERINÁRIO","HOSPITAL VETERINÁRIO","SEC. ADM. DO DEPTO DE CONTABILIDADE E FINANÇAS","2015-05-12","Realizando ajustes após emissão de parecer jurídico.","atualizado 14/04/2015"]
["14/2014",1048,"004957/2014","Bomba de infusão linear peristáltica de uso veterinário","Bomba de infusão linear peristáltica de uso veterinário",280010,"HOSPITAL VETERINÁRIO","HOSPITAL VETERINÁRIO","SEC. ADM. DO DEPTO DE CONTABILIDADE E FINANÇAS","2015-05-12","Realizando ajustes após emissão de parecer jurídico.","atualizado 14/04/2015"]
["16/2014",1051,"004957/2014","Serra óssea oscilatória à bateria","Serra óssea oscilatória à bateria",280010,"HOSPITAL VETERINÁRIO","HOSPITAL VETERINÁRIO","SEC. ADM. DO DEPTO DE CONTABILIDADE E FINANÇAS","2015-05-12","Realizando ajustes após emissão de parecer jurídico.","atualizado 14/04/2015"]
["17/2014",1049,"004957/2014","Conjunto de canil em aço inoxidável 304","Conjunto de canil em aço inoxidável 304",280010,"HOSPITAL VETERINÁRIO","HOSPITAL VETERINÁRIO","SEC. ADM. DO DEPTO DE CONTABILIDADE E FINANÇAS","2015-05-12","Realizando ajustes após emissão de parecer jurídico.","atualizado 14/04/2015"]
["19/2014",1050,"004957/2014","Central de análise de holter com licença de uso de software central","Central de análise de holter com licença de uso de software central",280010,"HOSPITAL VETERINÁRIO","HOSPITAL VETERINÁRIO","SEC. ADM. DO DEPTO DE CONTABILIDADE E FINANÇAS","2015-05-12","Realizando ajustes após emissão de parecer jurídico.","atualizado 14/04/2015"]
["05/2014",779,"003190/2014","Aquisição de materiais agrícolas (grupo 30.99)","Aquisição de materiais agrícolas (grupo 30.99)",100500,"COORDENADORIA DE DESENVOLVIMENTO DA PRODUÇÃO","CEPIEPE","COORDENADORIA ESPECIAL DE PRODUÇÃO INTEGRADA ENSINO, PESQUISA E  EXTENSÃO","2015-04-07","Pregão nº 95/2014 finalizado em 29/12/14. O processo está disponível na Coordenadoria Especial de Produção Integrada Ensino, Pesquisa e Extensão para solicitar empenhos.","verificar CNPJ da empresa vencedora\nverificar se houve pagamento"]
["07/2014",1370,"006592/2014","Pagamento de inscrição dos servidores Reginal Zão e André Levino no curso de Retenções de tributos pelos órgãos e entidades da administração pública","Pagamento de inscrição dos servidores Reginal Zão e André Levino no curso de Retenções de tributos pelos órgãos e entidades da administração pública",10310,"CAPACITAÇÃO DE SERVIDORES - RECURSOS ESPECÍFICOS","DEPARTAMENTO DE CONTABILIDADE E FINANÇAS","ARQUIVO","2015-03-06","Desarquivado pela CODEP para realizar o relatório anual de cursos  do Governo Federal e em breve será novamente arquivado.\nArquivado porque  houve empenho (2014NE801687) e pagamento (2014GR800108).","atualizado 14/04/2015"]
["03/2014",1324,"006172/2014","Pagamento de inscrição do servidor Edmilson Rangel no II Curso de excel avançado aplicado ao setor público","Pagamento de inscrição do servidor Edmilson Rangel no II Curso de excel avançado aplicado ao setor público",10310,"CAPACITAÇÃO DE SERVIDORES - RECURSOS ESPECÍFICOS","DEPARTAMENTO DE CONTABILIDADE E FINANÇAS","SAPG","2015-05-11","O requerente não participou do curso no período de 13 a 17/10/14 e solicitou o aproveitamento do processo para realizar o mesmo curso no período de 06 a 10/04/15.","verificar CNPJ da empresa vencedora\nverificar se houve pagamento"]
["78/2014",1484,"007073/2014","Pagamento de inscrição do servidor Duclério José no 41° FONAI-TEC","Pagamento de inscrição do servidor Duclério José no 41° FONAI-TEC",100000,"REITORIA","AUDITORIA INTERNA","ARQUIVO","2015-03-06","Desarquivado pela CODEP para realizar o relatório anual de cursos  do Governo Federal e em breve será novamente arquivado.\nArquivado porque  houve empenho (2014NE801685) e pagamento (2014OB809153).","atualizado 14/04/2015"]
["13/2014",1420,"006694/2014","Pagamento de inscrição da servidora Andréia da Silva no XVII Seminário nacional de bibliotecas universitárias","Pagamento de inscrição da servidora Andréia da Silva no XVII Seminário nacional de bibliotecas universitárias",300000,"CAMPUS DA UFRRJ EM NOVA IGUAÇU","BIBLIOTECA","ARQUIVO","2015-03-06","Desarquivado pela CODEP para realizar o relatório anual de cursos  do Governo Federal e em breve será novamente arquivado.\nHouve empenho (2014NE802128) e anulação do empenho (2014NE802523).","atualizado 14/04/2015"]
["04/2014",1322,"004447/2014","Aquisição de componente (percursor) interno das 2 espingardas calibre 12","Aquisição de componente (percursor) interno das 2 espingardas calibre 12",100060,"DIVISÃO DE GUARDA E VIGILÂNCIA","DIVISÃO DE GUARDA E VIGILÂNCIA","DIVISÃO DE GUARDA E VIGILÂNCIA","2014-09-24","Já houve empenho (2014NE801581) e foi entregue no  Almoxarifado em 25/09/14.","verificar CNPJ da empresa vencedora\nverificar se houve pagamento"]
["05/2014",1321,"004445/2014","Aquisição de baterias para motocicletas","Aquisição de baterias para motocicletas",100060,"DIVISÃO DE GUARDA E VIGILÂNCIA","DIVISÃO DE GUARDA E VIGILÂNCIA","SEÇÃO DE CONTROLE","2014-09-22","Já houve empenho (2014NE801583) e foi entregue no Almoxarifado em 30/09/14.","verificar CNPJ da empresa vencedora\nverificar se houve pagamento"]
["08/2014",1396,"006577/2014","Pagamento de inscrição de servidores no 8º Congresso de secretários das universidades brasileiras - CONSUB","Pagamento de inscrição de servidores no 8º Congresso de secretários das universidades brasileiras - CONSUB",110000,"PRÓ-REITORIA DE ASSUNTOS ADMINISTRATIVOS","COORDENAÇÃO DE DESENVOLVIMENTO DE PESSOAS","CODEP","2014-09-23","Já houve empenho (2014NE801521), mas o pagamento ainda não foi efetuado.","verificar CNPJ da empresa vencedora\nverificar se houve pagamento"]
["15/2014",1146,"005219/2014","Pagamento de inscrição dos servidores Luan Gonçalves e Sandro Luis no XXIII Curso sobre contratação de bens e serviços de TI ","Pagamento de inscrição dos servidores Luan Gonçalves e Sandro Luis no XXIII Curso sobre contratação de bens e serviços de TI ",120200,"DEPARTAMENTO DE MATERIAL E SERVIÇOS AUXILIARES","ASSESSORIA TÉCNICA DO DMSA","ARQUIVO","2015-03-06","Desarquivado pela CODEP para realizar o relatório anual de cursos  do Governo Federal e em breve será novamente arquivado.\nArquivado porque  houve empenho (2014NE801508) e pagamento (2014OB807625 e 2014DR800065).","atualizado 14/04/2015"]
["16/2014",1334,"006281/2014","Aquisição de scanner Copibbik Cobalt - Pró-equipamento","Aquisição de scanner Copibbik Cobalt - Pró-equipamento",160001,"PRÓ - EQUIPAMENTOS","PROPPG","DIVISÃO DE ADMINISTRAÇÃO FINANCEIRA","2015-05-05","Já houve empenho (2014NE802212), mas faltam informações sobre a entrega.","verificar CNPJ da empresa vencedora\nverificar se houve pagamento"]
["10/2014",1040,"004921/2014","Aquisição de mesa cirúrgica para grandes animais (equinos)","Aquisição de mesa cirúrgica para grandes animais (equinos)",280010,"HOSPITAL VETERINÁRIO","HOSPITAL VETERINÁRIO","SPP","2015-05-04","O órgão não autorizou a solicitação de carona.","buscar informações"]
["06/2014",1336,"006279/2014","Aquisição de Steponeplus Real-time PCR System","Aquisição de Steponeplus Real-time PCR System",160001,"PRÓ - EQUIPAMENTOS","PROPPG","CLOG","2015-03-23","Realizando ajustes após emissão de parecer jurídico.","verificar CNPJ da empresa vencedora\nverificar se houve pagamento"]
["01/2014",962,"006591/2014","Aquisição de KIT Nefa (ácidos graxos não estereficados)","Aquisição de KIT Nefa (ácidos graxos não estereficados)",160107,"PROAP - MEDICINA VETERINÁRIA","PROGRAMA DE PÓS-GRADUAÇÃO EM MEDICINA VETERINÁRIA","CLOG","2015-03-30","Realizando ajustes após emissão de parecer jurídico.","verificar CNPJ da empresa vencedora\nverificar se houve pagamento"]
["17/2014",1333,"006282/2014","Aquisição de criostato para cortes em congelados","Aquisição de criostato para cortes em congelados",160001,"PRÓ - EQUIPAMENTOS","PROPPG","CLOG","2015-03-05","Buscando informações.","Nenhum empenho encontrado no SISCNE."]
["19/2014",1278,"005685/2014","Aquisição de estação de lavagem Bioplex","Aquisição de estação de lavagem Bioplex",160001,"PRÓ - EQUIPAMENTOS","PROPPG","CLOG","2015-02-06","Já houve empenho (2014NE802215) e foi entregue no Almoxarifado em 02/03/15.","verificar CNPJ da empresa vencedora\nverificar se houve pagamento"]
["12/2014",1335,"006280/2014","Aquisição de microscópio de fluorescencia BX43-L-FL-URA-I 00","Aquisição de microscópio de fluorescencia BX43-L-FL-URA-I 00",160001,{"$f":"IFERROR(VLOOKUP(F417,$A$994:$B$1311,2,0),\"\")","v":"PRÓ - EQUIPAMENTOS"},"PROPPG","CLOG","2015-03-27","Realizando ajustes após emissão de parecer jurídico.","verificar CNPJ da empresa vencedora\nverificar se houve pagamento"]
["12/2014",1332,"006283/2014","Aquisição de contador automático de células Moxi ZTM","Aquisição de contador automático de células Moxi ZTM",160001,"PRÓ - EQUIPAMENTOS","PROPPG","PRO-REITORIA DE PESQUISA E POS-GRADUAÇÃO","2015-05-11","Realizando ajustes após emissão de parecer jurídico.","verificar CNPJ da empresa vencedora\nverificar se houve pagamento"]
["15/2014",1331,"006284/2014","Aquisição de microscópio trinolucar","Aquisição de microscópio trinolucar",160001,"PRÓ - EQUIPAMENTOS","PROPPG","CLOG","2015-02-06","Já houve empenho (2014NE802219), mas faltam informações sobre a entrega.","verificar CNPJ da empresa vencedora\nverificar se houve pagamento"]
["06/2014",1519,"002971/2014","Aquisição de protetor contra surto e tensão","Aquisição de protetor contra surto e tensão",100300,"PREFEITURA UNIVERSITÁRIA","DIVISÃO DE SERVIÇOS GERAIS","DIREÇÃO DMSA","2014-11-05","Realizando nova cotação eletrônica para tentar negociar com base no preço de referência.","Não foi localizado na sala da Direção."]
["05/2014",465,"002674/2014","Conserto de dois no-breaks","Conserto de dois no-breaks",220100,"DEPARTAMENTO DE BIOLOGIA ANIMAL","ÁREA DE HISTOLOGIA E EMBRIOLOGIA","SEÇÃO DE CONTROLE","2014-10-30","Já houve empenho (2014NE802023) e  foi entregue no Almoxarifado em 19/12/14.","verificar CNPJ da empresa vencedora\nverificar se houve pagamento"]
["18/2014",1033,"004906/2014","Aquisição de videogastroscópio pediátrico ultra-fino Olympus (grupo 52.08)","Aquisição de videogastroscópio pediátrico ultra-fino Olympus (grupo 52.08)",280010,"HOSPITAL VETERINÁRIO","HOSPITAL VETERINÁRIO","CLOG","2014-05-11","Aguardando autorização da PROAF para empenho.","verificar CNPJ da empresa vencedora\nverificar se houve pagamento"]
["32/2014",1342,"006361/2014","Aquisição de suprimentos para impressoras (grupo 30.17)","Aquisição de suprimentos para impressoras (grupo 30.17)",100200,"IMPRENSA UNIVERSITÁRIA","IMPRENSA UNIVERSITÁRIA","SCD","2014-12-23","Realizando ajustes após emissão de parecer jurídico.","verificar CNPJ da empresa vencedora\nverificar se houve pagamento"]
["01/2014",868,"006333/2014","Aquisição de cartuchos HP (grupo 30.17)","Aquisição de cartuchos HP (grupo 30.17)",250020,"LICENCIATURA EM EDUCAÇÃO DO CAMPO - PROCAMPO","CURSO DE LICENCIATURA EM EDUCAÇÃO DO CAMPO","INSTITUTO DE EDUCAÇÃO","2015-04-10","Já houve empenho (2014NE802494) e  foi entregue no Almoxarifado em 16/12/14.","verificar CNPJ da empresa vencedora\nverificar se houve pagamento"]
["01/2014",1064,"006333/2014","Aquisição de cartuchos HP (grupo 30.17)","Aquisição de cartuchos HP (grupo 30.17)",160106,"PROAP - FITOTECNIA","PROGRAMA DE PÓS-GRADUAÇÃO EM FITOTECNIA","INSTITUTO DE EDUCAÇÃO","2015-04-10","Já houve empenho (2014NE802494) e  foi entregue no Almoxarifado em 16/12/14.","verificar CNPJ da empresa vencedora\nverificar se houve pagamento"]
["249/2014",1431,"007142/2014","Pagamento de inscrição dos servidores Gabriel Esteves e Janaina da Silva no 8º Congresso de secretários das universidades brasileiras","Pagamento de inscrição dos servidores Gabriel Esteves e Janaina da Silva no 8º Congresso de secretários das universidades brasileiras",140000,"PRÓ-REITORIA DE ENSINO E GRADUAÇÃO","PRÓ-REITORIA DE GRADUAÇÃO","ARQUIVO","2015-03-06","Desarquivado pela CODEP para realizar o relatório anual de cursos  do Governo Federal e em breve será novamente arquivado.\nArquivado porque  houve empenho (2014NE801509) e pagamento (2014GR800110).","atualizado 14/04/2015"]
["50/2014",1440,"007185/2014","Pagamento de inscrição do servidor José Carlos no Congresso de Secretárops - CONSUB","Pagamento de inscrição do servidor José Carlos no Congresso de Secretárops - CONSUB",240000,"INSTITUTO DE CIÊNCIAS HUMANAS E SOCIAIS","DEPARTAMENTO DE FILOSOFIA","ARQUIVO","2015-03-06","Desarquivado pela CODEP para realizar o relatório anual de cursos  do Governo Federal e em breve será novamente arquivado.\nJá houve empenho (2014NE801510), mas o pagamento ainda não foi efetuado.","atualizado 14/04/2015"]
["08/2014",958,"005725/2014","Aquisição de lâmpadas (grupo 30.29)","Aquisição de lâmpadas (grupo 30.29)",280000,"INSTITUTO DE VETERINÁRIA","DEPARTAMENTO DE MICROBIOLOGIA E IMUNOLOGIA VETERINÁRIA","CLOG","2014-09-25","Já houve empenho (2014NE801699 e 2014NE801698) e  foi entregue no Almoxarifado em 04/11/14 e 05/11/14.","verificar CNPJ da empresa vencedora\nverificar se houve pagamento"]
["115/2014",921,"005725/2014","Aquisição de lâmpadas (grupo 30.29)","Aquisição de lâmpadas (grupo 30.29)",150000,"PRÓ-REITORIA DE EXTENSÃO","DEPARTAMENTO DE LOGÍSTICA E INFRAESTRUTURA","CLOG","2014-09-25","Já houve empenho (2014NE801699 e 2014NE801698) e  foi entregue no Almoxarifado em 04/11/14 e 05/11/14.","verificar CNPJ da empresa vencedora\nverificar se houve pagamento"]
["11/2014",970,"005725/2014","Aquisição de lâmpadas (grupo 30.29)","Aquisição de lâmpadas (grupo 30.29)",220100,"DEPARTAMENTO DE BIOLOGIA ANIMAL","ÁREA DE HISTOLOGIA E EMBRIOLOGIA","CLOG","2014-09-25","Já houve empenhos (2014NE801699 e 2014NE801698) e  foram entregues no Almoxarifado em 04/11/14 e 05/11/14.","verificar CNPJ da empresa vencedora\nverificar se houve pagamento"]
["22/2014",1063,"005203/2014","Contratação de serviços para tratamento preventivo e curativo de descupinização","Contratação de serviços para tratamento preventivo e curativo de descupinização",220300,"DEPARTAMENTO DE CIÊNCIAS FISIOLÓGICAS","DEPARTAMENTO DE CIÊNCIAS FISIOLÓGICAS","DEPARTAMENTO DE CIENCIAS FISIOLOGICAS","2015-05-06","Realizando alteração de pregoeiro em virtude de férias e em breve o pregão será agendado.","verificar CNPJ da empresa vencedora\nverificar se houve pagamento"]
["07/2014",932,"005204/2014","Aquisição de artigos cirúrgicos e de enfermaria (somente para o Hospital Veterinário (grupo 30.36)","Aquisição de artigos cirúrgicos e de enfermaria (somente para o Hospital Veterinário (grupo 30.36)",280010,"HOSPITAL VETERINÁRIO","HOSPITAL VETERINÁRIO","SPP","2014-07-22","Pesquisa de preço.","verificar porque está na Pesquisa até hoje"]
["131/2014",1013,"005726/2014","Aquisição de artigos cirúrgicos e de enfermaria (somente para o Posto Médico (grupo 30.36)","Aquisição de artigos cirúrgicos e de enfermaria (somente para o Posto Médico (grupo 30.36)",100070,"POSTO MÉDICO","DIVISÃO DE SAÚDE","ASTEC","2015-03-12","Elaboração da minuta de edital.","Ajustes da LC 123. - Buscar informações"]
["09/2014",959,"005735/2014","Aquisição de equipamentos industriais - banho Maria, moinho, máquina de costura, fogão, liquidificador e seladora (grupo 52.28)","Aquisição de equipamentos industriais - banho Maria, moinho, máquina de costura, fogão, liquidificador e seladora (grupo 52.28)",280300,"DEPTO DE MICROBIOLOGIA E IMUNOLOGIA VETERINÁRIA","DEPTO DE MICROBIOLOGIA E IMUNOLOGIA VETERINÁRIA","ASSESSORIA TECNICA/DMSA","2015-04-30","Pesquisa de preço.","verificar porque está na Pesquisa até hoje"]
["07/2014",1269,"005735/2014","Aquisição de equipamentos industriais - banho Maria, moinho, máquina de costura, fogão, liquidificador e seladora (grupo 52.28)","Aquisição de equipamentos industriais - banho Maria, moinho, máquina de costura, fogão, liquidificador e seladora (grupo 52.28)",150600,"PROEXT - APOIO À PRÁTICAS TRADICIONAIS NO USO DE PLANTAS MEDICINAIS","Projeto PROEXT-MEC 2014","ASSESSORIA TECNICA/DMSA","2015-04-30","Pesquisa de preço.","verificar porque está na Pesquisa até hoje"]
["06/2014",1183,"005735/2014","Aquisição de equipamentos industriais - banho Maria, moinho, máquina de costura, fogão, liquidificador e seladora (grupo 52.28)","Aquisição de equipamentos industriais - banho Maria, moinho, máquina de costura, fogão, liquidificador e seladora (grupo 52.28)",150000,"PRÓ-REITORIA DE EXTENSÃO","PRÓ-REITORIA DE EXTENSÃO","ASSESSORIA TECNICA/DMSA","2015-04-30","Pesquisa de preço.","verificar porque está na Pesquisa até hoje"]
["03/2014",873,"005735/2014","Aquisição de equipamentos industriais - banho Maria, moinho, máquina de costura, fogão, liquidificador e seladora (grupo 52.28)","Aquisição de equipamentos industriais - banho Maria, moinho, máquina de costura, fogão, liquidificador e seladora (grupo 52.28)",150000,"PRÓ-REITORIA DE EXTENSÃO","PRÓ-REITORIA DE EXTENSÃO","ASSESSORIA TECNICA/DMSA","2015-04-30","Pesquisa de preço.","verificar porque está na Pesquisa até hoje"]
["03/2014",1182,"005735/2014","Aquisição de equipamentos industriais - banho Maria, moinho, máquina de costura, fogão, liquidificador e seladora (grupo 52.28)","Aquisição de equipamentos industriais - banho Maria, moinho, máquina de costura, fogão, liquidificador e seladora (grupo 52.28)",150000,"PRÓ-REITORIA DE EXTENSÃO","PRÓ-REITORIA DE EXTENSÃO","ASSESSORIA TECNICA/DMSA","2015-04-30","Pesquisa de preço.","verificar porque está na Pesquisa até hoje"]
["30/2014",1337,"006343/2014","Aquisição de materiais de expediente e pasta vetro-laterial (grupos 30.16B e 30.16)","Aquisição de materiais de expediente e pasta vetro-laterial (grupos 30.16B e 30.16)",100200,"IMPRENSA UNIVERSITÁRIA","IMPRENSA UNIVERSITÁRIA","CPACS","2015-03-10","Consolidar Pesquisas de Preços","atualizado 14/04/2015"]
["277/2014",1221,"006343/2014","Aquisição de materiais de expediente e pasta vetro-laterial (grupos 30.16B e 30.16)","Aquisição de materiais de expediente e pasta vetro-laterial (grupos 30.16B e 30.16)",110300,"DEPARTAMENTO DE PESSOAL","SECRETARIA","CPACS","2015-03-10","Consolidar Pesquisas de Preços","atualizado 14/04/2015"]
["31/2014",1343,"006363/2014","Aquisição de tintas para máquina RISO","Aquisição de tintas para máquina RISO",100200,"IMPRENSA UNIVERSITÁRIA","IMPRENSA UNIVERSITÁRIA","SPP","2015-04-02","Realizando ajustes após emissão de parecer jurídico.","atualizado 14/04/2015"]
["07/2014",955,"006390/2014","Aquisição de material químico sujeito à controle governamental (grupo 30.11A)","Aquisição de material químico sujeito à controle governamental (grupo 30.11A)",220410,"LABORATÓRIO OFICIAL DE DIAGNÓSTICO FITOSSANITÁRIO","LABORATÓRIO OFICIAL DE DIAGNÓSTICO FITOSSANITÁRIO","ASSESSORIA TECNICA/DMSA","2015-05-07","Realizando ajustes na minuta de edital após solicitação de aumento do quantitativo e reenquadramento como SRP, realizadas pelo Pró-reitora de Assuntos Financeiros.","VERIFICAR O NÚMERO DO PREGÃO E QUANDO SERÁ O PREGÃO"]
["167/2014",1354,"006390/2014","Aquisição de material químico sujeito à controle governamental (grupo 30.11A)","Aquisição de material químico sujeito à controle governamental (grupo 30.11A)",230300,"DEPARTAMENTO DE QUÍMICA","DEPARTAMENTO DE QUÍMICA","ASSESSORIA TECNICA/DMSA","2015-05-07","Realizando ajustes na minuta de edital após solicitação de aumento do quantitativo e reenquadramento como SRP, realizadas pelo Pró-reitora de Assuntos Financeiros.","VERIFICAR O NÚMERO DO PREGÃO E QUANDO SERÁ O PREGÃO"]
["166/2014",1353,"006087/2014","Aquisição de material químico (grupo 30.11)","Aquisição de material químico (grupo 30.11)",230300,"DEPARTAMENTO DE QUÍMICA","DEPARTAMENTO DE QUÍMICA","SPP","2014-08-21","Pesquisa de preço.","verificar porque está na Pesquisa até hoje"]
["24/2014",1175,"006087/2014","Aquisição de material químico (grupo 30.11)","Aquisição de material químico (grupo 30.11)",220300,"DEPARTAMENTO DE CIÊNCIAS FISIOLÓGICAS","DEPARTAMENTO DE CIÊNCIAS FISIOLÓGICAS","SPP","2014-08-21","Pesquisa de preço.","verificar porque está na Pesquisa até hoje"]
["24/2014",1175,"006087/2014","Aquisição de material químico (grupo 30.11)","Aquisição de material químico (grupo 30.11)",220300,"DEPARTAMENTO DE CIÊNCIAS FISIOLÓGICAS","DEPARTAMENTO DE CIÊNCIAS FISIOLÓGICAS","SPP","2014-08-21","Pesquisa de preço.","verificar porque está na Pesquisa até hoje"]
["27/2014",1379,"006501/2014","Aquisição de cesto aéreo de cabine dupla para adaptação em um caminhão Munck","Aquisição de cesto aéreo de cabine dupla para adaptação em um caminhão Munck",100300,"PREFEITURA UNIVERSITÁRIA","DIVISÃO DE SERVIÇOS GERAIS","SPP","2015-04-29","Elaboração da minuta de edital.","VERIFICAR O NÚMERO DO PREGÃO E QUANDO SERÁ O PREGÃO"]
["18/2014",1407,"007038/2014","Aquisição de tanque para fabricação de queijo","Aquisição de tanque para fabricação de queijo",180000,"CTUR","CTUR","ASSESSORIA TECNICA/DMSA","2015-04-24","Elaboração da minuta de edital.","Mauro informou (05/03/15) que há um problema na especificação do objeto, que está atrasando a elaboração do edital."]
["37/2014",1438,"007162/2014","Manutenção de equipamentos da Imprensa Universitária (guilhotina, furador, grampeador, etc)","Manutenção de equipamentos da Imprensa Universitária (guilhotina, furador, grampeador, etc)",100200,{"$f":"IFERROR(VLOOKUP(F449,$A$994:$B$1311,2,0),\"\")","v":"IMPRENSA UNIVERSITÁRIA"},"DIRETORIA","IMPRENSA UNIVERSITÁRIA","2014-12-01","O requerente solicitou o processo para realizar ajustes no reqmat (os pedidos serão refeitos em 2015).","atualizado 15/04/2015"]
["42/2014",1460,"007272/2014","Serviço de instalação e programação de 4 (quatro) placas de 8 ramais Corp 16000","Serviço de instalação e programação de 4 (quatro) placas de 8 ramais Corp 16000",260000,"INSTITUTO DE FLORESTAS","DIRETORIA","INSTITUTO DE FLORESTAS","2015-02-27","As propostas serão solicitadas em breve para realização de dispensa.","atualizado 15/04/2015"]
["04/2014",306,"007547/2014","Aquisição de racks e mini-isolador para ratos",{"$f":"D451","v":"Aquisição de racks e mini-isolador para ratos"},220300,"DEPARTAMENTO DE CIÊNCIAS FISIOLÓGICAS","DEPARTAMENTO DE CIÊNCIAS FISIOLÓGICAS","SPP","2014-09-01","Pesquisa de preço.","verificar porque está na Pesquisa até hoje"]
["01/2014",1487,"007553/2014","Aquisição de materiais de consumo para o Restaurante Universitário","Aquisição de materiais de consumo para o Restaurante Universitário",130100,"RESTAURANTE UNIVERSITÁRIO - CAMPUS SEROPÉDICA","RESTAURANTE UNIVERSITÁRIO - CAMPUS SEROPÉDICA","PROAES","2014-11-12","Já houve empenho (2014NE802129), mas o prazo de entrega está vencido e um ofício de cobrança foi emitido à empresa em 08/12/14.","atualizado 15/04/2015"]
["21/2014",1480,"007505/2014","Aquisição de equipamentos agrícolas - tanque, plantadeiras, podão, pulverizador, arado, carreta, etc (grupo 52.40)","Aquisição de equipamentos agrícolas - tanque, plantadeiras, podão, pulverizador, arado, carreta, etc (grupo 52.40)",180000,"CTUR","CTUR","SPP","2014-09-02","Pesquisa de preço.","verificar porque está na Pesquisa até hoje"]
["30/2014",1479,"007504/2014","Aquisição de ordenhadeira móvel (grupo 52.40)","Aquisição de ordenhadeira móvel (grupo 52.40)",180000,"CTUR","CTUR","CLOG","2014-11-17","Já houve empenho (2014NE802182) e a data prevista de entrega é até 23/12/14.","verificar CNPJ da empresa vencedora\nverificar se houve pagamento"]
["25/2014",1478,"007548/2014","Aquisição de material hidráulico - tubo ultra JE, luva de correr (grupo 30.24)","Aquisição de material hidráulico - tubo ultra JE, luva de correr (grupo 30.24)",180000,"CTUR","CTUR","SIRERR","2015-04-10",null,"Verificar o motivo do processo está na SIRERR"]
["39/2014",1458,"007549/2014","Aquisição de cadeiras ergométricas","Aquisição de cadeiras ergométricas",260000,"INSTITUTO DE FLORESTAS","INSTITUTO DE FLORESTAS","CLOG","2014-11-13","Já houve empenho (2014NE802194) e a data prevista de entrega é até 23/12/14.","verificar CNPJ da empresa vencedora\nverificar se houve pagamento"]
["01/2014",1485,"007549/2014","Aquisição de cadeiras ergométricas","Aquisição de cadeiras ergométricas",120000,"PRÓ-REITORIA DE ASSUNTOS FINANCEIROS","SECRETARIA DA PRÓ-REITORIA DE ASSUNTOS FINANCEIROS","CLOG","2014-11-13","Já houve empenho (2014NE802194) e a data prevista de entrega é até 23/12/14.","verificar CNPJ da empresa vencedora\nverificar se houve pagamento"]
["24/2014",1426,"007531/2014","Aquisição de micro trator (grupo 52.52)","Aquisição de micro trator (grupo 52.52)",180000,"CTUR","CTUR","ARQUIVO","2015-03-14","Foi atendido pelo 008123/2011, houve empenho (2014NE802609) e foi encaminhado ao CTUR para ciência.","por que foi arquivado?"]
["108/2014",1389,"007693/2014","Aquisição em caráter de urgência de cartucho para impressora","Aquisição em caráter de urgência de cartucho para impressora",100300,"PREFEITURA UNIVERSITÁRIA","DIVISÃO DE OBRAS","SEÇÃO DE CONTROLE","2014-11-12","Já houve empenho (2014NE802156) e foi entregue no Almoxarifado em 25/11/14.","verificar CNPJ da empresa vencedora\nverificar se houve pagamento"]
["05/2014",1416,"006680/2014","Conserto de câmara fria para conservação de sementes","Conserto de câmara fria para conservação de sementes",160106,"PROAP - FITOTECNIA","PROGRAMA DE PÓS-GRADUAÇÃO EM FITOTECNIA","ANEXADO    23083.006058/2014-01","2014-10-30","O empenho já foi emitido (2014NE802290) e transmitido à empresa. A prestação do serviço já pode ser iniciada (20 dias para execução). (anexado ao 006058/2014).","verificar CNPJ da empresa vencedora\nverificar se houve pagamento"]
["18/2014",1279,"006506/2014","Aquisição de sistema Bio-plex MagPix Sistema Bio-plex MagPix","Aquisição de sistema Bio-plex MagPix Sistema Bio-plex MagPix",160001,"PRÓ - EQUIPAMENTOS","PROPPG","CLOG","2015-02-06","Já houve empenho (2014NE802216), mas faltam informações sobre a entrega.","verificar CNPJ da empresa vencedora\nverificar se houve pagamento"]
["08/2014",1508,"007802/2014","Contratação de serviços de palestra motivacional do dia do servidor","Contratação de serviços de palestra motivacional do dia do servidor",10310,"CAPACITAÇÃO DE SERVIDORES - RECURSOS ESPECÍFICOS","COORDENAÇÃO DE DESENVOLVIMENTO DE PESSOAS","COORD. DE DESENSOLVIMENTO DE PESSOA","2015-03-10","Desarquivado pela CODEP para realizar o relatório anual de cursos  do Governo Federal e em breve será novamente arquivado.\nHouve empenho (2014NE801969) e pagamento (2014OB809249).","atualizado 15/04/2015"]
["33/2014",1344,"006364/2014","Aquisição de papel 40 Kg","Aquisição de papel 40 Kg",100200,"IMPRENSA UNIVERSITÁRIA","IMPRENSA UNIVERSITÁRIA","IMPRENSA UNIVERSITÁRIA","2014-10-21","A aquisição foi realizada através do processo 000614/2012 e o processo 006364/2014 será arquivado. ","atualizado 15/04/2015"]
["02/2014",62,"004379/2014","Aquisição de rack 8u","Aquisição de rack 8u",280400,"DEPARTAMENTO DE PARASITOLOGIA ANIMAL","DEPARTAMENTO DE PARASITOLOGIA ANIMAL","SEÇÃO DE CONTROLE","2014-10-27","Já houve empenho (2014NE802005) e foi entregue no Almoxarifado em 05/11/14.","verificar CNPJ da empresa vencedora\nverificar se houve pagamento"]
["06/2014",1273,"005786/2014","Aquisição de frascos de PET, válvulas, frascos de vidro (embalagens para produção de xaropes, doces e geléias)","Aquisição de frascos de PET, válvulas, frascos de vidro (embalagens para produção de xaropes, doces e geléias)",150600,"PROEXT - APOIO À PRÁTICAS TRADICIONAIS NO USO DE PLANTAS MEDICINAIS","Projeto PROEXT-MEC 2014 \"APOIO ÀS PRÁTICAS TRADICIONAIS...\"","SPP","2015-04-29","Elaboração da minuta de edital.","atualizado 12/03/2015"]
["01/2014",1274,"005786/2014","Aquisição de frascos de PET, válvulas, frascos de vidro (embalagens para produção de xaropes, doces e geléias)","Aquisição de frascos de PET, válvulas, frascos de vidro (embalagens para produção de xaropes, doces e geléias)",150600,"PROEXT - APOIO À PRÁTICAS TRADICIONAIS NO USO DE PLANTAS MEDICINAIS","Projeto PROEXT-MEC 2014 \"APOIO ÀS PRÁTICAS TRADICIONAIS...\"","SPP","2015-04-29","Elaboração da minuta de edital.","atualizado 12/03/2015"]
["05/2014",990,"005807/2014","Aquisição de itens do grupo 30.36 - Artigos cirúrgicos e de enfermaria","Aquisição de itens do grupo 30.36 - Artigos cirúrgicos e de enfermaria",280400,"DEPARTAMENTO DE PARASITOLOGIA ANIMAL","DEPARTAMENTO DE PARASITOLOGIA ANIMAL","PREGÃO","2015-03-10","Aguardando manifestação de interesse (IRP) de outros órgãos para realizar o pregão. Pregão nº 12/2015.","VERIFICAR O ANDAMENTO DO PREGÃO"]
["10/2014",969,"005807/2014","Aquisição de itens do grupo 30.36 - Artigos cirúrgicos e de enfermaria","Aquisição de itens do grupo 30.36 - Artigos cirúrgicos e de enfermaria",220100,"DEPARTAMENTO DE BIOLOGIA ANIMAL","IB - DEPARTAMENTO DE BIOLOGIA ANIMAL","PREGÃO","2015-03-10","Aguardando manifestação de interesse (IRP) de outros órgãos para realizar o pregão. Pregão nº 12/2015.","VERIFICAR O ANDAMENTO DO PREGÃO"]
["73/2014",934,"005807/2014","Aquisição de itens do grupo 30.36 - Artigos cirúrgicos e de enfermaria","Aquisição de itens do grupo 30.36 - Artigos cirúrgicos e de enfermaria",280100,"DEPARTAMENTO DE EPIDEMIOLOGIA E SAÚDE PÚBLICA","DEPARTAMENTO DE EPIDEMIOLOGIA E SAÚDE PÚBLICA","PREGÃO","2015-03-10","Aguardando manifestação de interesse (IRP) de outros órgãos para realizar o pregão. Pregão nº 12/2015.","VERIFICAR O ANDAMENTO DO PREGÃO"]
["08/2014",956,"005807/2014","Aquisição de itens do grupo 30.36 - Artigos cirúrgicos e de enfermaria","Aquisição de itens do grupo 30.36 - Artigos cirúrgicos e de enfermaria",220410,"LABORATÓRIO OFICIAL DE DIAGNÓSTICO FITOSSANITÁRIO","LABORATÓRIO OFICIAL DE DIAGNÓSTICO FITOSSANITÁRIO","PREGÃO","2015-03-10","Aguardando manifestação de interesse (IRP) de outros órgãos para realizar o pregão. Pregão nº 12/2015.","VERIFICAR O ANDAMENTO DO PREGÃO"]
["25/2014",1176,"005807/2014","Aquisição de itens do grupo 30.36 - Artigos cirúrgicos e de enfermaria","Aquisição de itens do grupo 30.36 - Artigos cirúrgicos e de enfermaria",220300,"DEPARTAMENTO DE CIÊNCIAS FISIOLÓGICAS","DEPARTAMENTO DE CIÊNCIAS FISIOLÓGICAS","PREGÃO","2015-03-10","Aguardando manifestação de interesse (IRP) de outros órgãos para realizar o pregão. Pregão nº 12/2015.","VERIFICAR O ANDAMENTO DO PREGÃO"]
["12/2014",1039,"004920/2014","Aquisição de sistema de vídeo endoscópio veterinário (grupo 52.08)","Aquisição de sistema de vídeo endoscópio veterinário (grupo 52.08)",280010,"HOSPITAL VETERINÁRIO","HOSPITAL VETERINÁRIO","SPP","2015-05-04","Em 22/09/14 o processo chegou à SSRP, com despacho da Profª. Nidia informando que a aquisição deverá ocorrer em 2015.","verificar CNPJ da empresa vencedora\nverificar se houve pagamento"]
["09/2014",1031,"004882/2014","Aquisição de trailer para transporte de animais","Aquisição de trailer para transporte de animais",280010,"HOSPITAL VETERINÁRIO","HOSPITAL VETERINÁRIO","DIVISÃO DE ADMINISTRAÇÃO FINANCEIRA","2015-04-29","Pregão nº 09/2015 (antigo nº 130/2014) com provável abertura em 02/03/15.","verificar CNPJ da empresa vencedora\nverificar se houve pagamento"]
["107/2014",1554,"007937/2014","Pagamento de inscrição para o servidor Joilson no XII Encontro Nacional da Associação Brasileira de Estudos Regionais e Urbanos","Pagamento de inscrição para o servidor Joilson no XII Encontro Nacional da Associação Brasileira de Estudos Regionais e Urbanos",600000,"INSTITUTO DE CIÊNCIAS SOCIAIS APLICADAS","DEPARTAMENTO DE CIÊNCIAS ECONÔMICAS","DEPARTAMENTO DE CIÊNCIAS ECONÔMICAS","2015-01-05","Já houve empenho (2014NE801893), mas o pagamento ainda não foi efetuado.","verificar CNPJ da empresa vencedora\nverificar se houve pagamento"]
["108/2014",1553,"007938/2014","Pagamento de inscrição para a Servidora Maria Viviana no XII Encontro Nacional da Associação de Estudos Regionais e Urbanos","Pagamento de inscrição para a Servidora Maria Viviana no XII Encontro Nacional da Associação de Estudos Regionais e Urbanos",600000,"INSTITUTO DE CIÊNCIAS SOCIAIS APLICADAS","DEPARTAMENTO DE CIÊNCIAS ECONÔMICAS","DEPARTAMENTO DE CIÊNCIAS ECONÔMICAS","2015-01-05","Já houve empenho (2014NE801895), mas o pagamento ainda não foi efetuado.","verificar CNPJ da empresa vencedora\nverificar se houve pagamento"]
["45/2014",1514,"007800/2014","Aquisição de nobreak","Aquisição de nobreak",260000,"INSTITUTO DE FLORESTAS","INSTITUTO DE FLORESTAS","INSTITUTO DE FLORESTAS","2015-05-11","Verificando a possibilidade de atendimento através do processo 003598/2013 (pregão nº 112/2014).","VERIFICAR O ANDAMENTO DO PREGÃO"]
["44/2014",1515,"007801/2014","Aquisição de nobreak 2KVA","Aquisição de nobreak 2KVA",260000,"INSTITUTO DE FLORESTAS","INSTITUTO DE FLORESTAS","INSTITUTO DE FLORESTAS","2015-05-11","Verificando a possibilidade de atendimento através do processo 003598/2013 (pregão nº 112/2014).","VERIFICAR O ANDAMENTO DO PREGÃO"]
["45/2014",1520,"007820/2014","Aquisição de grampeador rapid 90","Aquisição de grampeador rapid 90",110200,"SEÇÃO DE ARQUIVO E PROTOCOLO GERAL","SECAO DE ARQUIVO E PROTOCOLO GERAL","SEÇÃO DE CONTROLE","2014-11-26","Já houve empenho (2014NE802275) e a data prevista de entrega é até 01/01/15. ","verificar CNPJ da empresa vencedora\nverificar se houve pagamento"]
["16/2014",1523,"008048/2014","Contratação de serviço de pessoa jurídica para recuperação emergencial de rede de esgoto","Contratação de serviço de pessoa jurídica para recuperação emergencial de rede de esgoto",270000,"INSTITUTO DE TECNOLOGIA","INSTITUTO DE TECNOLOGIA","ARQUIVO","2015-03-19","Está sendo atendido pelo 010408/2014 e provavelmente em breve será encaminhado para empenho.","O processo ainda não chegou no protocolo em 04/02/15, mesmo a carga tendo sido de 29/01/15."]
["11/2014",1504,"007806/2014","Pagamento de inscrição da servidora Ana Maria Araújo da Silva no curso de retenções de tributos pelos órgãos e entidades","Pagamento de inscrição da servidora Ana Maria Araújo da Silva no curso de retenções de tributos pelos órgãos e entidades",10310,"CAPACITAÇÃO DE SERVIDORES - RECURSOS ESPECÍFICOS","DEPARTEAMENTO DE CONTABILIDADE E FINANÇAS/PROAF","ARQUIVO","2015-03-06","Desarquivado pela CODEP para realizar o relatório anual de cursos  do Governo Federal e em breve será novamente arquivado.\nArquivado porque  houve empenho (2014NE801738) e pagamento (2014GR800106).","atualizado 15/04/2015"]
["01/2014",35,"001161/2014","Serviço de editoração eletrônica e impressão dos volumes 22","Serviço de editoração eletrônica e impressão dos volumes 22",100000,{"$f":"IFERROR(VLOOKUP(F481,$A$994:$B$1311,2,0),\"\")","v":"REITORIA"},"DIRETORIA DO INSTITUTO DE FLORESTA","SPP","2015-03-30","Pregão nº 58/2014 finalizado em 25/09/14. O processo está disponível no Instituto de Florestas para solicitar empenhos.","verificar porque está na Pesquisa até hoje"]
["01/2014",51,"002085/2014","Contratação de empresa para serviços de dedetização, desratização e descupinização","Contratação de empresa para serviços de dedetização, desratização e descupinização",300001,"RESTAURANTE UNIVERSITÁRIO - NOVA IGUAÇU","RESTAURANTE UNIVERSITÁRIO - NOVA IGUAÇU","INSTITUTO MULTIDISCIPLINAR DE NOVA IGUAÇU","2015-05-11","Pregão nº 69/2014 finalizado em 08/09/14. O processo está disponível no Restaurante Universitário do Campus de Nova Iguaçu para solicitar empenhos.","verificar CNPJ da empresa vencedora\nverificar se houve pagamento"]
["01/2014",61,"004380/2014","Aquisição de capela de exaustão","Aquisição de capela de exaustão",280000,"INSTITUTO DE VETERINÁRIA","DEPARTAMENTO DE PARASITOLOGIA ANIMAL","ARQUIVO","2015-04-16","Já houve empenho (2014NE801379) e foi entregue no Almoxarifado em 17/09/14.","verificar CNPJ da empresa vencedora\nverificar se houve pagamento"]
["04/2014",93,"001931/2014","Pagamento de anuidade de Associação Nacional de Pós-graduaçãoo em Ciências Sociais, referente à 2014","Pagamento de anuidade de Associação Nacional de Pós-graduaçãoo em Ciências Sociais, referente à 2014",240000,"INSTITUTO DE CIÊNCIAS HUMANAS E SOCIAIS","PROGRAMA DE PÓS-GRADUAÇÃO EM CIÊNCIAS SOCIAIS","ARQUIVO","2014-09-26","Arquivado porque  houve empenho (2014NE000447) e pagamento (2014OB808074).","atualizado 15/04/2015"]
["01/2014",100,"001811/2014","Contratação de empresa brasileira de comunicação EBC, para publicação de atos administrativos realizados pelo DMSA","Contratação de empresa brasileira de comunicação EBC, para publicação de atos administrativos realizados pelo DMSA",120200,"DEPARTAMENTO DE MATERIAL E SERVIÇOS AUXILIARES","COORDENAÇÃO DE PLANEJAMENTO E ACOMPANHAMENTO DE COMPRAS","SPP","2015-05-04","O empenho foi emitido (2014NE800993) e a empresa está prestando o serviço.","atualizado 15/04/2015"]
["02/2014",110,"002087/2014","Aquisição de gêneros alimentícios - amendoim, arroz, café (grupo 30.07)","Aquisição de gêneros alimentícios - amendoim, arroz, café (grupo 30.07)",300001,"RESTAURANTE UNIVERSITÁRIO - NOVA IGUAÇU","RESTAURANTE UNIVERSITÁRIO - NOVA IGUAÇU","RESTAURANTE UNIVERSITÁRIO DO CAMPUS DE NOVA IGUAÇU","2014-12-02","Pregão nº 104/2014 finalizado em 09/10/14. O processo está disponível no Restaurante Universitário do Campus de Nova Iguaçu para solicitar empenhos.","verificar CNPJ da empresa vencedora\nverificar se houve pagamento"]
["07/2014",161,"002392/2014","Aquisição de gêneros alimentícios - Queijo minas frescal (grupo 30.07)","Aquisição de gêneros alimentícios - Queijo minas frescal (grupo 30.07)",300001,"RESTAURANTE UNIVERSITÁRIO - NOVA IGUAÇU","RESTAURANTE UNIVERSITÁRIO - NOVA IGUAÇU","RESTAURANTE UNIVERSITÁRIO DO CAMPUS DE NOVA IGUAÇU","2014-09-25","Pregão nº 73/2014 finalizado em 16/09/14. O processo está disponível no Restaurante Universitário do Instituto Multidisciplinar para solicitar empenhos.","verificar CNPJ da empresa vencedora\nverificar se houve pagamento"]
["07/2014",1486,"007514/2014","Contratação de serviço de coffee break ","Contratação de serviço de coffee break ",140530,"DOCÊNCIA NA EDUCAÇÃO INFANTIL","CURSO DE PÓS-GRADUAÇÃO \"DOCÊNCIA NA EDUCAÇÃO INFANTIL\"","ARQUIVO","2014-12-10","Arquivado porque  houve empenho (2014NE801963 e 2014NE801964) e pagamento (2014OB808318 e 2014OB808318)."]
["46/2014",1629,"008000/2014","Aquisição de furadeira elétrica de 2 furos","Aquisição de furadeira elétrica de 2 furos",110200,"SEÇÃO DE ARQUIVO E PROTOCOLO GERAL","SECAO DE ARQUIVO E PROTOCOLO GERAL","CLOG","2015-04-30",null,"verificar CNPJ da empresa vencedora\nverificar se houve pagamento"]
["21/2014",841,"000122/2014","Contratação de um serviço de TV por assinatura que contenha os canais ligados à educação e informação","Contratação de um serviço de TV por assinatura que contenha os canais ligados à educação e informação",100000,"REITORIA","ASSESSORIA DE INFORMAÇÃO E COMUNICAÇÃO","DIREÇÃO DMSA","2015-01-19","Não houve interessados em participar da dispensa de licitação e as devidas providências estão sendo adotadas.","atualizado 15/04/2015"]
["03/2014",1645,"008023/2014","Aquisição de bloco de recados e outros","Aquisição de bloco de recados e outros",140530,"DOCÊNCIA NA EDUCAÇÃO INFANTIL","INSTITUTO MULTIDISCIPLINAR - CURSO DE PÓS-GRADUAÇÃO \"DOCÊNCIA NA EDUCAÇÃO INFANTIL\"","DIREÇÃO DMSA","2015-01-26","Buscando informações.","Antes estava em pesquisa de preços."]
["03/2014",205,"007036/2014","Aquisição de gaiolas metabólicas para ratos","Aquisição de gaiolas metabólicas para ratos",220300,"DEPARTAMENTO DE CIÊNCIAS FISIOLÓGICAS","DEPARTAMENTO DE CIÊNCIAS FISIOLÓGICAS","ARQUIVO","2015-02-06","Arquivado porque o material foi atendido pelo processo 002709/2014 (pregão nº 110/2014).","Despacho do Rafael Martins em 26/01/15."]
["02/2014",309,"003830/2014","Instalação e fornecimento de dois mil metros de mangueira tipo lâmpada led de alto brilho","Instalação e fornecimento de dois mil metros de mangueira tipo lâmpada led de alto brilho",100300,"PREFEITURA UNIVERSITÁRIA","PREFEITURA","REITORIA","2015-03-17","Pregão nº 154/2014 finalizado em 24/11/14. Houve empenho (2014NE802433) e pagamento (2014OB809865). ","verificar CNPJ da empresa vencedora\nverificar se houve pagamento"]
["09/2014",1738,"008288/2014","Contratação de pessoa jurídica para prestação de serviço de banda musical","Contratação de pessoa jurídica para prestação de serviço de banda musical",10310,"CAPACITAÇÃO DE SERVIDORES - RECURSOS ESPECÍFICOS","COORDENAÇÃO DE DESENVOLVIMENTO DE PESSOAS","ARQUIVO","2014-12-15","Arquivado porque  houve empenho (2014NE802044) e pagamento (2014OB808988).","atualizado 15/04/2015"]
["10/2014",1739,"008289/2014","Contratação de pessoa jurídica para a prestação de serviço de montagem e desmontagem de uma estrutura de palco e serviços de sonorização","Contratação de pessoa jurídica para a prestação de serviço de montagem e desmontagem de uma estrutura de palco e serviços de sonorização",10310,"CAPACITAÇÃO DE SERVIDORES - RECURSOS ESPECÍFICOS","COORDENAÇÃO DE DESENVOLVIMENTO DE PESSOAS","ARQUIVO","2014-12-01","Arquivado porque  houve empenho (2014NE802043) e pagamento (2014OB808200 e 2014OB808201).","atualizado 15/04/2015"]
["02/2014",1339,"006398/2014","Contratação de serviço de manutenção de sistema de segurança eletrônico","Contratação de serviço de manutenção de sistema de segurança eletrônico",120200,"DEPARTAMENTO DE MATERIAL E SERVIÇOS AUXILIARES","ALMOXARIFADO CENTRAL","DIVISÃO DE ADMINISTRAÇÃO FINANCEIRA","2015-04-30","Já houve empenho (2014NE801962) e a previsão de início da prestação do serviço é até 06/02/15.","verificar CNPJ da empresa vencedora\nverificar se houve pagamento"]
["48/2014","S/Nº","007877/2014","Pagamento de inscrição do servidor Carlos Alberto Gomes da Rocha no curso de como resumir, indexar e classificar documentos","Pagamento de inscrição do servidor Carlos Alberto Gomes da Rocha no curso de como resumir, indexar e classificar documentos",110200,"SEÇÃO DE ARQUIVO E PROTOCOLO GERAL","SEÇÃO DE ARQUIVO E PROTOCOLO GERAL","ARQUIVO","2015-05-06","Já houve empenho (2014NE801894), mas o pagamento ainda não foi efetuado.","verificar CNPJ da empresa vencedora\nverificar se houve pagamento"]
["06/2014",1184,"006354/2014","Aquisição de itens do grupo 52.42 (cavalete e tela de proteção)","Aquisição de itens do grupo 52.42 (cavalete e tela de proteção)",150600,"PROEXT - APOIO À PRÁTICAS TRADICIONAIS NO USO DE PLANTAS MEDICINAIS","PROJETO PROEXT-MEC 2014 \"ESTRATÉGIAS PARA DESENVOLVIMENTO DE CADEIA PRODUTIVA COM ABELHAS POR MEIOO DA CAPACITAÇÃO E ASSISTÊNCIA TÉCNICA\"","SEÇÃO DE CONTROLE","2014-10-27","Já houve empenho (2014NE802003) e  foi entregue no Almoxarifado em 12/11/14.","verificar CNPJ da empresa vencedora\nverificar se houve pagamento"]
["05/2014",1185,"006354/2014","Aquisição de itens do grupo 52.42 (cavalete e tela de proteção)","Aquisição de itens do grupo 52.42 (cavalete e tela de proteção)",150600,"PROEXT - APOIO À PRÁTICAS TRADICIONAIS NO USO DE PLANTAS MEDICINAIS","Projeto PROEXT-MEC 2014 \"APOIO ÀS PRÁTICAS TRADICIONAIS...\"","SEÇÃO DE CONTROLE","2014-10-27","Já houve empenho (2014NE802003) e  foi entregue no Almoxarifado em 12/11/14.","verificar CNPJ da empresa vencedora\nverificar se houve pagamento"]
["11/2014",1186,"006354/2014","Aquisição de itens do grupo 52.42 (cavalete e tela de proteção)","Aquisição de itens do grupo 52.42 (cavalete e tela de proteção)",150600,"PROEXT - APOIO À PRÁTICAS TRADICIONAIS NO USO DE PLANTAS MEDICINAIS","PROJETO PROEXT-MEC 2014 \"MÃOS QUE CRIAM - PROJETO DE CAPACITAÇÃO PARA PROMOÇÃO SOCIAL\"","SEÇÃO DE CONTROLE","2014-10-27","Já houve empenho (2014NE802003) e  foi entregue no Almoxarifado em 12/11/14.","verificar CNPJ da empresa vencedora\nverificar se houve pagamento"]
["16/2014",1476,"007506/2014","Pagamento de inscriçãoo no XVIII Seminário Nacional de Bibliotecas Universitárias Belo Horizonte-MG das servidoras Letícia Schettini, Eliane Maricá Soares e Silvia Alves de Andrade","Pagamento de inscriçãoo no XVIII Seminário Nacional de Bibliotecas Universitárias Belo Horizonte-MG das servidoras Letícia Schettini, Eliane Maricá Soares e Silvia Alves de Andrade",10310,"CAPACITAÇÃO DE SERVIDORES - RECURSOS ESPECÍFICOS","REITORIA/BIBLIOTECA","SAPG","2015-03-24","Já houve empenho (2014NE802101), mas o pagamento ainda não foi efetuado.","verificar CNPJ da empresa vencedora\nverificar se houve pagamento"]
["17/2014",1477,"007506/2014","Pagamento de inscriçãoo no XVIII Seminário Nacional de Bibliotecas Universitárias Belo Horizonte-MG das servidoras Letícia Schettini, Eliane Maricá Soares e Silvia Alves de Andrade","Pagamento de inscriçãoo no XVIII Seminário Nacional de Bibliotecas Universitárias Belo Horizonte-MG das servidoras Letícia Schettini, Eliane Maricá Soares e Silvia Alves de Andrade",10310,"CAPACITAÇÃO DE SERVIDORES - RECURSOS ESPECÍFICOS","REITORIA/BIBLIOTECA","SAPG","2015-03-24","Já houve empenho (2014NE802101), mas o pagamento ainda não foi efetuado.","verificar CNPJ da empresa vencedora\nverificar se houve pagamento"]
["06/2014",1284,"006507/2014","Aquisição de sistema protean I12 IEF, 90-240 vac","Aquisição de sistema protean I12 IEF, 90-240 vac",160001,{"$f":"IFERROR(VLOOKUP(F503,$A$997:$B$1314,2,0),\"\")","v":"PRÓ - EQUIPAMENTOS"},"PROPPG","CLOG","2015-02-26","Já houve empenho (2014NE802210), mas faltam informações sobre a entrega.","verificar CNPJ da empresa vencedora\nverificar se houve pagamento"]
["20/2014",1862,"009286/2014","Pagamento de inscriçãoo no V SIMGEO Simpósio Brasileiro de Ciências Geodésicas e Tecnologias da Geoinformação","Pagamento de inscriçãoo no V SIMGEO Simpósio Brasileiro de Ciências Geodésicas e Tecnologias da Geoinformação",270000,{"$f":"IFERROR(VLOOKUP(F504,$A$994:$B$1311,2,0),\"\")","v":"INSTITUTO DE TECNOLOGIA"},"DEPARTAMENTO DE ENGENHARIA","ARQUIVO","2015-03-06","Desarquivado pela CODEP para realizar o relatório anual de cursos  do Governo Federal e em breve será novamente arquivado.\nArquivado porque  houve empenho (2014NE802153) e pagamento (2014OB808998).","atualizado 15/04/2015"]
["08/2014",1730,"008306/2014","Aquisição de seis rádios radio transceptores","Aquisição de seis rádios radio transceptores",500030,{"$f":"IFERROR(VLOOKUP(F505,$A$994:$B$1311,2,0),\"\")","v":"PROGRAMA INGLÊS SEM FRONTEIRAS"},"INGLÊS SEM FRONTEIRAS","CLOG","2014-11-28","Já houve empenho (2014NE802333) e a data prevista de entrega é até 31/12/14. ","verificar CNPJ da empresa vencedora\nverificar se houve pagamento"]
["21/2014",1863,"009285/2014","Pagamento de inscrição da profª. Alessandra Carreiro no V Simpósio Brasileiro de Ciências Geodésicas","Pagamento de inscrição da profª. Alessandra Carreiro no V Simpósio Brasileiro de Ciências Geodésicas",100000,{"$f":"IFERROR(VLOOKUP(F506,$A$997:$B$1314,2,0),\"\")","v":"REITORIA"},"INSTITUTO DE TECNOLOGIA","ARQUIVO","2015-03-06","Desarquivado pela CODEP para realizar o relatório anual de cursos  do Governo Federal e em breve será novamente arquivado.\nArquivado porque  houve empenho (2014NE802155) e pagamento (2014OB808997).","atualziado 15/04/2015"]
["08/2014",1282,"006503/2014","Aquisição de FTIR para análise de sólidos","Aquisição de FTIR para análise de sólidos",160001,{"$f":"IFERROR(VLOOKUP(F507,$A$997:$B$1314,2,0),\"\")","v":"PRÓ - EQUIPAMENTOS"},"PROPPG","CLOG","2015-02-26","Já houve empenho (2014NE802207), mas faltam informações sobre a entrega.","verificar CNPJ da empresa vencedora\nverificar se houve pagamento"]
["20/2014",986,"005730/2014","Manutenção mensal de guilhotina automática","Manutenção mensal de guilhotina automática",100200,{"$f":"IFERROR(VLOOKUP(F508,$A$997:$B$1314,2,0),\"\")","v":"IMPRENSA UNIVERSITÁRIA"},"DIRETORIA","DRA. IVANI","2015-04-13","Emissão de parecer Jurídico","verificar CNPJ da empresa vencedora\nverificar se houve pagamento"]
["01/2014",1741,"008307/2014","Serviço de editoração e impressão de livros","Serviço de editoração e impressão de livros",140510,{"$f":"IFERROR(VLOOKUP(F509,$A$994:$B$1311,2,0),\"\")","v":"CONSELHO ESCOLAR"},"CURSO DE EXTENSÃO CONSELHO ESCOLAR","SEC. ADM. DO DEPTO DE CONTABILIDADE E FINANÇAS","2015-05-12","Realizando ajustes após emissão de parecer jurídico."]
["01/2014",1742,"008307/2014","Serviço de editoração e impressão de livros","Serviço de editoração e impressão de livros",140510,{"$f":"IFERROR(VLOOKUP(F510,$A$994:$B$1311,2,0),\"\")","v":"CONSELHO ESCOLAR"},"CURSO DE EXTENSÃO CONSELHOS MUNICIPAIS DE EDUCAÇÃO","SEC. ADM. DO DEPTO DE CONTABILIDADE E FINANÇAS","2015-05-12","Realizando ajustes após emissão de parecer jurídico."]
["479/2014",1916,"009793/2014","Inscrição de Raquel Ramos de Souza Ferreira no curso de libras língua brasileira de sinais","Inscrição de Raquel Ramos de Souza Ferreira no curso de libras língua brasileira de sinais",10310,{"$f":"IFERROR(VLOOKUP(F511,$A$997:$B$1314,2,0),\"\")","v":"CAPACITAÇÃO DE SERVIDORES - RECURSOS ESPECÍFICOS"},"DEPARTAMENTO PESSOAL","ARQUIVO","2015-04-28","Já houve empenho (2014NE802166), mas o pagamento ainda não foi efetuado.","verificar CNPJ da empresa vencedora\nverificar se houve pagamento"]
["07/2014",1283,"006502/2014","Aquisição de sistema de concentração de amostras","Aquisição de sistema de concentração de amostras",160001,"PRÓ - EQUIPAMENTOS","PROPPG","CLOG","2015-01-28","Já houve empenho (2014NE802213) e a data prevista de entrega é até 09/03/15. ","verificar CNPJ da empresa vencedora\nverificar se houve pagamento"]
["07/2014",1911,"009727/2014","Pagamento de inscrição  do servidor Sandro Luis Freire no XIV Coloquio Internacional de Gestão Universitária","Pagamento de inscrição  do servidor Sandro Luis Freire no XIV Coloquio Internacional de Gestão Universitária",100400,"COORDENADORIA DE INFORMÁTICA","COTIC","SAPG","2015-03-19","Houve empenho (2014NE802154) e pagamento (2014OB809507 e 2014DF802346).","verificar CNPJ da empresa vencedora\nverificar se houve pagamento"]
["41/2014",1830,"009127/2014","Pagamento de inscrição da professora Lívia Nolasco Macedo no curso de análise sensorial de leite e derivados","Pagamento de inscrição da professora Lívia Nolasco Macedo no curso de análise sensorial de leite e derivados",180000,"CTUR","CTUR","DIREÇÃO DMSA","2015-01-06","Já houve empenho (2014NE802437), mas o pagamento ainda não foi efetuado.","verificar CNPJ da empresa vencedora\nverificar se houve pagamento"]
["11/2014",1768,"008580/2014","Pagamento de inscrição das servidoras Mônica Carneiro de Moraes Inácio  e Regina Maria Van Tol no curso sobre formação e aperfeiçoamento de líderes no serviço público",{"$f":"D515","v":"Pagamento de inscrição das servidoras Mônica Carneiro de Moraes Inácio  e Regina Maria Van Tol no curso sobre formação e aperfeiçoamento de líderes no serviço público"},110000,"PRÓ-REITORIA DE ASSUNTOS ADMINISTRATIVOS","COORDENAÇÃO DE DESENVOLVIMENTO DE PESSOAS","ARQUIVO","2015-05-06","Já houve empenho (2014NE802435), mas o pagamento ainda não foi efetuado.","verificar CNPJ da empresa vencedora\nverificar se houve pagamento"]
["09/2014",1276,"005684/2014","Aquisição de servidor de cálculo intel supermicro com switch hub 16 - Pró-equipamentos/Capes","Aquisição de servidor de cálculo intel supermicro com switch hub 16 - Pró-equipamentos/Capes",160001,"PRÓ - EQUIPAMENTOS","PROPPG","SCD","2014-12-23","Realizando ajustes após emissão de parecer jurídico.","verificar por que está na SCD"]
["10/2014",1277,"005684/2014","Aquisição de servidor de cálculo intel supermicro com switch hub 16 - Pró-equipamentos/Capes","Aquisição de servidor de cálculo intel supermicro com switch hub 16 - Pró-equipamentos/Capes",160001,"PRÓ - EQUIPAMENTOS","PROPPG","SCD","2014-12-23","Realizando ajustes após emissão de parecer jurídico.","verificar por que está na SCD"]
["14/2014",1280,"006505/2014","Aquisição de ultra freezer -80ºc","Aquisição de ultra freezer -80ºc",160001,"PRÓ - EQUIPAMENTOS","PROPPG","CLOG","2015-03-17","Realizando ajustes após emissão de parecer jurídico.","verificar CNPJ da empresa vencedora\nverificar se houve pagamento"]
["20/2014",1032,"004905/2014","Aquisição de lâmpada xenon de 300w para CLV-U20","Aquisição de lâmpada xenon de 300w para CLV-U20",280010,"HOSPITAL VETERINÁRIO","HOSPITAL VETERINÁRIO","SEÇÃO DE CONTROLE","2014-12-02","Já houve empenho (2014NE802422) e foi entregue no Almoxarifado em 15/12/14.","verificar CNPJ da empresa vencedora\nverificar se houve pagamento"]
["27/2014",1744,"008327/2014","Serviço com fornecimento de divisórias","Serviço com fornecimento de divisórias",220300,"DEPARTAMENTO DE CIÊNCIAS FISIOLÓGICAS","DEPARTAMENTO DE CIÊNCIAS FISIOLÓGICAS","DRA. JAQUELINE","2015-03-09","Aguardando solicitação de nova dotação orçamentária junto à PROAF."]
["05/2014",1721,"008327/2014","Serviço com fornecimento de divisórias","Serviço com fornecimento de divisórias",500030,{"$f":"IFERROR(VLOOKUP(F521,$A$994:$B$1311,2,0),\"\")","v":"PROGRAMA INGLÊS SEM FRONTEIRAS"},"INGLÊS SEM FRONTEIRAS","DRA. JAQUELINE","2015-03-09","Aguardando solicitação de nova dotação orçamentária junto à PROAF."]
["11/2014",1281,"006504/2014","Aquisição de cromatógrafo","Aquisição de cromatógrafo",160001,{"$f":"IFERROR(VLOOKUP(F522,$A$997:$B$1314,2,0),\"\")","v":"PRÓ - EQUIPAMENTOS"},"PROPPG","SEÇÃO DE CONTROLE","2014-11-14","Já houve empenho (2014NE802205) e a data prevista de entrega é até 23/12/14. ","verificar CNPJ da empresa vencedora\nverificar se houve pagamento"]
["28/2014",1956,"010332/2014","Aquisição de copos plásticos","Aquisição de copos plásticos",120200,"DEPARTAMENTO DE MATERIAL E SERVIÇOS AUXILIARES","DIRETORIA","SEÇÃO DE CONTROLE","2014-12-08","Já houve empenho (2014NE802304) e a data prevista de entrega é até 27/12/14. Já houve empenho (2014NE802305) e a entrega foi efetuada no Almoxarifado em 18/12/14.","verificar CNPJ da empresa vencedora\nverificar se houve pagamento"]
["10/2014",1838,"009268/2014","Aquisição de bebedouros de água","Aquisição de bebedouros de água",210000,"INSTITUTO DE AGRONOMIA","DIRETORIA","ARQUIVO","2015-05-06","Já houve empenho (2014NE802258 e 2014NE802449) e a data prevista de entrega é até 14/01/15. ","verificar CNPJ da empresa vencedora\nverificar se houve pagamento"]
["20/2014",1905,"010410/2014","Confecção de canecas redondas, com capacidade para 400ml","Confecção de canecas redondas, com capacidade para 400ml",130100,"RESTAURANTE UNIVERSITÁRIO - CAMPUS SEROPÉDICA","PRÓ-REITORIA DE ASSUNTOS ESTUDANTIS","SEÇÃO DE CONTROLE","2014-11-28","Já houve empenho (2014NE802367) e a data prevista de entrega é até 26/12/14. ","verificar CNPJ da empresa vencedora\nverificar se houve pagamento"]
["19/2014",1904,"010411/2014","Cordão para crachá personalizado","Cordão para crachá personalizado",130100,"RESTAURANTE UNIVERSITÁRIO - CAMPUS SEROPÉDICA","PRÓ-REITORIA DE ASSUNTOS ESTUDANTIS","ARQUIVO","2015-04-17","Já houve empenho (2014NE802544), mas o prazo de entrega está vencido e a SSRP está realizando a devida cobrança.","verificar CNPJ da empresa vencedora\nverificar se houve pagamento"]
["13/2014",1906,"009790/2014","Aquisição de mesas de reunião ovalada","Aquisição de mesas de reunião ovalada",130000,"PRÓ-REITORIA DE ASSUNTOS ESTUDANTIS","PRÓ-REITORIA DE ASSUNTOS ESTUDANTIS","SPP","2015-03-30","Já houve empenho (2014NE802293), anulação parcial do empenho (2014NE802390) e a data prevista de entrega é até 15/03/15.\nJá houve empenho (2014NE802296) e a data prevista de entrega é até 15/03/15.\nJá houve empenho (2014NE802301) e a data prevista de entrega é até 15/03/15.\nA SSRP está verificando se existem caronas para atendimento das longarinas e posterior tomada de decisão entre a Direção do DMSA e PROAEST.","verificar CNPJ da empresa vencedora\nverificar se houve pagamento"]
["07/2014",1938,"010415/2014","Aquisição de cartuchos","Aquisição de cartuchos",140020,"PARFOR","PARFOR","CLOG","2014-12-03","Já houve empenho (2014NE802307) e a data prevista de entrega é até 04/01/15. ","verificar CNPJ da empresa vencedora\nverificar se houve pagamento"]
["07/2014",1938,"010416/2014","Aquisição de cartucho","Aquisição de cartucho",140020,"PARFOR","PARFOR","CLOG","2014-11-24","Já houve empenho (2014NE802280) e foi entregue no Almoxarifado em 16/12/14.","verificar CNPJ da empresa vencedora\nverificar se houve pagamento"]
["07/2014",1802,"009047/2014","Aquisição de gás hélio comprimido","Aquisição de gás hélio comprimido",160110,"PROAP - QUÍMICA","PROGRAMA DE PÓS-GRADUAÇÃO EM QUÍMICA","COORD. DO CURSO DE POS-GRADUAÇÃO EM QUÍMICA ORGÂNICA","2015-03-02","Já houve empenho (2014NE802308), mas o prazo de entrega está vencido e um ofício de cobrança foi emitido à empresa em 06/02/15.","verificar CNPJ da empresa vencedora\nverificar se houve pagamento"]
["38/2014",1889,"009467/2014","Aquisição de equipamentos industriais","Aquisição de equipamentos industriais",180000,"CTUR","CTUR","CLOG","2014-12-03","Já houve empenho (2014NE802450) e a data prevista de entrega é até 12/01/15. ","verificar CNPJ da empresa vencedora\nverificar se houve pagamento"]
["37/2014",1890,"010418/2014","Aquisição de equipamentos industriais","Aquisição de equipamentos industriais",180000,"CTUR","CTUR","CLOG","2014-12-03","Já houve empenho (2014NE802451) e a data prevista de entrega é até 12/01/15. ","verificar CNPJ da empresa vencedora\nverificar se houve pagamento"]
["31/2014",1535,"007860/2014","Aquisição de tela arame galvanizado (emergencial)","Aquisição de tela arame galvanizado (emergencial)",180000,"CTUR","CTUR","CLOG","2015-01-21","Já houve empenho (2014NE802588) e a data prevista de entrega é até 20/02/15. ","verificar CNPJ da empresa vencedora\nverificar se houve pagamento"]
["27/2014",1881,"009331/2014","Aquisição de papel A4","Aquisição de papel A4",120200,"DEPARTAMENTO DE MATERIAL E SERVIÇOS AUXILIARES","DEPARTAMENTO DE MATERIAL E SERVIÇOS AUXILIARES","CLOG","2014-12-16","Já houve empenhos (2014NE802285, 2014NE802289, 2014NE802485, 2014NE802284, 2014NE802287, 2014NE802483, 2014NE802528 e 2014NE802590) e a data prevista de entrega é até 16/01/15.\n\nJá houve empenhos (2014NE802173, 2014NE802175, 2014NE802176, 2014NE802177, 2014NE802188, 2014NE802189, 2014NE802190 e 2014NE802191) e foram entregues no Almoxarifado em 04/12/14.\n\nJá houve empenhos (2014NE802174 e 2014NE802193) e foram entregues no Almoxarifado em 10/12/14.","verificar CNPJ da empresa vencedora\nverificar se houve pagamento"]
["20/2014",1851,"009340/2014","Conserto e manutenção preventiva do espectrômetro","Conserto e manutenção preventiva do espectrômetro",10000,"RESERVA TÉCNICA","IT-DEPARTAMENTO DE ENGENHARIA QUÍMICA - DEQ","ARQUIVO","2015-04-28","Já houve empenho (2014NE802534), mas o pagamento ainda não foi efetuado.","verificar CNPJ da empresa vencedora\nverificar se houve pagamento"]
["129/2014",1818,"009163/2014","Aquisição de cloro granulado","Aquisição de cloro granulado",150100,"PRAÇA DE DESPORTOS","DEPARTAMENTO DE ESPORTES E LAZER-PROEXT","ARQUIVO","2015-04-17","Já houve empenho (2014NE802496) e a data prevista de entrega é até 04/01/15. ","verificar CNPJ da empresa vencedora\nverificar se houve pagamento"]
["24/2014","S/Nº","005124/2014","Contratação de serviço especializado para manutenção de elevador","Contratação de serviço especializado para manutenção de elevador",100300,"PREFEITURA UNIVERSITÁRIA","PREFEITURA UNIVERSITÁRIA","DCF","2015-04-10",null,"verificar CNPJ da empresa vencedora\nverificar se houve pagamento"]
["08/2014",428,"002407/2014","Contratação de serviço especializado em processamento técnico e físico de material bibliográfico","Contratação de serviço especializado em processamento técnico e físico de material bibliográfico",100100,{"$f":"IFERROR(VLOOKUP(F538,$A$994:$B$1311,2,0),\"\")","v":"BIBLIOTECA CENTRAL"},"BIBLIOTECA CENTRAL","SPP","2015-03-31","Foi reenquadrado de SRP para tradional e em função disso terá que refazer a minuta de edital.","VERIFICAR O PROCESSO"]
["S/Nº","S/Nº","007553/2013","Contratação de serviços de restauração e encadernação de livros pertecentes ao acervo da Biblioteca Central","Contratação de serviços de restauração e encadernação de livros pertecentes ao acervo da Biblioteca Central",100100,"BIBLIOTECA CENTRAL","BIBLIOTECA CENTRAL","SEC. ADM. DO DEPTO DE CONTABILIDADE E FINANÇAS","2015-05-12","Analisando manifestação de interesse (IRP) de outros órgãos. Pregão nº 15/2015 (antigo nº 133/2014) com provável abertura em 13/01/15.","verificar CNPJ da empresa vencedora\nverificar se houve pagamento"]
["08/2014",1034,"004907/2014","Aquisição de caminhonete para trabalho rural com motor a diesel","Aquisição de caminhonete para trabalho rural com motor a diesel",280010,"HOSPITAL VETERINÁRIO","HOSPITAL VETERINÁRIO","ALMOXARIFADO","2015-01-22","Já houve empenho (2014NE801998, 2014NE801999, 2014NE802192), pagamentos (2015OB800232 , 2015OB800413 e 2015DF800135, 2015DF800207) e foi entregue no Almoxarifado em 19/12/14.","CNPJ da empresa vencedora: 54.305.743/0011-70\nverificar se houve empenho"]
["08/2013",890,"010043/2013","Aquisição de adaptador para uma tomada padrão antigo e etc","Aquisição de adaptador para uma tomada padrão antigo e etc",500404,"PRONATEC - COLÉGIO TÉCNICO","PRONATEC - COLÉGIO TÉCNICO","DIREÇÃO DMSA","2015-03-12","Os pedidos desse processo foram inseridos no 002078/2013 do DMSA e está verificando a possibilidade de atendimento juntamente com a demanda de 2015.","VERIFICAR O PROCESSO"]
["12/2013",78,"002078/2013","Aquisição de material do grupo 30.17 (adaptador 2P+T do padrão novo para o padrão antigo e etc.)","Aquisição de material do grupo 30.17 (adaptador 2P+T do padrão novo para o padrão antigo e etc.)",120200,"DEPARTAMENTO DE MATERIAL E SERVIÇOS AUXILIARES","DEPARTAMENTO DE MATERIAL E SERVIÇOS AUXILIARES","DIREÇÃO DMSA","2015-01-26","Verificando a possibilidade de atendimento juntamente com a demanda de 2015.","VERIFICAR O PROCESSO"]
["09/2014",937,"004258/2014","Aquisição de livros","Aquisição de livros",170000,"CAIC","CAIC","CLOG","2015-05-05","Pregão nº 10/2015 (antigo nº 140/2014) iniciado em 05/03/15.","verificar CNPJ da empresa vencedora\nverificar se houve pagamento"]
["18/2013","S/Nº","000352/2014","Aquisição de rede para cabelo cor preta e outros","Aquisição de rede para cabelo cor preta e outros",300000,"CAMPUS DA UFRRJ EM NOVA IGUAÇU","CAMPUS DA UFRRJ EM NOVA IGUAÇU","RESTAURANTE UNIVERSITÁRIO DO CAMPUS DE NOVA IGUAÇU","2014-11-07","Pregão nº 62/2014 finalizado em 10/09/14. O processo está disponível no Restaurante Universitário do IM para solicitar empenhos.","verificar CNPJ da empresa vencedora\nverificar se houve pagamento"]
["19/2013","S/Nº","000353/2014","Aquisição de álcool etílico 70, frascos de 500 ml e outros","Aquisição de álcool etílico 70, frascos de 500 ml e outros",300000,"CAMPUS DA UFRRJ EM NOVA IGUAÇU","CAMPUS DA UFRRJ EM NOVA IGUAÇU","PROAES","2015-05-06","Pregão nº 51/2014 finalizado em 05/06/14. O processo está disponível no Restaurante Universitário do IM para solicitar empenhos.","verificar CNPJ da empresa vencedora\nverificar se houve pagamento"]
["03/2014",881,"006359/2014","Aquisição dos itens do grupo 52.40 - Equipamento agrícola (arado,etc)","Aquisição dos itens do grupo 52.40 - Equipamento agrícola (arado,etc)",150080,"PROEXT - MÃOS QUE CRIAM - PROJETO DE CAPACITAÇÃO PARA PROMOÇÃO SOCIAL","PRÓ-REITORIA DE EXTENSÃO - PROJETO \"MÃOS QUE CRIAM\"","CLOG","2015-04-30","Aguardando dispensa.","verificar CNPJ da empresa vencedora\nverificar se houve pagamento"]
["01/2014","S/Nº","000373/2014","Aquisição de vacina contra leptospirose bovina, ovina, caprina e suína frasco de 50ml e outros","Aquisição de vacina contra leptospirose bovina, ovina, caprina e suína frasco de 50ml e outros",100500,"COORDENADORIA DE DESENVOLVIMENTO DA PRODUÇÃO","COORDENADORIA DE DESENVOLVIMENTO DA PRODUÇÃO","CLOG","2014-05-22","Já houve empenho (2014NE800636), pagamentos (2014OB804756 e 2014DF801439) e foi entregue no Almoxarifado em 02/06/14.","verificar CNPJ da empresa vencedora\nverificar se houve pagamento"]
["01/2014",2,"000044/2014","Aquisição de pâo francês","Aquisição de pâo francês",130100,"RESTAURANTE UNIVERSITÁRIO - CAMPUS SEROPÉDICA","RESTAURANTE UNIVERSITÁRIO - CAMPUS SEROPÉDICA","RESTAURANTE UNIVERSITÁRIO DE SEROPÉDICA","2014-04-25","Já houve empenho (2014NE800029) e pagamento (2014OB800840).","verificar CNPJ da empresa vencedora\nverificar se houve pagamento"]
["S/Nº","S/Nº","000256/2014","Aquisição de revista Síntese Responsabilidade Pública","Aquisição de revista Síntese Responsabilidade Pública",100000,"REITORIA","PROCURADORIA GERAL","ARQUIVO","2014-08-05","Arquivado porque  houve empenho (2014NE800304) e pagamento (2014OB803688 e 2014DF801211)."]
["S/Nº","S/Nº","000257/2014","Aquisição de boletim de direito administrativo e boletim de licitações e contratos 2014","Aquisição de boletim de direito administrativo e boletim de licitações e contratos 2014",100000,"REITORIA","PROCURADORIA GERAL","ARQUIVO","2015-01-21","Arquivado porque  houve empenho (2014NE800368) e pagamento (2014OB804980 e 2014DF801479)."]
["S/Nº","S/Nº","010568/2014","Aquisição de lâmina para microscopia - fosca, lapidada, 26x70mm, caixa com 50 unidades e outros","Aquisição de lâmina para microscopia - fosca, lapidada, 26x70mm, caixa com 50 unidades e outros",280010,"HOSPITAL VETERINÁRIO","HOSPITAL VETERINÁRIO","SEÇÃO DE CONTROLE","2014-12-09","Já houve empenhos (2014NE802481 e 2014NE802487), mas o prazo de entrega está vencido e um ofício de cobrança foi emitido à empresa em 23/01/15.\nJá houve empenho (2014NE802482), mas o prazo de entrega está vencido desde 05/01/15.\nJá houve empenho (2014NE802484) e foi entregue no Almoxarifado em 06/01/15.\nJá houve empenho (2014NE802486) e foi entregue no Almoxarifado em 30/12/14.","verificar CNPJ da empresa vencedora\nverificar se houve pagamento"]
["30/2014",1987,"010608/2014","Aquisição de itens do grupo 30.22 - Artigos para higiene e conservação","Aquisição de itens do grupo 30.22 - Artigos para higiene e conservação",300000,"CAMPUS DA UFRRJ EM NOVA IGUAÇU","CAMPUS DA UFRRJ EM NOVA IGUAÇU","CLOG","2014-12-04","Já houve empenho (2014NE802495), mas o prazo de entrega está vencido desde 04/01/15.","verificar CNPJ da empresa vencedora\nverificar se houve pagamento"]
["08/2014","S/Nº","010531/2014","Aquisição de seis rádios transceptores (carona)","Aquisição de seis rádios transceptores (carona)",500030,"PROGRAMA INGLÊS SEM FRONTEIRAS","COORDENAÇÃO DO INGLÊS SEM FRONTEIRAS","SEÇÃO DE CONTROLE","2015-01-23","Já houve empenho (2014NE802274) e a data prevista de entrega é até 02/03/15.","verificar CNPJ da empresa vencedora\nverificar se houve pagamento"]
["137/2014","S/Nº","010515/2014","Aquisição de dez bolas de vôlei de areia/praia, etc","Aquisição de dez bolas de vôlei de areia/praia, etc",150100,"PRAÇA DE DESPORTOS","PRAÇA DE DESPORTOS","CLOG","2014-12-09","Já houve empenho (2014NE802281), pagamentos (2015OB800181 e 2015DF800035) e foi entregue no Almoxarifado em 16/12/14.","verificar CNPJ da empresa vencedora\nverificar se houve pagamento"]
["02/2014","S/Nº","005729/2014","Aquisição de licenciamento de uso de software arcgls for desktop concurrent e outros","Aquisição de licenciamento de uso de software arcgls for desktop concurrent e outros",400000,"CAMPUS DA UFRRJ EM TRÊS RIOS","CAMPUS DA UFRRJ EM TRÊS RIOS","COINFO","2014-08-21","Buscando informações."]
["04/2014",1952,"010294/2014","Aquisição de poltrona de auditório, encosto médio e com posicionamento em 3 posições e outros (carona)","Aquisição de poltrona de auditório, encosto médio e com posicionamento em 3 posições e outros (carona)",400000,"CAMPUS DA UFRRJ EM TRÊS RIOS","CAMPUS DA UFRRJ EM TRÊS RIOS","SEC.  ADM. DO DECANATO DE ASSUNTOS FINANCEIROS","2015-04-09","Já houve empenho (2014NE802271, 2014NE802272, 2014NE802273) , encaminhado para o almoxarifado para envio da Nota de empenho.","verificar CNPJ da empresa vencedora\nverificar se houve pagamento"]
["03/2014",1148,"006356/2014","Aquisição dos itens do grupo 30.16 - Material de expediente (papel em geral, etc)","Aquisição dos itens do grupo 30.16 - Material de expediente (papel em geral, etc)",150400,"PROEXT - PROGRAMA APOIO E ACOMPANHAMENTO USO DE LAPTOPS ESCOLA POR ALUNO","PROEXT - PROGRAMA APOIO E ACOMPANHAMENTO NO USO DE LAPTOPS ESCOLA POR ALUNO ","ANEXADO    23083.006343/2014-14","2014-11-06","Consolidar Pesquisa de Preço (anexado ao 006343/2014).","atualizado 15/04/2015"]
["03/2014",1215,"006356/2014","Aquisição dos itens do grupo 30.16 - Material de expediente (papel em geral, etc)","Aquisição dos itens do grupo 30.16 - Material de expediente (papel em geral, etc)",160105,"PROAP - ENGENHARIA QUÍMICA","PROGRAMA DE PÓS-GRADUAÇÃO EM ENGENHARIA QUÍMICA","ANEXADO    23083.006343/2014-15","2014-11-06","Consolidar Pesquisa de Preço (anexado ao 006343/2014).","atualizado 15/04/2015"]
["06/2014",1217,"006356/2014","Aquisição dos itens do grupo 30.16 - Material de expediente (papel em geral, etc)","Aquisição dos itens do grupo 30.16 - Material de expediente (papel em geral, etc)",160105,"PROAP - ENGENHARIA QUÍMICA","PROGRAMA DE PÓS-GRADUAÇÃO EM ENGENHARIA QUÍMICA","ANEXADO    23083.006343/2014-16","2014-11-06","Consolidar Pesquisa de Preço (anexado ao 006343/2014).","atualizado 15/04/2015"]
["130/2014",1793,"008974/2014","Aquisição de cloro gasoso","Aquisição de cloro gasoso",150100,"PRAÇA DE DESPORTOS","DEPARTAMENTO DE ESPORTES E LAZER","SPP","2014-10-21","Buscando informações.","O Rafael disse que está na Direção, mas por que a carga está na SPP?"]
["07/2014",1149,"006359/2014","Aquisição dos itens do grupo 52.40 - Equipamento agrícola (arado, etc)","Aquisição dos itens do grupo 52.40 - Equipamento agrícola (arado, etc)",150080,"PROEXT - MÃOS QUE CRIAM - PROJETO DE CAPACITAÇÃO PARA PROMOÇÃO SOCIAL","PRÓ-REITORIA DE EXTENSÃO - PROJETO \"MÃOS QUE CRIAM\"","CLOG","2015-04-30",null,"verificar CNPJ da empresa vencedora\nverificar se houve pagamento"]
["07/2014",1219,"006358/2014","Aquisição dos itens do grupo 30.35 - Material de laboratório (frascos, etc)","Aquisição dos itens do grupo 30.35 - Material de laboratório (frascos, etc)",160105,"PROAP - ENGENHARIA QUÍMICA","PROGRAMA DE PÓS-GRADUAÇÃO EM ENGENHARIA QUÍMICA","DIREÇÃO DMSA","2015-01-26","Aguardando avaliação da Direção após pesquisa de preços.","VERIFICAR O PROCESSO"]
["S/Nº",1878,"009339/2014","Aquisição de bebedouro industrial - Material do grupo 52.12 aparelhos e utensílios domésticos - (carona)","Aquisição de bebedouro industrial - Material do grupo 52.12 aparelhos e utensílios domésticos - (carona)",220410,"LABORATÓRIO OFICIAL DE DIAGNÓSTICO FITOSSANITÁRIO","LABORATÓRIO OFICIAL DE DIAGNÓSTICO FITOSSANITÁRIO","SSRP","2014-11-13","Já houve empenho (2014NE802167), mas o prazo de entrega está vencido desde 23/12/14.","verificar CNPJ da empresa vencedora\nverificar se houve pagamento"]
["05/2014",1465,"009584/2014","Aquisição de materiais de alguns itens do grupo 30.31 - Insumos agrícolas (formicida e semente de espécie de milho híbrido)","Aquisição de materiais de alguns itens do grupo 30.31 - Insumos agrícolas (formicida e semente de espécie de milho híbrido)",160106,"PROAP - FITOTECNIA","PROGRAMA DE PÓS-GRADUAÇÃO EM FITOTECNIA","DIREÇÃO DMSA","2014-11-07","Buscando informações."]
["30/2014",1764,"009584/2014","Aquisição de materiais de alguns itens do grupo 30.31 - Insumos agrícolas (adubo químico e fertilizante)","Aquisição de materiais de alguns itens do grupo 30.31 - Insumos agrícolas (adubo químico e fertilizante)",290000,"INSTITUTO DE ZOOTECNIA","DIREÇÃO DO INSTITUTO DE ZOOTECNIA","DIREÇÃO DMSA","2014-11-07","Buscando informações."]
["17/2014",1749,"009677/2014","Aquisição de aparelho auditivo programado","Aquisição de aparelho auditivo programado",130000,"PRÓ-REITORIA DE ASSUNTOS ESTUDANTIS","PRÓ-REITORIA DE ASSUNTOS ESTUDANTIS","SPP","2014-11-05","Pesquisa de preço.","verificar porque está na Pesquisa até hoje"]
["S/Nº","S/Nº","006033/2014","Aquisição de materiais para manutenção de bens móveis - ferragens em geral e afins (IRP)","Aquisição de materiais para manutenção de bens móveis - ferragens em geral e afins (IRP)",120200,"DEPARTAMENTO DE MATERIAL E SERVIÇOS AUXILIARES","DEPARTAMENTO DE MATERIAL E SERVIÇOS AUXILIARES","SSRP","2014-08-06","O pregão do órgão gerenciador ainda não foi realizado.","VERIFICAR O PROCESSO"]
["12/2014",1872,"009678/2014","Aquisição de dois capacetes de piloto de motocicleta","Aquisição de dois capacetes de piloto de motocicleta",100000,"REITORIA","ALMOXARIFADO","SCD","2014-11-26","Abriu cotação mas o capacete cotado foi inferior ao solicitado e com valor acima do estimado.","VERIFICAR O PROCESSO"]
["02/2014",963,"006355/2014","Aquisição dos itens do grupo 52.33 - Equipamentos eletro-eletrônicos","Aquisição dos itens do grupo 52.33 - Equipamentos eletro-eletrônicos",150080,"PROEXT - MÃOS QUE CRIAM - PROJETO DE CAPACITAÇÃO PARA PROMOÇÃO SOCIAL","PRÓ-REITORIA DE EXTENSÃO - PROJETO \"MÃOS QUE CRIAM\"","CLOG","2014-10-15","Já houve empenho (2014NE801883), pagamento (2014OB808794) e foi entregue no Almoxarifado em 05/11/14.\nJá houve empenho (2014NE801882), pagamento (2014OB808736) e foi entregue no Almoxarifado em 04/11/14.","verificar CNPJ da empresa vencedora\nverificar se houve pagamento"]
["50/2014",1720,"008155/2014","Aquisição de colchete de aço metálico nº 7 ace caixa com 72 unidades e outros","Aquisição de colchete de aço metálico nº 7 ace caixa com 72 unidades e outros",110200,"SEÇÃO DE ARQUIVO E PROTOCOLO GERAL","SEÇÃO DE ARQUIVO E PROTOCOLO GERAL","ALMOXARIFADO","2014-12-15","Já houve empenho (2014NE802303), pagamento (2014OB809816) e foi entregue no Almoxarifado em 10/12/14.","verificar CNPJ da empresa vencedora\nverificar se houve pagamento"]
["09/2014","S/Nº","006046/2014","Aquisição de itens do grupo 30.11 - Material químico (demais setores)","Aquisição de itens do grupo 30.11 - Material químico (demais setores)",220100,"DEPARTAMENTO DE BIOLOGIA ANIMAL","DEPARTAMENTO DE BIOLOGIA ANIMAL","CADMIN","2014-07-29","Buscando informações.","Acho que é o processo que eu formei."]
["04/2014","S/Nº","006046/2014","Aquisição de itens do grupo 30.11 - Material químico (demais setores)","Aquisição de itens do grupo 30.11 - Material químico (demais setores)",280400,"DEPARTAMENTO DE PARASITOLOGIA ANIMAL","DEPARTAMENTO DE PARASITOLOGIA ANIMAL","CADMIN","2014-07-29","Buscando informações.","Acho que é o processo que eu formei."]
["72/2014","S/Nº","006046/2014","Aquisição de itens do grupo 30.11 - Material químico (demais setores)","Aquisição de itens do grupo 30.11 - Material químico (demais setores)",280100,"DEPARTAMENTO DE EPIDEMIOLOGIA E SAÚDE PÚBLICA","DEPARTAMENTO DE EPIDEMIOLOGIA E SAÚDE PÚBLICA","CADMIN","2014-07-29","Buscando informações.","Acho que é o processo que eu formei."]
["02/2014","S/Nº","006046/2014","Aquisição de itens do grupo 30.11 - Material químico (demais setores)","Aquisição de itens do grupo 30.11 - Material químico (demais setores)",120100,"DEPARTAMENTO DE CONTABILIDADE E FINANÇAS","DEPARTAMENTO DE CONTABILIDADE E FINANÇAS","CADMIN","2014-07-29","Buscando informações.","Acho que é o processo que eu formei."]
["06/2014","S/Nº","006046/2014","Aquisição de itens do grupo 30.11 - Material químico (demais setores)","Aquisição de itens do grupo 30.11 - Material químico (demais setores)",220410,"LABORATÓRIO OFICIAL DE DIAGNÓSTICO FITOSSANITÁRIO","LABORATÓRIO OFICIAL DE DIAGNÓSTICO FITOSSANITÁRIO","CADMIN","2014-07-29","Buscando informações.","Acho que é o processo que eu formei."]
["08/2014",1848,"009266/2014","Aquisição de feno de gramineas cost cross ou tifton 85","Aquisição de feno de gramineas cost cross ou tifton 85",100500,"COORDENADORIA DE DESENVOLVIMENTO DA PRODUÇÃO","COORDENADORIA DE DESENVOLVIMENTO DA PRODUÇÃO","SEÇÃO DE CONTROLE","2014-11-06","Já houve empenho (2014NE802106), pagamento (2015OB800187) e foi entregue no Almoxarifado em 23/12/14.\nJá houve empenho (2014NE802086), pagamentos (2015OB800187 e 2015DF800040) e foi entregue no Almoxarifado em 11/12/14.","verificar CNPJ da empresa vencedora\nverificar se houve pagamento"]
["40/2014",1459,"008202/2014","Aquisição de toners e cartuchos","Aquisição de toners e cartuchos",260000,"INSTITUTO DE FLORESTAS","INSTITUTO DE FLORESTAS","CLOG","2014-11-05","Buscando informações.","Nenhum empenho encontrado no SISCNE."]
["04/2014",930,"005733/2014","Aquisição de licença definitiva para uso do pacote Microsoft Office compatível com sistema operacional Windows 8","Aquisição de licença definitiva para uso do pacote Microsoft Office compatível com sistema operacional Windows 8",100600,"COORDENADORIA DE PLANEJAMENTO","COORDENADORIA DE PLANEJAMENTO","PRÓ-REITORIA DE PLANEJAMENTO, AVALIAÇÃO E DESENVOLVIMENTO","2014-08-01","Buscando informações."]
["21/2014",1903,"009774/2014","Aquisição de caldeirão a vapor, para cozinha industrial",{"$f":"D579","v":"Aquisição de caldeirão a vapor, para cozinha industrial"},130100,"RESTAURANTE UNIVERSITÁRIO - CAMPUS SEROPÉDICA","RESTAURANTE UNIVERSITÁRIO - CAMPUS SEROPÉDICA","CLOG","2014-12-03","Já houve empenho (2014NE802458), mas o prazo de entrega está vencido e um ofício de cobrança foi emitido à empresa em 21/01/15.","verificar CNPJ da empresa vencedora\nverificar se houve pagamento"]
["12/2014",1053,"004998/2014","Aquisição de material permanente/adesão a ata","Aquisição de material permanente/adesão a ata",100100,"BIBLIOTECA CENTRAL","BIBLIOTECA CENTRAL","CLOG","2014-10-15","Já houve empenho (2014NE801897), mas o prazo de entrega está vencido desde 15/01/15.\nJá houve empenho (2014NE801853), anulação parcial do empenho (2014NE801896), mas o prazo de entrega está vencido desde 04/01/15.","verificar CNPJ da empresa vencedora\nverificar se houve pagamento"]
["03/2014",947,"005734/2014","Aquisição de fita nylon para impressora matricial, cor da tinta da fita preto","Aquisição de fita nylon para impressora matricial, cor da tinta da fita preto",120100,"DEPARTAMENTO DE CONTABILIDADE E FINANÇAS","DEPARTAMENTO DE CONTABILIDADE E FINANÇAS","ANEXADO    23083.006016/2014-62","2014-08-01","Buscando informações (anexado ao 006016/2014).","Será que é o processo que eu consolidei?"]
["08/2014",977,"005738/2014","Aquisição de quadro geral 3f + n+ t 600a acompanha kit","Aquisição de quadro geral 3f + n+ t 600a acompanha kit",270000,"INSTITUTO DE TECNOLOGIA","INSTITUTO DE TECNOLOGIA","ARQUIVO","2015-02-06","Arquivado porque o material foi comprado através do cartão corporativo.","Despacho da Lucélia Fandiño."]
["06/2014",973,"005736/2014","Aquisição de bebedouro industrial","Aquisição de bebedouro industrial",240000,"INSTITUTO DE CIÊNCIAS HUMANAS E SOCIAIS","INSTITUTO DE CIÊNCIAS HUMANAS E SOCIAIS","ANEXADO    23083.005867/2014-98","2014-11-26","Realizando ajustes após emisssão do parecer jurídico (anexado ao 005867/2014).","atualizado 16/04/2015"]
["33/2014",1794,"009045/2014","Aquisição de madeira construção","Aquisição de madeira construção",100300,"PREFEITURA UNIVERSITÁRIA","DIVISÃO DE SERVIÇOS GERAIS","DIREÇÃO DMSA","2014-11-07","Buscando informações."]
["137/2014",1858,"010414/2014","Aquisição de bola de futsal masculina adulto, oficial para jogos internacionais e outras","Aquisição de bola de futsal masculina adulto, oficial para jogos internacionais e outras",150100,"PRAÇA DE DESPORTOS","DEPARTAMENTO DE ESPORTES E LAZER","CLOG","2014-12-03","Já houve empenho (2014NE802299) e foi entregue no Almoxarifado em 21/01/15.","verificar CNPJ da empresa vencedora\nverificar se houve pagamento"]
["01/2014",936,"006590/2014","Aquisição do grupo 30.11 - Material químico (solventes, ácidos, etc)","Aquisição do grupo 30.11 - Material químico (solventes, ácidos, etc)",160105,"PROAP - ENGENHARIA QUÍMICA","PROAP - ENGENHARIA QUÍMICA","DIREÇÃO DMSA","2014-01-26","A Direção está verificando a possibilidade de atendimento juntamente com a demanda de 2015.","VERIFICAR O PROCESSO"]
["01/2014",962,"006590/2014","Aquisição do grupo 30.11 - Material químico (solventes, ácidos, etc)","Aquisição do grupo 30.11 - Material químico (solventes, ácidos, etc)",160107,"PROAP - MEDICINA VETERINÁRIA","PROAP - MEDICINA VETERINÁRIA","DIREÇÃO DMSA","2014-01-26","A Direção está verificando a possibilidade de atendimento juntamente com a demanda de 2015.","VERIFICAR O PROCESSO"]
["05/2014",1264,"006590/2014","Aquisição do grupo 30.11 - Material químico (solventes, ácidos, etc)","Aquisição do grupo 30.11 - Material químico (solventes, ácidos, etc)",150600,"PROEXT - APOIO À PRÁTICAS TRADICIONAIS NO USO DE PLANTAS MEDICINAIS","PROJETO PROEXT - MEC \"APOIO AS PRÁTICAS TRADICIONAIS, USO DE PLANTAS MEDICINAIS E SISTEMAS AGROALIMENTARES\"","DIREÇÃO DMSA","2014-01-26","A Direção está verificando a possibilidade de atendimento juntamente com a demanda de 2015.","VERIFICAR O PROCESSO"]
["01/2014",1238,"006590/2014","Aquisição do grupo 30.11 - Material químico (solventes, ácidos, etc)","Aquisição do grupo 30.11 - Material químico (solventes, ácidos, etc)",160100,"PROAP - PRÓ-REITORIA DE PESQUISA E PÓS GRADUAÇÃO","DEPARTAMENTO DE ENGENHARIA","DIREÇÃO DMSA","2014-01-26","A Direção está verificando a possibilidade de atendimento juntamente com a demanda de 2015.","VERIFICAR O PROCESSO"]
["01/2014",1800,"009046/2014","Aquisição de gás comprimido (nitrogênio líquido)","Aquisição de gás comprimido (nitrogênio líquido)",160110,"PROAP - QUÍMICA","PROGRAMA DE PÓS-GRADUAÇÃO EM QUÍMICA","DRA. IVANIR","2015-05-06","Elaboração da minuta de edital.","atualizado 16/04/2015"]
["25/2014","S/Nº","006081/2014","Aquisição de duas baterias de 12v e 150 amperes para grupo gerador do P1","Aquisição de duas baterias de 12v e 150 amperes para grupo gerador do P1",100300,"PREFEITURA UNIVERSITÁRIA","PREFEITURA UNIVERSITÁRIA","SEÇÃO DE CONTROLE","2014-11-24","Já houve empenho (2014NE802286), pagamento (2014OB809805) e foi entregue no Almoxarifado em 09/12/14.","verificar CNPJ da empresa vencedora\nverificar se houve pagamento"]
["40/2014","S/Nº","005618/2014","Aquisição de caixa de arquivo em papelão reforçado padrão medindo 13,5 x 24,5 x 36 cm tamanho ofício e outros","Aquisição de caixa de arquivo em papelão reforçado padrão medindo 13,5 x 24,5 x 36 cm tamanho ofício e outros",110000,"PRÓ-REITORIA DE ASSUNTOS ADMINISTRATIVOS","SEÇÃO DE ARQUIVO E PROTOCOLO GERAL","ARQUIVO","2014-12-10","Arquivado porque  houve empenho (2014NE801694) e pagamento (2014OB809024).\nArquivado porque  houve empenho (2014NE801695) e pagamento (2014OB808455)."]
["11/2014",1725,"008393/2014","Aquisição de memória portátil, microcomputador, etc","Aquisição de memória portátil, microcomputador, etc",500030,"PROGRAMA INGLÊS SEM FRONTEIRAS","PROGRAMA INGLÊS SEM FRONTEIRAS","ARQUIVO","2015-03-06","Buscando informações.","Parece que houve algum equívoco no arquivamento dele, pois não há um despacho claro e objetivo para o seu arquivamento, mostrei para a Sandra, pois foi ela que pediu para arquivar, porém esta assim o despacho \"À SAPG para arquivamento\" no dia 13/01/2015, ela pediu para eu ficar com o processo até o Murilo voltar, pois foi ele que pediu, mas tinha muitos processos juntos, ai ela não tem certeza se foi uma coisa combinada de boca para arquivar entre a COTIC, setor requisitante e o Murilo."]
["02/2014",1935,"010080/2014","Aquisição de cadeira de encosto baixo, com l duplo em tubo 7/8, sem regulagem e outros","Aquisição de cadeira de encosto baixo, com l duplo em tubo 7/8, sem regulagem e outros",220200,"DEPARTAMENTO DE BOTÂNICA","DEPARTAMENTO DE BOTÂNICA","DIREÇÃO DMSA","2015-05-12","Buscando informações."]
["S/Nº","S/Nº","008655/2014","Aquisição de materiais para manutenção de bens imóveis (material hidráulico e afins) - IRP","Aquisição de materiais para manutenção de bens imóveis (material hidráulico e afins) - IRP",120200,"DEPARTAMENTO DE MATERIAL E SERVIÇOS AUXILIARES","DEPARTAMENTO DE MATERIAL E SERVIÇOS AUXILIARES","CPACS","2014-10-03","Aguardando a ata assinada pelo órgão gerenciadorda IRP.","atualizado 16/04/2015"]
["18/2014",1427,"007161/2014","Aquisição de tanque elétrico para fabricação de queijo de 50l e etc","Aquisição de tanque elétrico para fabricação de queijo de 50l e etc",180000,"CTUR","CTUR","ARQUIVO","2015-02-06","Aguardando a ata assinada pelo órgão gerenciador da IRP.","Despacho da Janaína Gomes."]
["27/2014",1429,"007163/2014","Aquisição de veículo (zero) 0 km, de fabricação nacional, modelo sedan, ano e mod. de fabricação 2014 ou superior (carona)","Aquisição de veículo (zero) 0 km, de fabricação nacional, modelo sedan, ano e mod. de fabricação 2014 ou superior (carona)",180000,"CTUR","CTUR","ARQUIVO","2015-03-14","Não houve tempo hábil para realizar a carona, pois a empresa enviou a negativa no último dia de empenho.","verificar com a Lucélia o motivo do arquivamento do processo"]
["28/2014",1428,"007163/2014","Aquisição de veículo (zero) 0 km, de fabricação nacional, modelo sedan, ano e mod. de fabricação 2014 ou superior (carona)","Aquisição de veículo (zero) 0 km, de fabricação nacional, modelo sedan, ano e mod. de fabricação 2014 ou superior (carona)",180000,"CTUR","CTUR","ARQUIVO","2015-03-14","Não houve tempo hábil para realizar a carona, pois a empresa enviou a negativa no último dia de empenho.","verificar com a Lucélia o motivo do arquivamento do processo"]
["124/2014",1841,"008940/2014","Aquisição de trator cortador de grama dirigível, roçadeira, reboque para cortador, etc","Aquisição de trator cortador de grama dirigível, roçadeira, reboque para cortador, etc",150100,"PRAÇA DE DESPORTOS","DEPARTAMENTO DE ESPORTES E LAZER","DIREÇÃO DMSA","2014-11-07","Buscando informações."]
["131/2014",1841,"008940/2014","Aquisição de marcador de campo","Aquisição de marcador de campo",150100,"PRAÇA DE DESPORTOS","DEPARTAMENTO DE ESPORTES E LAZER","DIREÇÃO DMSA","2014-11-07","Buscando informações."]
["13/2014",1906,"010455/2014","Aquisição de mesa, mesa de reunião ovalada - medindo: 2400 x 1100 x 740mm, cadeiras e outros (carona)","Aquisição de mesa, mesa de reunião ovalada - medindo: 2400 x 1100 x 740mm, cadeiras e outros (carona)",130000,"PRÓ-REITORIA DE ASSUNTOS ESTUDANTIS","PRÓ-REITORIA DE ASSUNTOS ESTUDANTIS","DIVISÃO DE ADMINISTRAÇÃO FINANCEIRA","2015-05-12","As mesas foram atendidas através do processo 009790/2014. Já houve empenho (2014NE802293), anulação parcial do empenho (2014NE802390) e a data prevista de entrega é até 15/03/15.\nJá houve empenho (2014NE802296) e a data prevista de entrega é até 15/03/15.\nAs cadeiras não foram empenhadas porque a empresa apresentou irregularidades no SICAF.\nEnquadramento","verificar CNPJ da empresa vencedora\nverificar se houve pagamento"]
["13/2014",1906,"010455/2014","Aquisição de mesa, mesa de reunião ovalada - medindo: 2400 x 1100 x 740mm, cadeiras e outros (carona)","Aquisição de mesa, mesa de reunião ovalada - medindo: 2400 x 1100 x 740mm, cadeiras e outros (carona)",500030,{"$f":"IFERROR(VLOOKUP(F602,$A$994:$B$1311,2,0),\"\")","v":"PROGRAMA INGLÊS SEM FRONTEIRAS"},"PROGRAMA INGLÊS SEM FRONTEIRAS","DIVISÃO DE ADMINISTRAÇÃO FINANCEIRA","2015-05-12","Já houve empenho (2014NE802293), anulação parcial do empenho (2014NE802390) e a data prevista de entrega é até 15/03/15.\nJá houve empenho (2014NE802296) e a data prevista de entrega é até 15/03/15.\nJá houve empenho (2014NE802301) e a data prevista de entrega é até 15/03/15.\nA SSRP está verificando se existem caronas para atendimento das longarinas e posterior tomada de decisão entre a Direção do DMSA e PROAEST. (anexado ao 9790/2014)","verificar CNPJ da empresa vencedora\nverificar se houve pagamento"]
["05/2014",1963,"010456/2014","Aquisição de vinte divisórias em madeira compensada resinada espessura 6mm, estruturada em madeira de lei 3x3","Aquisição de vinte divisórias em madeira compensada resinada espessura 6mm, estruturada em madeira de lei 3x3",500030,"PROGRAMA INGLÊS SEM FRONTEIRAS","PROGRAMA INGLÊS SEM FRONTEIRAS","ANEXADO    23083.009790/2014-25","2015-03-26","Já houve empenho (2014NE802293), anulação parcial do empenho (2014NE802390) e a data prevista de entrega é até 15/03/15.\nJá houve empenho (2014NE802296) e a data prevista de entrega é até 15/03/15.\nJá houve empenho (2014NE802301) e a data prevista de entrega é até 15/03/15.\nA SSRP está verificando se existem caronas para atendimento das longarinas e posterior tomada de decisão entre a Direção do DMSA e PROAEST. (anexado no 009790/2014)","verificar CNPJ da empresa vencedora\nverificar se houve pagamento"]
["02/2014","S/Nº","005199/2014","Aquisição de mídia cartão de memória, pen drive, dimensões 59.7mm x 22.3mm x 9.5 mm","Aquisição de mídia cartão de memória, pen drive, dimensões 59.7mm x 22.3mm x 9.5 mm",250020,"LICENCIATURA EM EDUCAÇÃO DO CAMPO - PROCAMPO","LICENCIATURA EM EDUCAÇÃO DO CAMPO - PROCAMPO","ARQUIVO","2015-02-06","Arquivado porque o material foi atendido através do processo 002078/2014.","Despacho da Janaína Gomes."]
["03/2014",1057,"005199/2014","Aquisição de mídia cartão de memória, pen drive, dimensões 59.7mm x 22.3mm x 9.5 mm","Aquisição de mídia cartão de memória, pen drive, dimensões 59.7mm x 22.3mm x 9.5 mm",150070,"PROEXT - OBSERVATÓRIO DE POLÍTICAS DEMOCRÁTICAS DE ACESSO E PERMANÊNCIA NA EDUCAÇÃO SUPERIOR","PROEXT - OBSERV POLÍTICAS DE DEMOCRAT DE ACESSO E PERMANÊNCIA EDUC. SUPERIOR","ARQUIVO","2015-02-06","Arquivado porque o material foi atendido através do processo 002078/2014.","Despacho da Janaína Gomes."]
["50/2014",1961,"010485/2014","Aquisição de dois veículos pickpus","Aquisição de dois veículos pickpus",180000,"CTUR","CTUR","DMSA","2014-11-19","Buscando informações."]
["03/2014",1964,"010486/2014","Aquisição de cento e cinquenta pen drives capacidade 32 gb","Aquisição de cento e cinquenta pen drives capacidade 32 gb",150070,"PROEXT - OBSERVATÓRIO DE POLÍTICAS DEMOCRÁTICAS DE ACESSO E PERMANÊNCIA NA EDUCAÇÃO SUPERIOR","PROEXT - OBSERV POLÍTICAS DE DEMOCRAT DE ACESSO E PERMANÊNCIA EDUC. SUPERIOR","CLOG","2014-11-25","Já houve empenho (2014NE802320) e foi entregue no Almoxarifado em 13/01/15.","verificar CNPJ da empresa vencedora\nverificar se houve pagamento"]
["04/2014",1965,"010486/2014","Aquisição de memória portátil e outros","Aquisição de memória portátil e outros",500030,"PROGRAMA INGLÊS SEM FRONTEIRAS","PROGRAMA INGLÊS SEM FRONTEIRAS","CLOG","2014-11-25","Já houve empenho (2014NE802321) e foi entregue no Almoxarifado em 13/01/15.","verificar CNPJ da empresa vencedora\nverificar se houve pagamento"]
["137/2014",1858,"010493/2014","Aquisição de bola de futsal masculino adulto, etc","Aquisição de bola de futsal masculino adulto, etc",150100,"PRAÇA DE DESPORTOS","DEPARTAMENTO DE ESPORTES E LAZER","ARQUIVO","2015-04-17","Já houve empenho (2014NE802295), pagamento (2015OB800249) e foi entregue no Almoxarifado em 06/01/15.","verificar CNPJ da empresa vencedora\nverificar se houve pagamento"]
["S/Nº","S/Nº","009153/2014","Aquisição de material de higiene e limpeza (IRP)","Aquisição de material de higiene e limpeza (IRP)",120200,"DEPARTAMENTO DE MATERIAL E SERVIÇOS AUXILIARES","DEPARTAMENTO DE MATERIAL E SERVIÇOS AUXILIARES","SSRP","2015-03-16","Aguardando a ata assinada pelo órgão gerenciadorda IRP.","VERIFICAR O PROCESSO"]
["30/2013",638,"009166/2014","Aquisição de material de equipamentos de epi","Aquisição de material de equipamentos de epi",130100,"RESTAURANTE UNIVERSITÁRIO - CAMPUS SEROPÉDICA","RESTAURANTE UNIVERSITÁRIO - CAMPUS SEROPÉDICA","CLOG","2015-04-27","Cotação eletrônica nº 04/2015 finalizada em 04/03/15, mas os preços ofertados estão acima do preço de referência.","verificar CNPJ da empresa vencedora\nverificar se houve pagamento"]
["01/2014",1103,"006266/2014","Aquisição de itens do grupo 30.17A - Acessórios de informática (cartuchos,etc)","Aquisição de itens do grupo 30.17A - Acessórios de informática (cartuchos,etc)",null,"",null,"CPACS","2014-11-04","Buscando informações.","Não está na CPACS, mas a Lidiane está tentando achar."]
["S/Nº","S/Nº","007182/2014","Aquisição de 12 automóveis","Aquisição de 12 automóveis",210000,"INSTITUTO DE AGRONOMIA","INSTITUTO DE AGRONOMIA","SEC. ADM. DO DECANATO DE ASSUNTOS FINANCEIROS","2015-01-22","Já houve empenho (2014NE801671), pagamentos (2015OB800136 e 2015DF800023) e foi entregue no Almoxarifado em 15/12/14.","verificar CNPJ da empresa vencedora\nverificar se houve pagamento"]
["07/2014",1219,"008809/2014","Aquisição de materiais dos itens 18, 19, 21 e 22 do reqmat 07, processo 006358/2014, que não foram comprados","Aquisição de materiais dos itens 18, 19, 21 e 22 do reqmat 07, processo 006358/2014, que não foram comprados",160105,"PROAP - ENGENHARIA QUÍMICA","PROGRAMA DE PÓS-GRADUAÇÃO EM ENGENHARIA QUÍMICA","DIREÇÃO DMSA","2014-10-13","Buscando solução para uso do recurso do PROAP 2014.","VERIFICAR O PROCESSO"]
["S/Nº","S/Nº","007182/2014","Aquisição de 12 automóveis","Aquisição de 12 automóveis",220000,"INSTITUTO DE BIOLOGIA","INSTITUTO DE BIOLOGIA","SEC. ADM. DO DECANATO DE ASSUNTOS FINANCEIROS","2015-01-22","Já houve empenho (2014NE801671), pagamentos (2015OB800136 e 2015DF800023) e foi entregue no Almoxarifado em 15/12/14.","verificar CNPJ da empresa vencedora\nverificar se houve pagamento"]
["S/Nº","S/Nº","007182/2014","Aquisição de 12 automóveis","Aquisição de 12 automóveis",230000,"INSTITUTO DE CIÊNCIAS EXATAS","INSTITUTO DE CIÊNCIAS EXATAS","SEC. ADM. DO DECANATO DE ASSUNTOS FINANCEIROS","2015-01-22","Já houve empenho (2014NE801671), pagamentos (2015OB800136 e 2015DF800023) e foi entregue no Almoxarifado em 15/12/14.","verificar CNPJ da empresa vencedora\nverificar se houve pagamento"]
["S/Nº","S/Nº","007182/2014","Aquisição de 12 automóveis","Aquisição de 12 automóveis",240000,"INSTITUTO DE CIÊNCIAS HUMANAS E SOCIAIS","INSTITUTO DE CIÊNCIAS HUMANAS E SOCIAIS","SEC. ADM. DO DECANATO DE ASSUNTOS FINANCEIROS","2015-01-22","Já houve empenho (2014NE801671), pagamentos (2015OB800136 e 2015DF800023) e foi entregue no Almoxarifado em 15/12/14.","verificar CNPJ da empresa vencedora\nverificar se houve pagamento"]
["23/2014",1943,"010220/2014","Aquisição de lâmina para microscopia e etc","Aquisição de lâmina para microscopia e etc",280010,"HOSPITAL VETERINÁRIO","HOSPITAL VETERINÁRIO","SEÇÃO DE CONTROLE","2014-12-03","Já houve empenho (2014NE802464), mas o prazo de entrega está vencido desde 04/01/15.\nJá houve empenho (2014NE802472) e foi entregue no Almoxarifado em 30/12/14.","verificar CNPJ da empresa vencedora\nverificar se houve pagamento"]
["S/Nº","S/Nº","007182/2014","Aquisição de 12 automóveis","Aquisição de 12 automóveis",250000,"INSTITUTO DE EDUCAÇÃO","INSTITUTO DE EDUCAÇÃO","SEC. ADM. DO DECANATO DE ASSUNTOS FINANCEIROS","2015-01-22","Já houve empenho (2014NE801671), pagamentos (2015OB800136 e 2015DF800023) e foi entregue no Almoxarifado em 15/12/14.","verificar CNPJ da empresa vencedora\nverificar se houve pagamento"]
["09/2014",1775,"008694/2014","Aquisição de materiais químicos","Aquisição de materiais químicos",280010,"HOSPITAL VETERINÁRIO","INSTITUTO DE VETERINÁRIA","SEÇÃO DE CONTROLE","2015-03-31","Já houve empenho (2014NE802488) e foi entregue no Almoxarifado em 22/12/14.","verificar CNPJ da empresa vencedora\nverificar se houve pagamento"]
["01/2014",1072,"005055/2014","Aquisição de rádio comunicador etc","Aquisição de rádio comunicador etc",300000,"CAMPUS DA UFRRJ EM NOVA IGUAÇU","INSTITUTO DE ZOOTECNIA","ARQUIVO","2015-02-06","Arquivado porque o material foi atendido através do processo 008200/2013.","Despacho da Janaína Gomes (14/07/14)."]
["09/2014",1775,"008694/2014","Aquisição de materiais químicos","Aquisição de materiais químicos",300000,"CAMPUS DA UFRRJ EM NOVA IGUAÇU","CAMPUS DA UFRRJ EM NOVA IGUAÇU","SEÇÃO DE CONTROLE","2015-03-31","Já houve empenho (2014NE802490) e foi entregue no Almoxarifado em 22/12/14.","verificar CNPJ da empresa vencedora\nverificar se houve pagamento"]
["S/Nº","S/Nº","007182/2014","Aquisição de 12 automoveis.reqmat.s/n/ichs/icsa/ie/ice/it ia/iv/iz/ib/if/itr/im...alexis rosa nummer e outros","Aquisição de 12 automoveis.reqmat.s/n/ichs/icsa/ie/ice/it ia/iv/iz/ib/if/itr/im...alexis rosa nummer e outros",260000,"INSTITUTO DE FLORESTAS","INSTITUTO DE FLORESTAS","SEC. ADM. DO DECANATO DE ASSUNTOS FINANCEIROS","2015-01-22","Já houve empenho (2014NE801671), pagamentos (2015OB800136 e 2015DF800023) e foi entregue no Almoxarifado em 15/12/14.","verificar CNPJ da empresa vencedora\nverificar se houve pagamento"]
["S/Nº","S/Nº","007182/2014","Aquisição de 12 automóveis","Aquisição de 12 automóveis",270000,"INSTITUTO DE TECNOLOGIA","INSTITUTO DE TECNOLOGIA","SEC. ADM. DO DECANATO DE ASSUNTOS FINANCEIROS","2015-01-22","Já houve empenho (2014NE801671), pagamentos (2015OB800136 e 2015DF800023) e foi entregue no Almoxarifado em 15/12/14.","verificar CNPJ da empresa vencedora\nverificar se houve pagamento"]
["02/2014","S/Nº","003661/2014","Aquisição de botijão de gás","Aquisição de botijão de gás",100500,"COORDENADORIA DE DESENVOLVIMENTO DA PRODUÇÃO","COORDENADORIA DE DESENVOLVIMENTO DA PRODUÇÃO","ANEXADO    23083.002205/2013-85","2014-07-09","Já houve empenho (2014NE800853), pagamento (2014OB804976 e 2014DF801476) e foi entregue no Almoxarifado em 24/06/14.\nJá houve empenho (2013NE802827), pagamento (2014OB800670 e 2014DF800308) e foi entregue no Almoxarifado em 26/12/13. (Anexado ao 002205/2013)","verificar CNPJ da empresa vencedora\nverificar se houve pagamento"]
["S/Nº","S/Nº","007182/2014","Aquisição de 12 automóveis","Aquisição de 12 automóveis",280000,"INSTITUTO DE VETERINÁRIA","INSTITUTO DE VETERINÁRIA","SEC. ADM. DO DECANATO DE ASSUNTOS FINANCEIROS","2015-01-22","Já houve empenho (2014NE801671), pagamentos (2015OB800136 e 2015DF800023) e foi entregue no Almoxarifado em 15/12/14.","verificar CNPJ da empresa vencedora\nverificar se houve pagamento"]
["S/Nº",229,"003664/2014","Aquisição de papel A4 e papel A3","Aquisição de papel A4 e papel A3",150090,"PROEXT - ESTRATÉGIA DESENVOLVIMENTO CADEIA PRODUTIVA COM ABELHAS","PROEXT - ESTRATÉGIA DESENVOLVIMENTO CADEIA PRODUTIVA COM ABELHAS","ARQUIVO","2015-02-06","Arquivado porque as solitações foram realizadas pelos Coordenadores através do Quiosque de Compras.","Despacho da Rosália (25/06/14)."]
["03/2014",228,"003664/2014","Aquisição de papel A4 e papel A3","Aquisição de papel A4 e papel A3",150600,"PROEXT - APOIO À PRÁTICAS TRADICIONAIS NO USO DE PLANTAS MEDICINAIS","PROGRAMA PROEXT-MEC 2014 ","ARQUIVO","2015-02-06","Arquivado porque as solitações foram realizadas pelos Coordenadores através do Quiosque de Compras.","Despacho da Rosália (25/06/14)."]
["S/Nº","S/Nº","007182/2014","Aquisição de 12 automóveis","Aquisição de 12 automóveis",290000,"INSTITUTO DE ZOOTECNIA","INSTITUTO DE ZOOTECNIA","SEC. ADM. DO DECANATO DE ASSUNTOS FINANCEIROS","2015-01-22","Já houve empenho (2014NE801671), pagamentos (2015OB800136 e 2015DF800023) e foi entregue no Almoxarifado em 15/12/14.","verificar CNPJ da empresa vencedora\nverificar se houve pagamento"]
["S/Nº","S/Nº","007182/2014","Aquisição de 12 automóveis","Aquisição de 12 automóveis",300000,"CAMPUS DA UFRRJ EM NOVA IGUAÇU","CAMPUS DA UFRRJ EM NOVA IGUAÇU","SEC. ADM. DO DECANATO DE ASSUNTOS FINANCEIROS","2015-01-22","Já houve empenho (2014NE801671), pagamentos (2015OB800136 e 2015DF800023) e foi entregue no Almoxarifado em 15/12/14.","verificar CNPJ da empresa vencedora\nverificar se houve pagamento"]
["S/Nº","S/Nº","007182/2014","Aquisição de 12 automóveis","Aquisição de 12 automóveis",400000,"CAMPUS DA UFRRJ EM TRÊS RIOS","CAMPUS DA UFRRJ EM TRÊS RIOS","SEC. ADM. DO DECANATO DE ASSUNTOS FINANCEIROS","2015-01-22","Já houve empenho (2014NE801671), pagamentos (2015OB800136 e 2015DF800023) e foi entregue no Almoxarifado em 15/12/14.","verificar CNPJ da empresa vencedora\nverificar se houve pagamento"]
["S/Nº","S/Nº","002827/2014","Aquisição de cartuchos","Aquisição de cartuchos",100000,"REITORIA","REITORIA","SAPG","2014-11-17","Já houve empenho (2014NE800771), pagamento (2014OB808377) e foi entregue no Almoxarifado em 15/07/14.","verificar por que está na SAPG\nverificar CNPJ da empresa vencedora\nverificar se houve pagamento"]
["S/Nº","S/Nº","002827/2014","Aquisição de cartuchos","Aquisição de cartuchos",110000,"PRÓ-REITORIA DE ASSUNTOS ADMINISTRATIVOS","PRÓ-REITORIA DE ASSUNTOS ADMINISTRATIVOS","SAPG","2014-11-17","Já houve empenho (2014NE800771), pagamento (2014OB808377) e foi entregue no Almoxarifado em 15/07/14.","verificar por que está na SAPG\nverificar CNPJ da empresa vencedora\nverificar se houve pagamento"]
["S/Nº","S/Nº","002827/2014","Aquisição de cartuchos","Aquisição de cartuchos",120100,"DEPARTAMENTO DE CONTABILIDADE E FINANÇAS","DEPARTAMENTO DE CONTABILIDADE E FINANÇAS","SAPG","2014-11-17","Já houve empenho (2014NE800771), pagamento (2014OB808377) e foi entregue no Almoxarifado em 15/07/14.","verificar por que está na SAPG\nverificar CNPJ da empresa vencedora\nverificar se houve pagamento"]
["S/Nº","S/Nº","002827/2014","Aquisição de cartuchos","Aquisição de cartuchos",120210,"ESTOQUE","ESTOQUE","SAPG","2014-11-17","Já houve empenho (2014NE800771), pagamento (2014OB808377) e foi entregue no Almoxarifado em 15/07/14.","verificar por que está na SAPG\nverificar CNPJ da empresa vencedora\nverificar se houve pagamento"]
["S/Nº","S/Nº","002827/2014","Aquisição de cartuchos","Aquisição de cartuchos",140117,"ENGENHARIA DE AGRIMENSURA E CARTOGRÁFICA","ENGENHARIA DE AGRIMENSURA E CARTOGRAFICA","SAPG","2014-11-17","Já houve empenho (2014NE800771), pagamento (2014OB808377) e foi entregue no Almoxarifado em 15/07/14.","verificar por que está na SAPG\nverificar CNPJ da empresa vencedora\nverificar se houve pagamento"]
["S/Nº","S/Nº","002827/2014","Aquisição de cartuchos","Aquisição de cartuchos",220200,"DEPARTAMENTO DE BOTÂNICA","DEPARTAMENTO DE BOTÂNICA","SAPG","2014-11-17","Já houve empenho (2014NE800771), pagamento (2014OB808377) e foi entregue no Almoxarifado em 15/07/14.","verificar por que está na SAPG\nverificar CNPJ da empresa vencedora\nverificar se houve pagamento"]
["S/Nº","S/Nº","002827/2014","Aquisição de cartuchos","Aquisição de cartuchos",240000,"INSTITUTO DE CIÊNCIAS HUMANAS E SOCIAIS","INSTITUTO DE CIÊNCIAS HUMANAS E SOCIAIS","SAPG","2014-11-17","Já houve empenho (2014NE800771), pagamento (2014OB808377) e foi entregue no Almoxarifado em 15/07/14.","verificar por que está na SAPG\nverificar CNPJ da empresa vencedora\nverificar se houve pagamento"]
["S/Nº","S/Nº","002827/2014","Aquisição de cartuchos","Aquisição de cartuchos",280000,"INSTITUTO DE VETERINÁRIA","INSTITUTO DE VETERINÁRIA","SAPG","2014-11-17","Já houve empenho (2014NE800771), pagamento (2014OB808377) e foi entregue no Almoxarifado em 15/07/14.","verificar por que está na SAPG\nverificar CNPJ da empresa vencedora\nverificar se houve pagamento"]
["S/Nº","S/Nº","002827/2014","Aquisição de cartuchos","Aquisição de cartuchos",600000,"INSTITUTO DE CIÊNCIAS SOCIAIS APLICADAS","INSTITUTO DE CIÊNCIAS SOCIAIS APLICADAS","SAPG","2014-11-17","Já houve empenho (2014NE800771), pagamento (2014OB808377) e foi entregue no Almoxarifado em 15/07/14.","verificar por que está na SAPG\nverificar CNPJ da empresa vencedora\nverificar se houve pagamento"]
["02/2014",963,"006353/2014","Aquisição de agulha, tipo agulha hipodérmica, tamanho 13 x 4,5, material corpo em aco inox e etc","Aquisição de agulha, tipo agulha hipodérmica, tamanho 13 x 4,5, material corpo em aco inox e etc",160107,"PROAP - MEDICINA VETERINÁRIA","PROGRAMA DE PÓS-GRADUAÇÃO EM MEDICINA VETERINÁRIA","DIREÇÃO DMSA","2015-01-26","Aguardando avaliação da Direção após pesquisa de preços.","VERIFICAR O PROCESSO"]
["02/2014",754,"003666/2014","Aquisição de cartuchos de tinta","Aquisição de cartuchos de tinta",150070,"PROEXT - OBSERVATÓRIO DE POLÍTICAS DEMOCRÁTICAS DE ACESSO E PERMANÊNCIA NA EDUCAÇÃO SUPERIOR","PROEXT - OBSERVATÓRIO DE POLÍTICAS DEMOCRÁTICAS DE ACESSO E PERMANÊNCIA NA EDUCAÇÃO SUPERIOR","SPP","2014-07-17","Pesquisa de preço.","verificar porque está na Pesquisa até hoje"]
["S/Nº",776,"003666/2014","Aquisição de cartuchos de tinta",{"$f":"D643","v":"Aquisição de cartuchos de tinta"},150080,"PROEXT - MÃOS QUE CRIAM - PROJETO DE CAPACITAÇÃO PARA PROMOÇÃO SOCIAL","PRÓ-REITORIA DE EXTENSÃO - PROJETO \"MÃOS QUE CRIAM\"","SPP","2014-07-17","Pesquisa de preço.","verificar porque está na Pesquisa até hoje"]
["05/2014",904,"003666/2014","Aquisição de cartuchos de tinta","Aquisição de cartuchos de tinta",150090,"PROEXT - ESTRATÉGIA DESENVOLVIMENTO CADEIA PRODUTIVA COM ABELHAS","PROEXT - ESTRATÉGIA DESENVOLVIMENTO CADEIA PRODUTIVA COM ABELHAS","SPP","2014-07-17","Pesquisa de preços.","verificar porque está na Pesquisa até hoje"]
["01/2014",1056,"003666/2014","Aquisição de cartuchos de tinta","Aquisição de cartuchos de tinta",150400,"PROEXT - PROGRAMA APOIO E ACOMPANHAMENTO USO DE LAPTOPS ESCOLA POR ALUNO","PROEXT - PROGRAMA APOIO E ACOMPANHAMENTO NO USO DE LAPTOPS ESCOLA POR ALUNO ","SPP","2014-07-17","Pesquisa de preço.","verificar porque está na Pesquisa até hoje"]
["04/2014",1058,"003666/2014","Aquisição de cartuchos de tinta","Aquisição de cartuchos de tinta",150600,"PROEXT - APOIO À PRÁTICAS TRADICIONAIS NO USO DE PLANTAS MEDICINAIS","PROGRAMA PROEXT MEC 2014","SPP","2014-07-17","Pesquisa de preço.","verificar porque está na Pesquisa até hoje"]
["07/2014",1059,"003666/2014","Aquisição de cartuchos de tinta","Aquisição de cartuchos de tinta",150080,"PROEXT - MÃOS QUE CRIAM - PROJETO DE CAPACITAÇÃO PARA PROMOÇÃO SOCIAL","PRÓ-REITORIA DE EXTENSÃO - PROJETO \"MÃOS QUE CRIAM\"","SPP","2014-07-17","Pesquisa de preço.","verificar porque está na Pesquisa até hoje"]
["05/2014",1643,"003666/2014","Aquisição de cartuchos de tinta","Aquisição de cartuchos de tinta",140530,"DOCÊNCIA NA EDUCAÇÃO INFANTIL","INSTITUTO MULTIDISCIPLINAR - CURSO DE PÓS-GRADUAÇÃO \"DOCÊNCIA NA EDUCAÇÃO INFANTIL\"","SPP","2014-07-17","Pesquisa de preço.","verificar porque está na Pesquisa até hoje"]
["80/2014",1375,"003666/2014","Aquisição de cartuchos de tinta","Aquisição de cartuchos de tinta",230300,"DEPARTAMENTO DE QUÍMICA","DEPARTAMENTO DE QUÍMICA","SPP","2014-07-17","Pesquisa de preço.","verificar porque está na Pesquisa até hoje"]
["08/2014",1735,"003666/2014","Aquisição de cartuchos de tinta","Aquisição de cartuchos de tinta",140000,"PRÓ-REITORIA DE ENSINO E GRADUAÇÃO","DRA, NAP II, MONITORIA","SPP","2014-07-17","Pesquisa de preço.","verificar porque está na Pesquisa até hoje"]
["40/2014",1459,"003666/2014","Aquisição de cartuchos de tinta","Aquisição de cartuchos de tinta",260000,"INSTITUTO DE FLORESTAS","DIRETORIA","SPP","2014-07-17","Pesquisa de preço.","verificar porque está na Pesquisa até hoje"]
["28/2014",1490,"003666/2014","Aquisição de cartuchos de tinta","Aquisição de cartuchos de tinta",100300,"PREFEITURA UNIVERSITÁRIA","SECRETARIA","SPP","2014-07-17","Pesquisa de preço.","verificar porque está na Pesquisa até hoje"]
["70/2014",1462,"003666/2014","Aquisição de cartuchos de tinta","Aquisição de cartuchos de tinta",220500,"DEPARTAMENTO DE GENÉTICA","DEPARTAMENTO DE GENÉTICA","SPP","2014-07-17","Pesquisa de preço.","verificar porque está na Pesquisa até hoje"]
["329/2014",1392,"003666/2014","Aquisição de cartuchos de tinta","Aquisição de cartuchos de tinta",110300,"DEPARTAMENTO DE PESSOAL","SECRETARIA","SPP","2014-07-17","Pesquisa de preço.","verificar porque está na Pesquisa até hoje"]
["08/2014",1422,"003666/2014","Aquisição de cartuchos de tinta","Aquisição de cartuchos de tinta",210000,"INSTITUTO DE AGRONOMIA","DIRETORIA","SPP","2014-07-17","Pesquisa de preço.","verificar porque está na Pesquisa até hoje"]
["31/2014",1423,"003666/2014","Aquisição de cartuchos de tinta","Aquisição de cartuchos de tinta",290000,"INSTITUTO DE ZOOTECNIA","DIRETORIA","SPP","2014-07-17","Pesquisa de preço.","verificar porque está na Pesquisa até hoje"]
["S/Nº","S/Nº","007182/2014","Aquisição de 12 automóveis","Aquisição de 12 automóveis",600000,"INSTITUTO DE CIÊNCIAS SOCIAIS APLICADAS","INSTITUTO DE CIÊNCIAS SOCIAIS APLICADAS","SEC. ADM. DO DECANATO DE ASSUNTOS FINANCEIROS","2015-01-22","Já houve empenho (2014NE801671), pagamentos (2015OB800136 e 2015DF800023) e foi entregue no Almoxarifado em 15/12/14.","verificar CNPJ da empresa vencedora\nverificar se houve pagamento"]
["01/2014",230,"003653/2014","Aquisição de detergente líquido, etc","Aquisição de detergente líquido, etc",150090,"PROEXT - ESTRATÉGIA DESENVOLVIMENTO CADEIA PRODUTIVA COM ABELHAS","PROEXT - ESTRATÉGIA DESENVOLVIMENTO CADEIA PRODUTIVA COM ABELHAS","ARQUIVO","2015-02-06","Arquivado porque os itens 3 e 4, constantes no REQMAT presentes às fls 02 do presente processo já foram solicitados através do Quiosque de Compras, conforme PEDMAT anexado às fls 26. Além disso, a aquisição dos itens 1 e 2 não será mais necessária visto que serão fornecidos pela Pró-Reitoria de Extensão e o Instituto de Zootecnia.","Despacho da Maria Cristina Affonso Lorenzon no dia 29/05/2014."]
["07/2014","S/Nº","002108/2014","Contratação de serviço de alimentação - almoço e jantar, na forma de quentinhas, durante 90 dias","Contratação de serviço de alimentação - almoço e jantar, na forma de quentinhas, durante 90 dias",130100,"RESTAURANTE UNIVERSITÁRIO - CAMPUS SEROPÉDICA","RESTAURANTE UNIVERSITÁRIO - CAMPUS SEROPÉDICA","PROAES","2015-01-12","Já houve empenho (2014NE800549), anulação parcial do empenho (2014NE801070) e pagamentos (2014OB803910, 2014OB803530, 2014OB803133, 2014OB802778, 2014OB804203 e 2014OB802607).","verificar CNPJ da empresa vencedora\nverificar se houve pagamento"]
["06/2014",681,"003008/2014","Aquisição de arame farpado com distância entre as farpas de no máximo 125mm","Aquisição de arame farpado com distância entre as farpas de no máximo 125mm",100500,"COORDENADORIA DE DESENVOLVIMENTO DA PRODUÇÃO","COORDENADORIA DE DESENVOLVIMENTO DA PRODUÇÃO","ARQUIVO","2014-09-09","Arquivado porque  houve empenho (2014NE800861) e pagamento (2014OB804762 e 2014DF801441)."]
["02/2014",1849,"009341/2014","Locação de espaço de hotel (2 dias) para realização do V Seminário de Avaliação do PPGEDUC","Locação de espaço de hotel (2 dias) para realização do V Seminário de Avaliação do PPGEDUC",250000,"INSTITUTO DE EDUCAÇÃO","INSTITUTO DE EDUCAÇÃO","SAPG","2015-03-19","Houve empenho (2014NE802438) e pagamento (2015OB800259).","atulizado 16/04/2015"]
["19/2014",1949,"010408/2014","Recuperação na rede de esgoto do pavilhão de aulas do IT","Recuperação na rede de esgoto do pavilhão de aulas do IT",270000,"INSTITUTO DE TECNOLOGIA","INSTITUTO DE TECNOLOGIA","DIVISÃO DE CONTABILIDADE","2015-04-17","Houve empenho (2015NE800197) e está elaborando a minuta de contrato.","verificar CNPJ da empresa vencedora\nverificar se houve pagamento"]
["39/2014",1840,"009343/2014","Adequação da planta de frutas do DTA","Adequação da planta de frutas do DTA",270400,"DEPARTAMENTO DE TECNOLOGIA DE ALIMENTOS","DEPARTAMENTO DFE TECNOLOGIA DE ALIMENTOS","DIREÇÃO DMSA","2014-11-07","Buscando informações.","Despacho 22/10/14 da Lucélia encaminhando à SPP para realizar pesquisa de preço."]
["34/2014",1734,"009342/2014","Solicitação de contratação de serviço especializado em processamento de material bibliográfico","Solicitação de contratação de serviço especializado em processamento de material bibliográfico",180000,"CTUR","CTUR","DIREÇÃO DMSA","2014-11-07","Buscando informações.","Despacho 22/10/14 da Lucélia encaminhando à SPP para realizar pesquisa de preço."]
["279/2014",1917,"009789/2014","Serviços de recuperação do assoalho de madeira e acabamento das salas 125, 126,127 e 128 do P1","Serviços de recuperação do assoalho de madeira e acabamento das salas 125, 126,127 e 128 do P1",100000,"REITORIA","REITORIA","CADMIN","2015-05-12","Realizando ajustes após emissão de parecer jurídico.","verificar número do Pregão e CNPJ da empresa vencedora - Empenho e pagamento"]
["45/2014",1909,"009792/2014","Serviços de confecção com fornecimento de 14.000 cintas elásticas para unir processos","Serviços de confecção com fornecimento de 14.000 cintas elásticas para unir processos",110000,{"$f":"IFERROR(VLOOKUP(F666,$A$994:$B$1311,2,0),\"\")","v":"PRÓ-REITORIA DE ASSUNTOS ADMINISTRATIVOS"},"PROAD/PROTOCOLO","DRA. IVANIR","2015-04-30","Elaboração da minuta de edital.","verificar número do Pregão e CNPJ da empresa vencedora - Empenho e pagamento"]
["16/2014",1912,"009792/2014","Serviços de confecção com fornecimento de 14.000 cintas elásticas para unir processos","Serviços de confecção com fornecimento de 14.000 cintas elásticas para unir processos",160000,"PRÓ-REITORIA DE PESQUISA E PÓS GRADUAÇÃO","PRÓ-REITORIA DE PESQUISA E PÓS GRADUAÇÃO","DRA. IVANIR","2015-04-30","Elaboração da minuta de edital.","verificar número do Pregão e CNPJ da empresa vencedora - Empenho e pagamento"]
["47/2014",1748,"009851/2014","Contratação de serviços (conserto/manutenção) de micrótomo microm hm450, RM 235609; Manutenção preventiva","Contratação de serviços (conserto/manutenção) de micrótomo microm hm450, RM 235609; Manutenção preventiva",260000,"INSTITUTO DE FLORESTAS","INSTITUTO DE FLORESTAS","SCD","2015-04-09","Verificando a situação da carta de exclusividade, que não está válida.","VERIFICAR O PROCESSO"]
["75/2014",1804,"009586/2014","Restauração com substituição de peças de janelas de esquadria de madeira ,etc","Restauração com substituição de peças de janelas de esquadria de madeira ,etc",280000,"INSTITUTO DE VETERINÁRIA","INSTITUTO DE VETERINÁRIA","SPP","2014-10-31","Pesquisa de Preço.","verificar porque está na Pesquisa até hoje"]
["03/2014",1925,"010106/2014","Contratação de empresa especializada na prestação de serviços continuados de vigilância e segurança armada","Contratação de empresa especializada na prestação de serviços continuados de vigilância e segurança armada",400000,"CAMPUS DA UFRRJ EM TRÊS RIOS","CAMPUS DA UFRRJ EM TRÊS RIOS","DRA. JAQUELINE","2015-03-26","Emissão de parecer Jurídico","atualizado 20/04/2015"]
["04/2014",1928,"010107/2014","Contratação de empresa especializada na prestação de serviços continuados de asseio e conservação, com fornecimento","Contratação de empresa especializada na prestação de serviços continuados de asseio e conservação, com fornecimento",400000,"CAMPUS DA UFRRJ EM TRÊS RIOS","CAMPUS DA UFRRJ EM TRÊS RIOS","SPP","2014-11-13","Pesquisa de Preço.","verificar porque está na Pesquisa até hoje"]
["49/2014",1777,"009587/2014","Reforma de portas, janelas e confecção de balcão de mdf para DPA/IZ","Reforma de portas, janelas e confecção de balcão de mdf para DPA/IZ",290000,"INSTITUTO DE ZOOTECNIA","INSTITUTO DE ZOOTECNIA","SCD","2015-05-12","Análise e posterior encaminhamento à PROAF para autorização da despesa","atualizado 07/05/2015"]
["74/2014",1803,"009585/2014","Instalação e fornecimento porta de madeira almofadada de madeira maciça, etc. no térreo do prédio principal do IV","Instalação e fornecimento porta de madeira almofadada de madeira maciça, etc. no térreo do prédio principal do IV",280000,"INSTITUTO DE VETERINÁRIA","INSTITUTO DE VETERINÁRIA","DIREÇÃO DMSA","2014-11-07","Buscando informações.","Despacho 31/10/14 da Lucélia encaminhando à SPP para realizar pesquisa de preço."]
["01/2014",1896,"009504/2014","Contratação de serviços de engenharia para elaboração de projeto básico e executivo de reforma das atuais dependências do Almoxarifado Central","Contratação de serviços de engenharia para elaboração de projeto básico e executivo de reforma das atuais dependências do Almoxarifado Central",120200,"DEPARTAMENTO DE MATERIAL E SERVIÇOS AUXILIARES","ALMOXARIFADO","ARQUIVO","2015-04-27","O processo será cancelado e arquivado porque existe outro em tramitação.","Informações obtidas com Rafael Martins (SPP)."]
["25/2014",1861,"009289/2014","Assinatura anual banco de preços, sistema inteligente de pesquisas baseado em resultados de licitações adjudicadas e homologadas","Assinatura anual banco de preços, sistema inteligente de pesquisas baseado em resultados de licitações adjudicadas e homologadas",120200,"DEPARTAMENTO DE MATERIAL E SERVIÇOS AUXILIARES","DEPARTAMENTO DE MATERIAL E SERVIÇOS AUXILIARES","DIREÇÃO DMSA","2015-04-06","O empenho foi emitido (2014NE802195) e a empresa já está prestando os serviços.","verificar CNPJ da empresa vencedora\nverificar se houve pagamento"]
["06/2014",1811,"009173/2014","Reparo e mautenção de estufa de secagem e esterelização","Reparo e mautenção de estufa de secagem e esterelização",160112,"PROAP - ZOOTECNIA","PROGRAMA DE PÓS-GRADUAÇÃO EM ZOOTECNIA","SPP","2014-10-17","Pesquisa de Preço.","verificar porque está na Pesquisa até hoje"]
["05/2014",1812,"009173/2014","Reparo e mautenção de estufa de secagem e esterelização","Reparo e mautenção de estufa de secagem e esterelização",160112,"PROAP - ZOOTECNIA","PROGRAMA DE PÓS-GRADUAÇÃO EM ZOOTECNIA","SPP","2014-10-17","Pesquisa de Preço.","verificar porque está na Pesquisa até hoje"]
["247/2014",1836,"009267/2014","Adequação do espaco físico da sala da Coordenação do Curso de Química","Adequação do espaco físico da sala da Coordenação do Curso de Química",230300,"DEPARTAMENTO DE QUÍMICA","DEPARTAMENTO DE QUÍMICA","SPP","2015-04-02","Pesquisa de Preço.","atualizado 20/04/2015"]
["02/2014",1737,"008354/2014","Solicitação de transporte rodoviário com 44 lugares","Solicitação de transporte rodoviário com 44 lugares",180000,"CTUR","CTUR","ARQUIVO","2015-03-06","Arquivado porque o pedido será atendido através do processo 008337/2012.","Despacho Janaína Gomes em 23/09/14."]
["144/2014",1019,"005013/2014","Contratação de empresa especializada em serviços de vigilância patrimonial armada e segurança para atender a UFRRJ","Contratação de empresa especializada em serviços de vigilância patrimonial armada e segurança para atender a UFRRJ",100060,"DIVISÃO DE GUARDA E VIGILÂNCIA","REITORIA/DGV","SPP","2015-03-09","Pesquisa de Preço.","atualizado 20/04/2015"]
["03/2014",1468,"001009/2014","Prestação de serviços continuados de limpeza, conservação e higienização nas dependências da UFRRJ, Campus Seropédica/RJ","Prestação de serviços continuados de limpeza, conservação e higienização nas dependências da UFRRJ, Campus Seropédica/RJ",120000,"PRÓ-REITORIA DE ASSUNTOS FINANCEIROS","PRÓ-REITORIA DE ASSUNTOS FINANCEIROS","DIVISÃO DE ADMINISTRAÇÃO FINANCEIRA","2015-04-01","Repactuação do contrato.","verificar CNPJ da empresa vencedora\nverificar se houve pagamento"]
["14/2014","S/Nº","003913/2014","Serviço de gerenciamento para fornecimento de óleos","Serviço de gerenciamento para fornecimento de óleos",100300,"PREFEITURA UNIVERSITÁRIA","DIVISÃO DE SERVIÇOS GERAIS","SPP","2014-06-04","Pesquisa de Preço.","verificar porque está na Pesquisa até hoje"]
["183/2014","S/Nº","010435/2014","Aquisição de softwares administrativos especializados","Aquisição de softwares administrativos especializados",100400,"COORDENADORIA DE INFORMÁTICA","COORDENADORIA DE INFORMÁTICA","SPP","2015-04-20","Enquadramento","atualizado 20/04/2015"]
["184/2014","S/Nº","010436/2014","Serviço de instalação e manutenção de rede elétrica de cabeamento lógico","Serviço de instalação e manutenção de rede elétrica de cabeamento lógico",100400,"COORDENADORIA DE INFORMÁTICA","COORDENADORIA DE INFORMÁTICA","SPP","2014-11-19","Pesquisa de Preço.","verificar porque está na Pesquisa até hoje"]
["01/2014","S/Nº","008556/2014","Reforma e adequação do Auditório do ITR","Reforma e adequação do Auditório do ITR",400000,"CAMPUS DA UFRRJ EM TRÊS RIOS","CAMPUS DA UFRRJ EM TRÊS RIOS","COORD. DE PROJETOS DE ENGENHARIA E ARQUITETURA","2015-01-21","Buscando informações."]
["20/2013","S/Nº","000121/2014","Contratação de um serviço de assinatura de jornal, diário de grande circulação com abrangência nacional","Contratação de um serviço de assinatura de jornal, diário de grande circulação com abrangência nacional",100000,"REITORIA","REITORIA","ARQUIVO","2014-11-03","Arquivado porque houve empenho (2014NE801533) e pagamentos (2014OB807181 e 2014DF801855)."]
["02/2014","S/Nº","002445/2014","Contrataçao de empresa para efetuar publicações de avisos de editais de licitação (publicaçao no Jornal O Dia)","Contrataçao de empresa para efetuar publicações de avisos de editais de licitação (publicaçao no Jornal O Dia)",120200,"DEPARTAMENTO DE MATERIAL E SERVIÇOS AUXILIARES","DEPARTAMENTO DE MATERIAL E SERVIÇOS AUXILIARES","ARQUIVO","2014-09-26","Arquivado porque  houve empenho (2014NE800481) e pagamentos (2014OB802341, 2014OB803274, 2014OB804979 e 2014OB805941)."]
["01/2014","S/Nº","004063/2014","Contratação de serviços para manutenção de veículos com reposição de peças e gerenciamento de serviços","Contratação de serviços para manutenção de veículos com reposição de peças e gerenciamento de serviços",400000,"CAMPUS DA UFRRJ EM TRÊS RIOS","CAMPUS DA UFRRJ EM TRÊS RIOS","DEPARTAMENTO DE CONTABILIDADE E FINANÇAS","2015-05-12",null,"Verificar se houve empenho e pagamento com Denis."]
["13/2014","S/Nº","004420/2014","Contratação de serviço de balanceamento, alinhamento e cambagem da viatura Nissan, Frontier, placa KPG 9045 e outros","Contratação de serviço de balanceamento, alinhamento e cambagem da viatura Nissan, Frontier, placa KPG 9045 e outros",100300,"PREFEITURA UNIVERSITÁRIA","PREFEITURA UNIVERSITÁRIA","ARQUIVO","2014-11-07","Arquivado porque  houve empenho (2014NE801401) e pagamento (2014OB808293)."]
["22/2014",1948,"010243/2014","Contratação de empresa para prestação de serviço no ramo de alimentação","Contratação de empresa para prestação de serviço no ramo de alimentação",130100,"RESTAURANTE UNIVERSITÁRIO - CAMPUS SEROPÉDICA","PRÓ-REITORIA DE ASSUNTOS ESTUDANTIS","COORDENAÇÃO DE CONTRATOS E IMPORTAÇÃO","2015-05-12","Analisando esclarecimentos sobre os cargos solicitados na contratação em questão (despachos envolvendo DP, DMSA e PROAEST).","Foi entregue em mãos ao Gustavo para elaborar o edital."]
["365/2014","S/Nº","011220/2014","Abertura de processo de licitação - Fotocopiadora no IE","Abertura de processo de licitação - Fotocopiadora no IE",250000,"INSTITUTO DE EDUCAÇÃO","SETOR DE CANTINAS","DR. PAULINO","2015-05-11","Emissão de parecer Jurídico","atualizado 20/04/2015"]
["80/2014","S/Nº","008931/2014","Licitação para obra de reforma do prédio da cantina do IV","Licitação para obra de reforma do prédio da cantina do IV",120000,"PRÓ-REITORIA DE ASSUNTOS FINANCEIROS","PRÓ-REITORIA DE ASSUNTOS FINANCEIROS","PREFEITURA UNIVERSITÁRIA","2015-04-28","Houve empenho (2015NE800190) e está em fase de assinatura do contrato para início da prestação dos serviços.","verificar CNPJ da empresa vencedora\nverificar se houve pagamento"]
["16/2014","S/Nº","011373/2014","Abertura de processo de concessão de espaço - Reprografia no ICE/PQ","Abertura de processo de concessão de espaço - Reprografia no ICE/PQ",120000,"PRÓ-REITORIA DE ASSUNTOS FINANCEIROS","SETOR DE PONTOS COMERCIAIS","DR. PAULINO","2015-05-11","Emissão de parecer Jurídico","atualizado 20/04/2015"]
["19/2014","S/Nº","011376/2014","Abertura de processo de concessão de espaço - Venda de livros no Instituto de Educação","Abertura de processo de concessão de espaço - Venda de livros no Instituto de Educação",120000,"PRÓ-REITORIA DE ASSUNTOS FINANCEIROS","SETOR DE PONTOS COMERCIAIS","DRA. JAQUELINE","2015-05-06","Elaboração da minuta de edital.","atualizado 20/04/2015"]
["17/2014","S/Nº","011374/2014","Abertura de processo de concessão de espaço - Reprografia IV","Abertura de processo de concessão de espaço - Reprografia IV",120000,"PRÓ-REITORIA DE ASSUNTOS FINANCEIROS","SETOR DE PONTOS COMERCIAIS","DRA. IVANI","2015-04-10","Emissão de parecer Jurídico","atualizado 20/04/2015"]
["18/2014","S/Nº","011375/2014","Abertura de processo de concessão de espaço - Reprografia no Instituto de Educação","Abertura de processo de concessão de espaço - Reprografia no Instituto de Educação",120000,"PRÓ-REITORIA DE ASSUNTOS FINANCEIROS","SETOR DE PONTOS COMERCIAIS","DRA. IVANI","2015-04-10","Emissão de parecer Jurídico","atualizado 20/04/2015"]
["13/2014","S/Nº","011372/2014","Abertura de processo de concessão de espaço - Reprografia no Pavilhão Central","Abertura de processo de concessão de espaço - Reprografia no Pavilhão Central",120000,"PRÓ-REITORIA DE ASSUNTOS FINANCEIROS","SETOR DE PONTOS COMERCIAIS","DR. PAULINO","2015-05-11","Emissão de parecer Jurídico","atualizado 20/04/2015"]
["47/2014","S/Nº","002096/2014","Alerta sobre preços praticados em pregões eletrônicos na UFRRJ","Alerta sobre preços praticados em pregões eletrônicos na UFRRJ",220000,"INSTITUTO DE BIOLOGIA","INSTITUTO DE BIOLOGIA","ARQUIVO","2015-03-06","Arquivado após entendimento firmado entre a Pró-reitora de Assuntos Financeiros e a Direção do Instituto de Biologia sobre o cancelamento dos itens com preços praticados acima da média de mercado e devidos esclarecimentos dos técnicos do DMSA.","Despacho da Nídia em 01/04/14 \"Ao Sr. Chefe do Departamento de Ciências Fisiologica do IB, após conhecimento da Srª Diretora do IB, inicialmente agradecendo o alerta e encaminhando os esclarecimentos dos técnicos do DMSA sobre o problema. Esclareço ainda que estes itens com preço equivocados serão cancelados, assim como todos os preços da ata de SRP serão analisados e se acima do mercado cancelados também. Os itens cancelados serão objeto de novo pregão. \" e arquivado 3 meses depois através do despacho da Diretora Solange V. Paschoal B. Brandolini."]
["78/2014","S/Nº","003939/2014","Obras nos Laboratórios de Microbiologia de Alimentos e Fermentações para o conserto de vazamento de gás","Obras nos Laboratórios de Microbiologia de Alimentos e Fermentações para o conserto de vazamento de gás",270000,"INSTITUTO DE TECNOLOGIA","DEPARTAMENTO DE TECNOLOGIA DE ALIMENTOS","ARQUIVO","2015-03-06","Arquivado porque a contratação da empresa para adequação da tubulação e conserto do vazamento de gás nos Laboratórios de Microbiologia de Alimentos e Fermentações do DTA já foi efetuada através do processo 003094/2014 e gerou a emissão da nota de empenho 2014NE800708. Além disso, o referido empenho já foi transmitido à empresa e a previsão de início dos serviços é na próxima semana (despacho em 04/06/14).","Despacho da Danielle Motta em 04/06/14 e pedido de arquivamento do José Antonio Pimenta Barros em 04/08/2014."]
["39/2014","S/Nº","004550/2014","Licitação de um trailer móvel - Deverá oferecer o serviço de lanches no Pavilhão de Aulas Teóricas Campus Seropédica","Licitação de um trailer móvel - Deverá oferecer o serviço de lanches no Pavilhão de Aulas Teóricas Campus Seropédica",120000,"PRÓ-REITORIA DE ASSUNTOS FINANCEIROS","SETOR DE PONTOS COMERCIAIS","SETOR CONTROLE CANTINA PONTO COM. E ESPACO DE DIVULGACAO","2014-06-30","Emissão de parecer técnico.","atualizado 20/04/2015"]
["02/2014","S/Nº","002050/2014","Solicitação de licitação do restautante e lanchonete do ICHS","Solicitação de licitação do restautante e lanchonete do ICHS",120000,"PRÓ-REITORIA DE ASSUNTOS FINANCEIROS","PRÓ-REITORIA DE ASSUNTOS FINANCEIROS","SEC. ADM. DO DECANATO DE ASSUNTOS FINANCEIROS","2015-03-11","Emissão de parecer técnico."]
["14/2014","S/Nº","011070/2014","Licitação para espaço destinado à reprografia ","Licitação para espaço destinado à reprografia ",400000,"CAMPUS DA UFRRJ EM TRÊS RIOS","CAMPUS DA UFRRJ EM TRÊS RIOS","DRA. IVANI","2015-04-10","Aguardando autorização da despesa."]
["35/2014","S/Nº","004540/2014","Licitação de um trailer móvel para oferecer lanches no Instituto de Florestas","Licitação de um trailer móvel para oferecer lanches no Instituto de Florestas",120000,"PRÓ-REITORIA DE ASSUNTOS FINANCEIROS","SETOR DE CANTINAS","SETOR CONTROLE CANTINA PONTO COM. E ESPAÇO DE DIVULGAÇÃO","2014-06-30","Emissão de parecer técnico."]
["36/2014","S/Nº","004541/2014","Licitação de um trailer móvel para oferecer serviços de lanches no Instituto Multidisciplinar","Licitação de um trailer móvel para oferecer serviços de lanches no Instituto Multidisciplinar",120000,"PRÓ-REITORIA DE ASSUNTOS FINANCEIROS","SETOR DE CANTINAS","COMISSÃO DE LICITAÇÃO","2014-10-13","Elaboração da minuta de edital."]
["81/2014","S/Nº","008932/2014","Licitação para obra de reforma da cantina do Pavilhão Central","Licitação para obra de reforma da cantina do Pavilhão Central",120000,"PRÓ-REITORIA DE ASSUNTOS FINANCEIROS","SETOR DE PONTOS COMERCIAIS","SEC. ADM. DO DEPTO DE CONTABILIDADE E FINANÇAS","2015-05-11","Elaboração da minuta de edital."]
["01/2014","S/Nº","000795/2014","Contratação emergencial de empresa prestadora de serviços continuados de limpeza, conservação e higienização para a UFRRJ","Contratação emergencial de empresa prestadora de serviços continuados de limpeza, conservação e higienização para a UFRRJ",120000,"PRÓ-REITORIA DE ASSUNTOS FINANCEIROS","PRÓ-REITORIA DE ASSUNTOS FINANCEIROS","SEC. ADM. DO DECANATO DE ASSUNTOS FINANCEIROS","2014-02-26","O processo está na PROAF e deverá seguir para arquivamento."]
["03/2014","S/Nº","006285/2014","Aquisição de microfone de lapela, sem fio, UHF de controle sintetizado Pll com no mínimo 188 canais selecionáveis",{"$f":"D707","v":"Aquisição de microfone de lapela, sem fio, UHF de controle sintetizado Pll com no mínimo 188 canais selecionáveis"},150070,"PROEXT - OBSERVATÓRIO DE POLÍTICAS DEMOCRÁTICAS DE ACESSO E PERMANÊNCIA NA EDUCAÇÃO SUPERIOR","PRÓ-REITORIA DE EXTENSÃO","CLOG","2014-09-25","Já houve empenho (2014NE801693), pagamento (2014OB809139) e foi entregue no Almoxarifado em 21/11/14."]
["23/2014","S/Nº","006543/2014","Aquisição dos itens do grupo 30.90 - Material de propriedade intelectual - Software sound forge pro 11 e outros","Aquisição dos itens do grupo 30.90 - Material de propriedade intelectual - Software sound forge pro 11 e outros",240000,"INSTITUTO DE CIÊNCIAS HUMANAS E SOCIAIS","INSTITUTO DE CIÊNCIAS HUMANAS E SOCIAIS","COINFO","2014-10-09","Buscando informações."]
["40/2014","S/Nº","006538/2014","Aquisição de armário, em aço carbono, tipo vestiário, com 12 portas, pitões para cadeado e ventilação, etc","Aquisição de armário, em aço carbono, tipo vestiário, com 12 portas, pitões para cadeado e ventilação, etc",100090,"PRAÇA DE DESPORTOS","PRAÇA DE DESPORTOS","ARQUIVO","2015-03-30","Buscando informações."]
["06/2014","S/Nº","004724/2014","Aquisição de quadro de distribuição de sobrepor com barramento 1004 para 28 disjuntores din+geral e outros","Aquisição de quadro de distribuição de sobrepor com barramento 1004 para 28 disjuntores din+geral e outros",120100,"DEPARTAMENTO DE CONTABILIDADE E FINANÇAS","DEPARTAMENTO DE CONTABILIDADE E FINANÇAS","SEÇÃO DE CONTROLE","2014-08-25","Buscando informações.","Nenhum empenho encontrado no SISCNE."]
["01/2014","S/Nº","003803/2014","Aquisição de materiais para manutenção de bens imóveis (IRP)","Aquisição de materiais para manutenção de bens imóveis (IRP)",120200,"DEPARTAMENTO DE MATERIAL E SERVIÇOS AUXILIARES","DEPARTAMENTO DE MATERIAL E SERVIÇOS AUXILIARES","SEÇÃO DE CONTROLE","2015-04-30","Vai ser encaminhado para o gestor da ata."]
["26/2013","S/Nº","000793/2014","Aquisição de concentrado protéico, lácteo e energético, contendo vitaminas minerais e aminoácidos para uso na fabricação de rações, etc","Aquisição de concentrado protéico, lácteo e energético, contendo vitaminas minerais e aminoácidos para uso na fabricação de rações, etc",100000,"REITORIA","COORDENADORIA ESPECIAL DE PROD. INTEGRADA ENSINO, PESQ. EXT.","COORDENADORIA ESPECIAL DE PRODUÇÃO INTEGRADA ENSINO, PESQUISA E  EXTENSÃO","2014-11-24","Buscando informações."]
["01/2014",281,"003663/2014","Aquisição de assadeira cozinha comercial, etc","Aquisição de assadeira cozinha comercial, etc",150600,"PROEXT - APOIO À PRÁTICAS TRADICIONAIS NO USO DE PLANTAS MEDICINAIS","PRÓ-REITORIA DE EXTENSÃO","ARQUIVO","2015-03-06","Arquivado porque o requerente solicitou o cancelamento do pedido constante no reqmat n°01 (fls. 01 a 07 do presente processo).","Despacho da Rosália Almeida em 16/07/14."]
["04/2014","S/Nº","001126/2014","Aquisição de transformador trifásico, potência de 300 kva, para tensão primária (superior) a 13.2kv e outros","Aquisição de transformador trifásico, potência de 300 kva, para tensão primária (superior) a 13.2kv e outros",230000,"INSTITUTO DE CIÊNCIAS EXATAS","INSTITUTO DE CIÊNCIAS EXATAS","ALMOXARIFADO","2014-03-25","Já houve empenho (2014NE800282), pagamentos (2014OB804890 e 2014DF801465) e foi entregue no Almoxarifado em 08/04/14.\nJá houve empenho (2014NE800283), pagamento (2014OB802664) e foi entregue no Almoxarifado em 29/04/14."]
["01/2014","S/Nº","004035/2014","Aquisição de cadeira escritório , material estrutura metálica, material revestimento assento e encosto tecido 100 e outros","Aquisição de cadeira escritório , material estrutura metálica, material revestimento assento e encosto tecido 100 e outros",270000,"INSTITUTO DE TECNOLOGIA","INSTITUTO DE TECNOLOGIA","INSTITUTO DE TECNOLOGIA","2015-01-12","Buscando informações."]
["27/2013","S/Nº","000794/2014","Aquisição de adubo quimico - fórmula n-p-k-14-8 embalados em sacos de 50 kg e outros","Aquisição de adubo quimico - fórmula n-p-k-14-8 embalados em sacos de 50 kg e outros",100500,"COORDENADORIA DE DESENVOLVIMENTO DA PRODUÇÃO","COORDENADORIA ESPECIAL DE PROD. INTEGRADA ENSINO, PESQ. EXT.","COORDENADORIA ESPECIAL DE PROD. INTEGRADA ENSINO, PESQ. EXT","2015-03-04","Já houve empenho (2014NE801701), pagamentos (2014OB809699 e 2014DF802404) e foi entregue no Almoxarifado em 26/11/14.\nJá houve empenho (2014NE801702), pagamento (2014OB808435) e foi entregue no Almoxarifado em 05/11/14.\nJá houve empenho (2014NE801703), mas o prazo de entrega está vencido e um ofício de cobrança foi emitido à empresa em 29/10/14."]
["25/2013","S/Nº","000792/2014","Aquisição de milho em grãos máximo 14 de umidade, saco de 50 kg e outros","Aquisição de milho em grãos máximo 14 de umidade, saco de 50 kg e outros",100000,"REITORIA","COORDENADORIA ESPECIAL DE PROD. INTEGRADA ENSINO, PESQ. EXT.","SSRP","2015-04-13","Já houve empenho (2014NE800998), pagamento (2014OB805578) e entregas no Almoxarifado em 25/07/14, 01/08/14 e 11/08/14.\nJá houve empenho (2014NE801531), pagamento (2014OB807984) e entregas no Almoxarifado em 30/09/14 e 05/10/14.\nJá houve empenho (2014NE802104), pagamento (2015OB800172) e entregas no Almoxarifado em 21/11/14 e 06/12/14.\nJá houve empenho (2014NE800997), mas o prazo de entrega está vencido e um ofício de cobrança foi emitido à empresa em 04/03/15.\nJá houve empenho (2014NE800999), pagamentos (2014OB805559 e 2014DF801574) e foi entregue no Almoxarifado em 24/07/14.\nJá houve empenho (2014NE802107) e foi entregue no Almoxarifado em 03/02/15."]
["04/2014","S/Nº","001591/2014","Aquisição de semem do reprodutor gir leiteiro casper te kubera, código 11gl070 e outros","Aquisição de semem do reprodutor gir leiteiro casper te kubera, código 11gl070 e outros",100500,"COORDENADORIA DE DESENVOLVIMENTO DA PRODUÇÃO","COORDENADORIA ESPECIAL DE PROD. INTEGRADA ENSINO, PESQ. EXT.","CLOG","2014-06-02","Já houve empenho (2014NE800709), pagamentos (2014OB804696 e 2014DF801420) e foi entregue no Almoxarifado em 16/06/14."]
["64/2014","S/Nº","001762/2014","Aquisição de ácido acético, aspecto físico límpido transparente, peso molecular 60,05 e outros","Aquisição de ácido acético, aspecto físico límpido transparente, peso molecular 60,05 e outros",230300,"DEPARTAMENTO DE QUÍMICA","DEPARTAMENTO DE QUÍMICA","CLOG","2014-06-16","Já houve empenho (2014NE800833), pagamento (2014OB805108) e foi entregue no Almoxarifado em 23/07/14.\nJá houve empenho (2014NE800836), pagamento (2014OB805125) e foi entregue no Almoxarifado em 24/07/14.\nJá houve empenho (2014NE800834), pagamentos (2014OB807567 e 2014DF801934) e foi entregue no Almoxarifado em 16/08/14.\nJá houve empenho (2014NE800835), pagamentos (2015OB800335 e 2015DF800183) e foi entregue no Almoxarifado em 08/01/15."]
["02/2014","S/Nº","003804/2014","Aquisição de materiais elétrico e eletrônico","Aquisição de materiais elétrico e eletrônico",120200,"DEPARTAMENTO DE MATERIAL E SERVIÇOS AUXILIARES","DEPARTAMENTO DE MATERIAL E SERVIÇOS AUXILIARES","DIREÇÃO DMSA","2015-03-13","O processo foi encaminhado da SSRP à SAPG para abrir anexo em 03/09/14 e desde então não retornou."]
["65/2014","S/Nº","001761/2014","Aquisição de béquer, material vidro, graduação graduado capacidade 50, formato forma baixa, adicional com orla e bico e outros","Aquisição de béquer, material vidro, graduação graduado capacidade 50, formato forma baixa, adicional com orla e bico e outros",230000,"INSTITUTO DE CIÊNCIAS EXATAS","INSTITUTO DE CIÊNCIAS EXATAS","DIREÇÃO DMSA","2014-05-19","Buscando informações."]
["24/2014",1776,"001368/2014","Pagamento de inscrição no curso: Contratação direta - dispensa, inexigibilidade e SRP (Denis dos Reis Carvalho)","Pagamento de inscrição no curso: Contratação direta - dispensa, inexigibilidade e SRP (Denis dos Reis Carvalho)",120200,"DEPARTAMENTO DE MATERIAL E SERVIÇOS AUXILIARES","SEÇÃO DE COMPRAS DIRETAS","ARQUIVO","2015-03-14","O curso foi cancelado e o outro curso solicitado não chegou a ser empenhado por não ter sido feito em tempo hábil. Empenho cancelado 2014IN00008"]
["26/2014","S/Nº","001368/2014","Pagamento de inscrição no curso: Contratação direta - dispensa, inexigibilidade e SRP (Denis dos Reis Carvalho)","Pagamento de inscrição no curso: Contratação direta - dispensa, inexigibilidade e SRP (Denis dos Reis Carvalho)",120200,"DEPARTAMENTO DE MATERIAL E SERVIÇOS AUXILIARES","SEÇÃO DE COMPRAS DIRETAS","ARQUIVO","2015-03-14","Buscando informações.","Ver com Denis ou desarquivar."]
["07/2014","S/Nº","002243/2014","Aquisição de álcool etílico hidratado combustivel e outros","Aquisição de álcool etílico hidratado combustivel e outros",100300,"PREFEITURA UNIVERSITÁRIA","PREFEITURA UNIVERSITÁRIA","ARQUIVO","2014-09-24","Buscando informações.","Ver CPL."]
["21/2014","S/Nº","001019/2014","Aquisição de toalha de papel, tipo folha 3 dobras, comprimento 23cm, largura 22cm,cor branca etc","Aquisição de toalha de papel, tipo folha 3 dobras, comprimento 23cm, largura 22cm,cor branca etc",120200,"DEPARTAMENTO DE MATERIAL E SERVIÇOS AUXILIARES","DEPARTAMENTO DE MATERIAL E SERVIÇOS AUXILIARES","ARQUIVO","2015-03-06","Arquivado porque o processo 000665/2012 foi concluído e contempla esse item.","Despacho da Sandra Marchiori em 21/02/14."]
["20/2014","S/Nº","001018/2014","Papel higiênico, material celulose virgem, comprimento 30m, largura 10cm, tipo picotado etc","Papel higiênico, material celulose virgem, comprimento 30m, largura 10cm, tipo picotado etc",120200,"DEPARTAMENTO DE MATERIAL E SERVIÇOS AUXILIARES","DEPARTAMENTO DE MATERIAL E SERVIÇOS AUXILIARES","ARQUIVO","2015-03-06","Arquivado porque o pregão referente a aquisição de papel higiênico foi homologado em 10/02/2014, sendo assim já existe uma ata de registro de preços vigente para futuras aquisições. Além disso, o valor do papel higiênico em nossa ata é mais vantajoso para Administração Pública.","Despacho Lucélia Fandiño em 21/02/14."]
["03/2014","S/Nº","002424/2014","Aquisição de pão de forma, etc","Aquisição de pão de forma, etc",130100,"RESTAURANTE UNIVERSITÁRIO - CAMPUS SEROPÉDICA","PRÓ-REITORIA DE ASSUNTOS ESTUDANTIS","PROAES","2015-04-02","Buscando informações."]
["19/2014","S/Nº","001017/2014","Aquisicao de sabonete líquido, aspecto fisico líquido perfumado, aplicação saboneteira para sabonetes líquidos etc","Aquisicao de sabonete líquido, aspecto fisico líquido perfumado, aplicação saboneteira para sabonetes líquidos etc",120200,"DEPARTAMENTO DE MATERIAL E SERVIÇOS AUXILIARES","DEPARTAMENTO DE MATERIAL E SERVIÇOS AUXILIARES","ARQUIVO","2015-03-06","Arquivado porque o processo 000665/2012 foi concluído e contempla esse item.","Despacho da Sandra Marchiori em 21/02/14."]
["22/2014",925,"003929/2014","Aquisição de unidade de fita com carratel metálica para relógio-numerador-datador","Aquisição de unidade de fita com carratel metálica para relógio-numerador-datador",110200,"SEÇÃO DE ARQUIVO E PROTOCOLO GERAL","SEÇÃO DE ARQUIVO E PROTOCOLO GERAL","ARQUIVO","2015-03-14","Já houve empenho (2014NE800941) e pagamento (2014OB804518)","atualizado 12/03/2015"]
["01/2014",439,"003655/2014","Aquisição de caneta hidrográfica, etc - artes gráficas e desenho (grupo 30.16A)","Aquisição de caneta hidrográfica, etc - artes gráficas e desenho (grupo 30.16A)",150000,{"$f":"IFERROR(VLOOKUP(F730,$A$994:$B$1311,2,0),\"\")","v":"PRÓ-REITORIA DE EXTENSÃO"},"PRÓ-REITORIA DE EXTNSÃO ","CPACS","2015-02-26","Realizando re-enquadramento e em breve será encaminhado à Direção do DMSA e à PROAF para assinatura.","Vai ser por dispensa 24, II."]
["18/2014","S/Nº","004157/2014","Aquisição de cadeira escritório, material revestimento assento e encosto tecido 100 poliester e outros","Aquisição de cadeira escritório, material revestimento assento e encosto tecido 100 poliester e outros",270000,"INSTITUTO DE TECNOLOGIA","INSTITUTO DE TECNOLOGIA","DIREÇÃO DMSA","2015-05-12","Buscando informações."]
["02/2014","S/Nº","002261/2014","Renovação da revista Licicon e contratação dos serviços de consultoria em licitações e contratos administrativos","Renovação da revista Licicon e contratação dos serviços de consultoria em licitações e contratos administrativos",120200,"DEPARTAMENTO DE MATERIAL E SERVIÇOS AUXILIARES","DEPARTAMENTO DE MATERIAL E SERVIÇOS AUXILIARES","SCD","2015-05-12","Buscando informações.","Nenhum empenho encontrado no SISCNE."]
["01/2014","S/Nº","002260/2014","Renovação pelo período de 12 (doze) meses da revista O Pregoeiro, com notícias, informções técnicas","Renovação pelo período de 12 (doze) meses da revista O Pregoeiro, com notícias, informções técnicas",120200,"DEPARTAMENTO DE MATERIAL E SERVIÇOS AUXILIARES","DEPARTAMENTO DE MATERIAL E SERVIÇOS AUXILIARES","SAPG","2015-01-26","Buscando informações.","Ver CLOG."]
["05/2014","S/Nº","004585/2014","Aquisição futura de vidraria","Aquisição futura de vidraria",120200,"DEPARTAMENTO DE MATERIAL E SERVIÇOS AUXILIARES","DIRETORIA DO DEPARTAMENTO DE MATERIAL E SERVIÇOS AUXILIARES","SSRP","2015-05-04","Aguardando o pregão ser realizado."]
["02/2014",440,"003657/2014","Material de expediente - Aquisição de alfinete mapa, material aço, material cabeça plástico, formato redondo, etc (grupo 30.16)","Material de expediente - Aquisição de alfinete mapa, material aço, material cabeça plástico, formato redondo, etc (grupo 30.16)",150000,"PRÓ-REITORIA DE EXTENSÃO","PRÓ-REITORIA DE EXTENSÃO","CPACS","2015-03-04","Equipe CPACS está verificando a possibilidade de juntar os processos 003657, 006343, 002699, 002704, 006056."]
["03/2014",1018,"004813/2014","Aquisição de suítes de escritório, contendo planilha eletrônica, programa de apresentações","Aquisição de suítes de escritório, contendo planilha eletrônica, programa de apresentações",150070,"PROEXT - OBSERVATÓRIO DE POLÍTICAS DEMOCRÁTICAS DE ACESSO E PERMANÊNCIA NA EDUCAÇÃO SUPERIOR","PRÓ-REITORIA DE EXTENSÃO","ARQUIVO","2015-03-06","Arquivado porque o material foi atendido pelo pregão n°55/2013, processo 004424/2013.","Despacho do Ronaldo de Oliveira Castro em 26/09/14."]
["01/2014","S/Nº","002325/2014","Aquisição de empilhadeira florestal com tração 4x4, com motor de aproximadamente 80cv","Aquisição de empilhadeira florestal com tração 4x4, com motor de aproximadamente 80cv",260000,"INSTITUTO DE FLORESTAS","INSTITUTO DE FLORESTAS","CLOG","2015-05-05","Pregão nº 26/2015 (antigo nº 109/2014) com provável abertura em 04/03/15."]
["37/2014",943,"004449/2014","Aquisição de poste duplo t em concreto armado etc","Aquisição de poste duplo t em concreto armado etc",100300,"PREFEITURA UNIVERSITÁRIA","PREFEITURA UNIVERSITÁRIA"," SEC. ADM. DO DEPTO DE CONTABILIDADE E FINANÇAS","2015-05-06","Pregão nº 21/2015 (antigo nº 158/2014) finalizado em 26/01/15. Está aguardando o envio das atas assinadas."]
["75/2014","S/Nº","004448/2014","Aquisição de 15 baterias de rádio de comunicação portátil da marca Motorola","Aquisição de 15 baterias de rádio de comunicação portátil da marca Motorola",100060,"DIVISÃO DE GUARDA E VIGILÂNCIA","DIVISÃO DE GUARDA E VIGILÂNCIA","ARQUIVO","2014-10-07","Buscando informações.","Ver CLOG."]
["08/2014",763,"003139/2014","Aquisição de milho","Aquisição de milho",100500,"COORDENADORIA DE DESENVOLVIMENTO DA PRODUÇÃO","COORDENADORIA ESPECIAL DE PROD. INTEGRADA ENSINO, PESQ. EXT.","ARQUIVO","2015-03-06","Arquivado porque o material foi atendido através do processo 005817/2012.","Despacho do Délcio Peçanha em 12/05/14."]
["S/Nº","S/Nº","004584/2014","Aquisição de material de expediente (copo descartável)",{"$f":"D741","v":"Aquisição de material de expediente (copo descartável)"},140510,"CONSELHO ESCOLAR","CONSELHO ESCOLAR","SSRP","2015-04-20","Já houve empenho (2014NE801926), pagamento (2014OB809821) e foi entregue no Almoxarifado em 05/12/14."]
["S/Nº","S/Nº","004584/2014","Aquisição de material de expediente (copo descartável)","Aquisição de material de expediente (copo descartável)",160111,"PROAP - TECNOLOGIA DE ALIMENTOS","PROAP - TECNOLOGIA DE ALIMENTOS","SSRP","2015-04-20","Já houve empenho (2014NE801927), pagamento (2014OB809834) e foi entregue no Almoxarifado em 05/12/14."]
["S/Nº","S/Nº","004584/2014","Aquisição de material de expediente (copo descartável)","Aquisição de material de expediente (copo descartável)",220410,"LABORATÓRIO OFICIAL DE DIAGNÓSTICO FITOSSANITÁRIO","LABORATÓRIO OFICIAL DE DIAGNÓSTICO FITOSSANITÁRIO","SSRP","2015-04-20","Já houve empenho (2014NE801928), pagamento (2014OB809871) e foi entregue no Almoxarifado em 05/12/14."]
["S/Nº","S/Nº","004584/2014","Aquisição de material de expediente","Aquisição de material de expediente",500030,"PROGRAMA INGLÊS SEM FRONTEIRAS","PROGRAMA INGLÊS SEM FRONTEIRAS","SSRP","2015-04-20","Já houve empenho (2014NE802315), pagamento (2015OB800230) e foi entregue no Almoxarifado em 02/12/14.\nJá houve empenho (2014NE802312) e foi entregue no Almoxarifado em 15/01/15.\nJá houve empenho (2014NE802314) e foi entregue no Almoxarifado em 14/01/15."]
["S/Nº","S/Nº","004584/2014","Aquisição de material de expediente","Aquisição de material de expediente",100200,"IMPRENSA UNIVERSITÁRIA","IMPRENSA UNIVERSITÁRIA","SSRP","2015-04-20","Já houve empenho (2014NE802310), pagamento (2015OB800575) e foi entregue no Almoxarifado em 15/01/15."]
["S/Nº","S/Nº","004584/2014","Aquisição de material de expediente","Aquisição de material de expediente",140515,"ESPECIALIZAÇÃO UNIAPRO","ESPECIALIZAÇÃO UNIAPRO","SSRP","2015-04-20","Já houve empenho (2014NE802316), pagamento (2015OB800575) e foi entregue no Almoxarifado em 15/01/15.\nJá houve empenho (2014NE802317), pagamentos (2015OB800306 e 2015DF800166) e foi entregue no Almoxarifado em 05/01/15."]
["03/2014","S/Nº","004584/2014","Aquisição de material de expediente","Aquisição de material de expediente",120200,"DEPARTAMENTO DE MATERIAL E SERVIÇOS AUXILIARES","DIRETORIA DO DEPARTAMENTO DE MATERIAL E SERVIÇOS AUXILIARES","SSRP","2015-04-20","Já houve empenho (2014NE802311), pagamento (2014OB809822) e foi entregue no Almoxarifado em 02/12/14.\nJá houve empenho (2014NE801925), pagamento (2014OB809821) e foi entregue no Almoxarifado em 05/12/14."]
["06/2014","S/Nº","003137/2014","Aquisição de ventilador de parede oscilante 60 cm bivolt","Aquisição de ventilador de parede oscilante 60 cm bivolt",270000,"INSTITUTO DE TECNOLOGIA","INSTITUTO DE TECNOLOGIA","SEÇÃO DE CONTROLE","2014-08-25","Já houve empenho (2014NE801387), pagamentos (2014OB806995 e 2014DF801832) e foi entregue no Almoxarifado em 15/09/14."]
["S/Nº","S/Nº","004583/2014","Aquisição de móveis e equipamentos de uso geral",{"$f":"D749","v":"Aquisição de móveis e equipamentos de uso geral"},180000,"CTUR","CTUR","CLOG","2015-05-08","Já houve empenhos (2014NE802421, 2014NE802423, 2014NE802425 e 2014NE802426), mas o prazo de entrega está vencido e um ofício de cobrança foi emitido à empresa em 05/03/15.\nJá houve empenho (2014NE802424), pagamento (2015OB800559) e foi entregue no Almoxarifado em 26/01/15."]
["S/Nº","S/Nº","004583/2014","Aquisição de móveis e equipamentos de uso geral",{"$f":"D750","v":"Aquisição de móveis e equipamentos de uso geral"},500030,"PROGRAMA INGLÊS SEM FRONTEIRAS","PROGRAMA INGLÊS SEM FRONTEIRAS","CLOG","2015-05-08","Já houve empenho (2014NE802283), mas o prazo de entrega está vencido e um ofício de cobrança foi emitido à empresa em 05/03/15."]
["09/2014",1808,"009589/2014","Conserto de trinta de cinco projetores","Conserto de trinta de cinco projetores",140000,"PRÓ-REITORIA DE ENSINO E GRADUAÇÃO","PRÓ-REITORIA DE ENSINO E GRADUAÇÃO","DIREÇÃO DMSA","2014-11-07","Buscando informações."]
["134/2014","S/Nº","004123/2014","Reparo na tela que cerca o CAIC","Reparo na tela que cerca o CAIC",170000,"CAIC","CAIC","PROAES","2015-05-12","Buscando informações."]
["20/2014",1758,"009344/2014","Manutenção corretiva em equipamento de desativar/reativar modelo da 927, de sistema de segurança","Manutenção corretiva em equipamento de desativar/reativar modelo da 927, de sistema de segurança",300000,"CAMPUS DA UFRRJ EM NOVA IGUAÇU","BIBLIOTECA DO INSTITUTO MULTIDISCIPLINAR","DIVISÃO DE ADMINISTRAÇÃO FINANCEIRA","2015-05-12","Aguardando a empresa enviar as documentações atualizadas."]
["79/2014",1778,"009588/2014","Conserto de carteiras montadas em longarinas de 03 lugares","Conserto de carteiras montadas em longarinas de 03 lugares",280000,"INSTITUTO DE VETERINÁRIA","INSTITUTO DE VETERINÁRIA","SPP","2015-03-23","Pesquisa de preço."]
["06/2014",466,"002675/2014","Conserto de quarenta e oito microscópios","Conserto de quarenta e oito microscópios",220100,"DEPARTAMENTO DE BIOLOGIA ANIMAL","COORD. DA AREA DE HISTOLOGIA E EMBRIOLOGIA","ARQUIVO","2015-03-14","Já houve empenho(2014NE800832) e pagamento(2014OB805137)","atualizado 12/03/2015"]
["S/Nº","S/Nº","002446/2014","Conserto do eletrocardiógrafo","Conserto do eletrocardiógrafo",100070,"POSTO MÉDICO","DIVISÃO DE SAÚDE","ARQUIVO","2015-04-28","Já houve empenho (2014NE801119) e pagamento (2015OB800753)."]
["21/2014",923,"003930/2014","Conserto de seis relógios-datador-numerador","Conserto de seis relógios-datador-numerador",110200,"SEÇÃO DE ARQUIVO E PROTOCOLO GERAL","SEÇÃO DE ARQUIVO E PROTOCOLO GERAL","ARQUIVO","2015-03-14","Já houve empenho (2014NE801176) e pagamento (2014OB807422)."]
["11/2014",208,"002433/2014","Serviço de limpeza, manutenção e revisão de retroprojetores e placa de aquecimento","Serviço de limpeza, manutenção e revisão de retroprojetores e placa de aquecimento",220000,"INSTITUTO DE BIOLOGIA","INSTITUTO DE BIOLOGIA ","DIREÇÃO DMSA","2014-04-17","Buscando informações."]
["11/2014","S/Nº","002959/2014","Serviços de reparos dos veículos Fiat Linea placa HIG 4846 e ônibus Comil Campione placa KXY 3416","Serviços de reparos dos veículos Fiat Linea placa HIG 4846 e ônibus Comil Campione placa KXY 3416",100300,"PREFEITURA UNIVERSITÁRIA","PREFEITURA UNIVERSITÁRIA","ARQUIVO","2015-03-06","Arquivado após entendimento firmado entre a Direção do DMSA e a Pró Reitoria de Assuntos Financeiros, cujos processos de conserto de veículos deverão ser atendidos pelo contrato de manutenção de automóveis (processo 011591/2013), cuja gestão compete à Prefeitura Universitária. ","Despacho do William Lopes e Janaína Gomes em 09/09/14. "]
["12/2014",851,"002959/2014","Serviços de reparos dos veículos Fiat Linea placa HIG 4846 e ônibus Comil Campione placa KXY 3416","Serviços de reparos dos veículos Fiat Linea placa HIG 4846 e ônibus Comil Campione placa KXY 3416",100300,"PREFEITURA UNIVERSITÁRIA","PREFEITURA UNIVERSITÁRIA","ARQUIVO","2015-03-06","Arquivado após entendimento firmado entre a Direção do DMSA e a Pró Reitoria de Assuntos Financeiros, cujos processos de conserto de veículos deverão ser atendidos pelo contrato de manutenção de automóveis (processo 011591/2013), cuja gestão compete à Prefeitura Universitária. ","Despacho do William Lopes e Janaína Gomes em 09/09/14. "]
["115/2014","S/Nº","008758/2014","Construção de edificação de um pavimento para atender ao curso de educacao física","Construção de edificação de um pavimento para atender ao curso de educacao física",250000,"INSTITUTO DE EDUCAÇÃO","INSTITUTO DE EDUCAÇÃO","PRÓ-REITORIA DE PLANEJAMENTO, AVALIAÇÃO E DESENVOLVIMENTO","2014-10-07","Buscando informações."]
["117/2014","S/Nº","007100/2014","Contratação de empresa especializada para prestação de apoio técnico ao desenvolvimento de sistemas","Contratação de empresa especializada para prestação de apoio técnico ao desenvolvimento de sistemas",100400,"COORDENADORIA DE INFORMÁTICA","COORDENADORIA DE INFORMÁTICA","COINFO","2014-08-22","Buscando informações."]
["22/2014",1262,"005540/2014","Contratação de serviços para conserto da impressora laser colorida a3 marca Lexmark - c910n","Contratação de serviços para conserto da impressora laser colorida a3 marca Lexmark - c910n",150200,"IMPRENSA UNIVERSITÁRIA","IMPRENSA UNIVERSITÁRIA","DIREÇÃO DMSA","2015-05-12","Reqmat 22 e 26 não serão atendidos pois os valors dos consertos ultrapassam seus respectivos valores de mercado.\nAnálise e posterior encaminhamento À PROAF para autorização da despesa","atualizado 19/03/2015"]
["10/2014",1357,"006418/2014","Contratação de serviços para revisão geral de bomba e bicos injetores e substituição dos filtros","Contratação de serviços para revisão geral de bomba e bicos injetores e substituição dos filtros",260000,"INSTITUTO DE FLORESTAS","INSTITUTO DE FLORESTAS","ARQUIVO","2015-03-06","Arquivado após entendimento firmado entre a Direção do DMSA e a Pró Reitoria de Assuntos Financeiros, cujos processos de conserto de veículos deverão ser atendidos pelo contrato de manutenção de automóveis (processo 011591/2013), cuja gestão compete à Prefeitura Universitária. ","Despacho do William Lopes e Janaína Gomes em 09/09/14. "]
["07/2014","S/Nº","004486/2014","Fornecimento e instalação de cabo óptico multimodo,etc","Fornecimento e instalação de cabo óptico multimodo,etc",270000,"INSTITUTO DE TECNOLOGIA","INSTITUTO DE TECNOLOGIA","COINFO","2014-08-11","Buscando informações."]
["06/2014","S/Nº","006035/2014","Manifestacao de interesse em processo de srp (contratação de serviço de fornecimento de alimentação) - IRP","Manifestacao de interesse em processo de srp (contratação de serviço de fornecimento de alimentação) - IRP",120200,"DEPARTAMENTO DE MATERIAL E SERVIÇOS AUXILIARES","DEPARTAMENTO DE MATERIAL E SERVIÇOS AUXILIARES","DIVISÃO DE ADMINISTRAÇÃO FINANCEIRA","2015-05-12","O processo já está disponível na Pró-reitoria de Extensão para solicitar empenhos.","Gestora Lana Claudia de Souza Fonseca da PROEXT. Tem um despacho da Nidia informando que a gestora deve entrar em contato com a CODEP para verificar se eles necessitarão de algum item."]
["48/2014","S/Nº","006044/2014","Contratação de empresa prestadora de serviço para manutenção do elevador do Pavilhão Central","Contratação de empresa prestadora de serviço para manutenção do elevador do Pavilhão Central",100300,"PREFEITURA UNIVERSITÁRIA","PREFEITURA UNIVERSITÁRIA","CPACS","2015-05-07","Pesquisa de preço."]
["01/2014",1330,"006344/2014","Serviço de manutenção de equipamento de sistema de segurança do Almoxarifado Central","Serviço de manutenção de equipamento de sistema de segurança do Almoxarifado Central",120200,"DEPARTAMENTO DE MATERIAL E SERVIÇOS AUXILIARES","ALMOXARIFADO CENTRAL","SEC. ADM. DO DEPTO DE CONTABILIDADE E FINANÇAS","2015-04-06","Pregão nº 24/2015 (antigo nº 119/2014) com provável abertura em 09/03/15."]
["12/2014",1006,"004596/2014","Fornecimento e instalação de 250 metros de cabo óptico, etc no CTUR","Fornecimento e instalação de 250 metros de cabo óptico, etc no CTUR",180000,"CTUR","CTUR","ARQUIVO","2015-03-14","Já houve empenho (2014NE800992) e pagamento (2014OB805920)","atualizado 12/03/2015"]
["17/2014","S/Nº","008026/2014","Recuperação de área no Pavilhão de Aulas do IT para almoxarifado de produtos limpeza e instalação de tanques de lavagem","Recuperação de área no Pavilhão de Aulas do IT para almoxarifado de produtos limpeza e instalação de tanques de lavagem",270000,"INSTITUTO DE TECNOLOGIA","INSTITUTO DE TECNOLOGIA","INSTITUTO DE TECNOLOGIA","2014-10-31","Buscando informações."]
["69/2014",995,"004586/2014","Contratação de serviços de guardiania de piscinas para atuação do Parque Aquático","Contratação de serviços de guardiania de piscinas para atuação do Parque Aquático",150000,"PRÓ-REITORIA DE EXTENSÃO","PRAÇA DE DESPORTOS","SPP","2015-01-13","Pesquisa de preço."]
["09/2014","S/Nº","005200/2014","Instalação de 16 aparelhos ar condicionados split (12 de 80.000 btus e 4 de 60.000 btus)","Instalação de 16 aparelhos ar condicionados split (12 de 80.000 btus e 4 de 60.000 btus)",270000,"INSTITUTO DE TECNOLOGIA","INSTITUTO DE TECNOLOGIA","DEPARTAMENTO DE CONTABILIDADE E FINANÇAS","2015-04-01","Buscando informações."]
["15/2014","S/Nº","008047/2014","Confecção de calçada, reforma de escada e colocação de revestimento em área final do Pavilhao de Aulas","Confecção de calçada, reforma de escada e colocação de revestimento em área final do Pavilhao de Aulas",270000,"INSTITUTO DE TECNOLOGIA","INSTITUTO DE TECNOLOGIA","ARQUIVO","2015-03-19","O processo foi encaminhado da Secretaria Administrativa do Instituto de Tecnologia à SAPG em 29/01/15 (carga no Sistema Protocolo), mas ainda não chegou in loco."]
["01/2014",1102,"005198/2014","Contratação de empresa especializada na prestação de serviços de locação de 03 impressoras multifuncionais (carona)","Contratação de empresa especializada na prestação de serviços de locação de 03 impressoras multifuncionais (carona)",100000,"REITORIA","COORDENAÇÃO DE CONTRATOS E IMPORTAÇÃO","ARQUIVO","2015-03-06","Arquivado porque o processo (005691/2013) para locação de copiadoras teve tramitação mais célere do que esta carona e o respectivo pregão (nº 31/2015) foi aberto em 04/03/15."]
["19/2014",1002,"005202/2014","Contratação de serviço de recuperação da suspensão diantera com subst. das balanças dianteiras, veiculo placa: LLC 588","Contratação de serviço de recuperação da suspensão diantera com subst. das balanças dianteiras, veiculo placa: LLC 588",100300,"PREFEITURA UNIVERSITÁRIA","PREFEITURA UNIVERSITÁRIA","ARQUIVO","2015-03-06","Arquivado após entendimento firmado entre a Direção do DMSA e a Pró Reitoria de Assuntos Financeiros, cujos processos de conserto de veículos deverão ser atendidos pelo contrato de manutenção de automóveis (processo 011591/2013), cuja gestão compete à Prefeitura Universitária. ","Despacho do William Lopes e Janaína Gomes em 09/09/14. "]
["01/2014","S/Nº","005472/2014","Confecção e instalação de seis grades de ferro nas janelas do Laboratório do DRRA/IZ","Confecção e instalação de seis grades de ferro nas janelas do Laboratório do DRRA/IZ",290000,"INSTITUTO DE ZOOTECNIA","INSTITUTO DE ZOOTECNIA","DIREÇÃO DMSA","2014-12-09","Buscando informações."]
["20/2014",924,"003931/2014","Serviço de confecção de 50.000 capas de processos personalizadas com brasão da república",{"$f":"D777","v":"Serviço de confecção de 50.000 capas de processos personalizadas com brasão da república"},110200,"SEÇÃO DE ARQUIVO E PROTOCOLO GERAL","SEÇÃO DE ARQUIVO E PROTOCOLO GERAL","ARQUIVO","2015-03-14","Já houve empenho (2014NE801255) e pagamento (2014OB805933)","atualizado 12/03/2015"]
["95/2014","S/Nº","005446/2014","Fornecimento de upgrades de equipamentos existentes de armazenamento de dados","Fornecimento de upgrades de equipamentos existentes de armazenamento de dados",100400,"COORDENADORIA DE INFORMÁTICA","COORDENADORIA DE INFORMÁTICA","ARQUIVO","2015-03-19","Buscando informações."]
["05/2014","S/Nº","003094/2014","Recuperação da rede de gás do Laboratório de Microbiologia e Fermentação","Recuperação da rede de gás do Laboratório de Microbiologia e Fermentação",270000,"INSTITUTO DE TECNOLOGIA","DEPARTAMENTO DE TECNOLOGIA E ALIMENTOS","ARQUIVO","2015-03-14","Já houve empenho (2014NE800708) e pagamento (2014OB804537)"]
["13/2014","S/Nº","005201/2014","Contratação de serviço para conserto e reparo da autoclave de tratamento de madeira do IF","Contratação de serviço para conserto e reparo da autoclave de tratamento de madeira do IF",260000,"INSTITUTO DE FLORESTAS","INSTITUTO DE FLORESTAS","INSTITUTO DE FLORESTAS","2014-12-18","Buscando informações."]
["120/2014","S/Nº","006268/2014","Contratação de empresa para desenvolvimento de software, de acordo com reqmat n°02 - Pró-reitoria de Extensão","Contratação de empresa para desenvolvimento de software, de acordo com reqmat n°02 - Pró-reitoria de Extensão",120200,"DEPARTAMENTO DE MATERIAL E SERVIÇOS AUXILIARES","PRÓ-REITORIA DE EXTENSÃO","COORDENADORIA DE TECNOLOGIA DA INFORMAÇÃO E COMUNICAÇÃO","2014-10-30","Buscando informações."]
["07/2014",1209,"005475/2014","Contratação de execução de cursos in company (gestão e fiscalização de contratos para 30 servidores)","Contratação de execução de cursos in company (gestão e fiscalização de contratos para 30 servidores)",110000,"PRÓ-REITORIA DE ASSUNTOS ADMINISTRATIVOS","COORDENADORIA DE DESENVOLVIMENTO DE PESSOA","ARQUIVO","2015-03-14","Já houve empenho (2014NE000356) e pagamento (2014GR800105/2014GR800104)"]
["89/2014","S/Nº","005054/2014","Contratação de serviço de coffee break para duas atividades de extensão: encerramento do curso etc","Contratação de serviço de coffee break para duas atividades de extensão: encerramento do curso etc",300000,"CAMPUS DA UFRRJ EM NOVA IGUAÇU","INSTITUTO MULTIDISCIPLINAR DE NOVA IGUAÇU","DIREÇÃO DO IM","2014-07-30","Buscando informações."]
["31/2014","S/Nº","004677/2014","Contratação da empresa gerenciadora para apoio técnico e fiscal das obras de construcao e reforma dos prédios nos Campis","Contratação da empresa gerenciadora para apoio técnico e fiscal das obras de construcao e reforma dos prédios nos Campis",120000,"PRÓ-REITORIA DE ASSUNTOS FINANCEIROS","PREFEITURA UNIVERSITÁRIA","SEC. ADM. DO DECANATO DE ASSUNTOS FINANCEIROS","2014-08-20","Buscando informações."]
["01/2014","S/Nº","010614/2014","Contratação de empresa especializada no controle de cupins e outras pragas como: barata, traças, formigas, brocas, aranhas, mosquitos etc.",{"$f":"D785","v":"Contratação de empresa especializada no controle de cupins e outras pragas como: barata, traças, formigas, brocas, aranhas, mosquitos etc."},100000,"REITORIA","PROCURADORIA GERAL","ASTEC","2015-03-11","Será atendido junto com a Demanda de 2015 - equipe do projeto","atualizado 11/03/2015"]
["23/2014",1263,"005540/2014","Contratação de serviços para conserto da impressora (Plotter) HP DesignJEt","Contratação de serviços para conserto da impressora (Plotter) HP DesignJEt",100200,"IMPRENSA UNIVERSITÁRIA","DIRETORIA DO DEPARTAMENTO","DIREÇÃO DMSA","2015-05-12","Reqmat 22 e 26 não serão atendidos pois os valors dos consertos ultrapassam seus respectivos valores de mercado.\nAnálise e posterior encaminhamento À PROAF para autorização da despesa","atualizado 19/03/2015"]
["26/2014",1288,"005540/2014","Contratação de serviços para conserto da impressora RISO HC 5500R multifuncional","Contratação de serviços para conserto da impressora RISO HC 5500R multifuncional",100200,"IMPRENSA UNIVERSITÁRIA","DIRETORIA DO DEPARTAMENTO","DIREÇÃO DMSA","2015-05-12","Reqmat 22 e 26 não serão atendidos pois os valors dos consertos ultrapassam seus respectivos valores de mercado.\nAnálise e posterior encaminhamento À PROAF para autorização da despesa","atualizado 19/03/2015"]
["199/2014",2142,"011339/2014","Pagamento de inscrição da servidora Lenice Freiman de Oliveira ","Pagamento de inscrição da servidora Lenice Freiman de Oliveira ",600000,"INSTITUTO DE CIÊNCIAS SOCIAIS APLICADAS","DIRETORIA DO INSTITUTO DE CIÊNCIAS SOCIAIS","DEPARTAMENTO DE ECONOMIA DOMESTICA E HOTELARIA","2015-05-04","Análise e posterior encaminhamento à PROAF para autorização da despesa","CNPJ da empresa vencedora: 01.954.124/0001-79"]
[null,null,null,"","",null,""]
[null,null,null,"","",null,""]
[null,null,null,"","",null,""]
[null,null,null,"","",null,""]
[null,null,null,"","",null,""]
[null,null,null,"","",null,{"$f":"IFERROR(VLOOKUP(F794,$A$994:$B$1311,2,0),\"\")","v":""}]
[null,null,null,"","",null,""]
[null,null,null,"","",null,""]
[null,null,null,"","",null,""]
[null,null,null,"","",null,""]
[null,null,null,"","",null,""]
[null,null,null,"","",null,""]
[null,null,null,"","",null,""]
[null,null,null,"","",null,""]
[null,null,null,"","",null,""]
[null,null,null,"","",null,""]
[null,null,null,"","",null,""]
[null,null,null,"","",null,""]
[null,null,null,"","",null,""]
[null,null,null,"","",null,""]
[null,null,null,"","",null,""]
[null,null,null,"","",null,""]
[null,null,null,"","",null,""]
[null,null,null,"","",null,""]
[null,null,null,"","",null,""]
[null,null,null,"","",null,""]
[null,null,null,"","",null,""]
[null,null,null,"","",null,""]
[null,null,null,"","",null,""]
[null,null,null,"","",null,""]
[null,null,null,"","",null,""]
[null,null,null,"","",null,""]
[null,null,null,"","",null,""]
[null,null,null,"","",null,""]
[null,null,null,"","",null,""]
[null,null,null,"","",null,""]
[null,null,null,"","",null,""]
[null,null,null,"","",null,""]
[null,null,null,"","",null,""]
[null,null,null,"","",null,""]
[null,null,null,"","",null,""]
[null,null,null,"","",null,""]
[null,null,null,"","",null,""]
[null,null,null,"","",null,""]
[null,null,null,"","",null,""]
[null,null,null,"","",null,""]
[null,null,null,"","",null,""]
[null,null,null,"","",null,""]
[null,null,null,"","",null,""]
[null,null,null,"","",null,""]
[null,null,null,"","",null,""]
[null,null,null,"","",null,""]
[null,null,null,"",{"$f":"D841","v":""},null,""]
[null,null,null,"","",null,""]
[null,null,null,"","",null,""]
[null,null,null,"","",null,""]
[null,null,null,"","",null,""]
[null,null,null,"","",null,""]
[null,null,null,"","",null,""]
[null,null,null,"","",null,""]
[null,null,null,"","",null,""]
[null,null,null,"","",null,""]
[null,null,null,"","",null,""]
[null,null,null,"","",null,""]
[null,null,null,"","",null,""]
[null,null,null,"","",null,""]
[null,null,null,"","",null,""]
[null,null,null,"","",null,""]
[null,null,null,"","",null,""]
[null,null,null,"","",null,{"$f":"IFERROR(VLOOKUP(F858,$A$994:$B$1311,2,0),\"\")","v":""}]
[null,null,null,"","",null,""]
[null,null,null,"","",null,""]
[null,null,null,"","",null,""]
[null,null,null,"","",null,""]
[null,null,null,"","",null,""]
[null,null,null,"","",null,""]
[null,null,null,"","",null,""]
[null,null,null,"","",null,""]
[null,null,null,"","",null,""]
[null,null,null,"","",null,""]
[null,null,null,"","",null,""]
[null,null,null,"","",null,""]
[null,null,null,"","",null,""]
[null,null,null,"","",null,""]
[null,null,null,"","",null,""]
[null,null,null,"","",null,""]
[null,null,null,"","",null,""]
[null,null,null,"","",null,""]
[null,null,null,"","",null,""]
[null,null,null,"","",null,""]
[null,null,null,"","",null,""]
[null,null,null,"","",null,""]
[null,null,null,"","",null,""]
[null,null,null,"","",null,""]
[null,null,null,"","",null,""]
[null,null,null,"","",null,""]
[null,null,null,"","",null,""]
[null,null,null,"","",null,""]
[null,null,null,"","",null,""]
[null,null,null,"","",null,""]
[null,null,null,"","",null,""]
[null,null,null,"","",null,""]
[null,null,null,"","",null,""]
[null,null,null,"","",null,""]
[null,null,null,"","",null,""]
[null,null,null,"","",null,""]
[null,null,null,"","",null,""]
[null,null,null,"","",null,""]
[null,null,null,"","",null,""]
[null,null,null,"","",null,""]
[null,null,null,"","",null,""]
[null,null,null,"","",null,""]
[null,null,null,"","",null,""]
[null,null,null,"","",null,""]
[null,null,null,"","",null,""]
[null,null,null,"","",null,""]
[null,null,null,"",{"$f":"D905","v":""},null,""]
[null,null,null,"","",null,""]
[null,null,null,"","",null,""]
[null,null,null,"","",null,""]
[null,null,null,"","",null,""]
[null,null,null,"","",null,""]
[null,null,null,"","",null,""]
[null,null,null,"","",null,""]
[null,null,null,"","",null,""]
[null,null,null,"","",null,""]
[null,null,null,"","",null,""]
[null,null,null,"","",null,""]
[null,null,null,"","",null,""]
[null,null,null,"","",null,""]
[null,null,null,"","",null,""]
[null,null,null,"","",null,""]
[null,null,null,"","",null,""]
[null,null,null,"","",null,{"$f":"IFERROR(VLOOKUP(F922,$A$994:$B$1311,2,0),\"\")","v":""}]
[null,null,null,"","",null,""]
[null,null,null,"","",null,""]
[null,null,null,"","",null,""]
[null,null,null,"","",null,""]
[null,null,null,"","",null,""]
[null,null,null,"","",null,""]
[null,null,null,"","",null,""]
[null,null,null,"","",null,""]
[null,null,null,"","",null,""]
[null,null,null,"","",null,""]
[null,null,null,"","",null,""]
[null,null,null,"","",null,""]
[null,null,null,"","",null,""]
[null,null,null,"","",null,""]
[null,null,null,"","",null,""]
[null,null,null,"","",null,""]
[null,null,null,"","",null,""]
[null,null,null,"","",null,""]
[null,null,null,"","",null,""]
[null,null,null,"","",null,""]
[null,null,null,"","",null,""]
[null,null,null,"","",null,""]
[null,null,null,"","",null,""]
[null,null,null,"","",null,""]
[null,null,null,"","",null,""]
[null,null,null,"","",null,""]
[null,null,null,"","",null,""]
[null,null,null,"","",null,""]
[null,null,null,"","",null,""]
[null,null,null,"","",null,""]
[null,null,null,"","",null,""]
[null,null,null,"","",null,""]
[null,null,null,"","",null,""]
[null,null,null,"","",null,""]
[null,null,null,"","",null,""]
[null,null,null,"","",null,""]
[null,null,null,"","",null,""]
[null,null,null,"","",null,""]
[null,null,null,"","",null,""]
[null,null,null,"","",null,""]
[null,null,null,"","",null,""]
[null,null,null,"","",null,""]
[null,null,null,"","",null,""]
[null,null,null,"","",null,""]
[null,null,null,"","",null,""]
[null,null,null,"","",null,""]
[null,null,null,"",{"$f":"D969","v":""},null,""]
[null,null,null,"","",null,""]
[null,null,null,"","",null,""]
[null,null,null,"","",null,""]
[null,null,null,"","",null,""]
[null,null,null,"","",null,""]
[null,null,null,"","",null,""]
[null,null,null,"","",null,""]
[null,null,null,"","",null,""]
[null,null,null,"","",null,""]
[null,null,null,"","",null,""]
[null,null,null,"","",null,""]
[null,null,null,"","",null,""]
[null,null,null,"","",null,""]
[null,null,null,"","",null,""]
[null,null,null,"","",null,""]
[]
[]
[]
[]
[]
[]
[]
[]
["Centro de custos","Setor requisitante"]
[]
[1,"ORÇAMENTO"]
[2,"ORÇAMENTO CONTINGENCIADO"]
[10000,"RESERVA TÉCNICA"]
[10100,"RESERVA TÉCNICA DE PESSOAL"]
[10200,"RESERVA TÉCNICA PARA CONTRIBUIÇÃO AO INSS"]
[10300,"RESERVA TÉCNICA PARA GASTOS FIXOS"]
[10310,"CAPACITAÇÃO DE SERVIDORES - RECURSOS ESPECÍFICOS"]
[10400,"RESERVA TÉCNICA DE CONVÊNIOS"]
[20000,"RESERVA DE CRÉDITO"]
[20001,"RECEITA REALIZADA"]
[20100,"RESERVA DE CRÉDITO REITORIA (COBERTURA PENDENTE)"]
[20200,"RESERVA DE CRÉDITO PARA CONTRIBUIÇÃO AO INSS"]
[90000,"EXECUÇÃO ORÇAMENTÁRIA - CONTA DE COMPENSAÇÃO"]
[100000,"REITORIA"]
[100010,"RECEITA REALIZADA SEM DESTINAÇÃO ESPECÍFICA"]
[100020,"REITORIA - REPASSES"]
[100030,"BOLSA PERMANÊNCIA"]
[100031,"BOLSA PERMANÊNCIA PARA ESTUDANTES EM MOBILIDADE ACADÊMICA"]
[100032,"BOLSA DE ATIVIDADE DO RESTAURANTE UNIVERSITÁRIO"]
[100033,"BOLSA DO PROGRAMA INSTITUCIONAL DE INICIAÇÃO CIENTÍFICA PROIC/PROPPG"]
[100034,"BOLSA APOIO TÉCNICO ACADÊMICO"]
[100035,"BOLSA INSTITUCIONAL DE EXTENSÃO - BIEXT"]
[100036,"BOLSA PERMANÊNCIA PARA INCENTIVO AO ESPORTE"]
[100037,"BOLSA PROVERDE JARDIM BOTÂNICO"]
[100038,"BOLSA DO PROGRAMA DE PÓS-GRADUAÇÃO EM PRÁTICAS EM DESENVOLVIMENTO SUSTENTÁVEL"]
[100040,"AUXÍLIO FINANCEIRO AO ESTUDANTE"]
[100060,"DIVISÃO DE GUARDA E VIGILÂNCIA"]
[100070,"POSTO MÉDICO"]
[100090,"PRAÇA DE DESPORTOS"]
[100100,"BIBLIOTECA CENTRAL"]
[100200,"IMPRENSA UNIVERSITÁRIA"]
[100300,"PREFEITURA UNIVERSITÁRIA"]
[100400,"COORDENADORIA DE INFORMÁTICA"]
[100500,"COORDENADORIA DE DESENVOLVIMENTO DA PRODUÇÃO"]
[100510,"FAZENDINHA"]
[100600,"COORDENADORIA DE PLANEJAMENTO"]
[110000,"PRÓ-REITORIA DE ASSUNTOS ADMINISTRATIVOS"]
[110100,"DIVISÃO DE PATRIMÔNIO E SERVIÇOS AUXILIARES"]
[110200,"SEÇÃO DE ARQUIVO E PROTOCOLO GERAL"]
[110300,"DEPARTAMENTO DE PESSOAL"]
[120000,"PRÓ-REITORIA DE ASSUNTOS FINANCEIROS"]
[120010,"TAXA DE OCUPAÇÃO DE PRÓPRIOS RESIDENCIAIS"]
[120020,"TAXA DE OCUPAÇÃO DE PONTOS COMERCIAIS"]
[120100,"DEPARTAMENTO DE CONTABILIDADE E FINANÇAS"]
[120200,"DEPARTAMENTO DE MATERIAL E SERVIÇOS AUXILIARES"]
[120210,"ESTOQUE"]
[120300,"HOTEL UNIVERSITÁRIO"]
[120400,"LAVANDERIA"]
[130000,"PRÓ-REITORIA DE ASSUNTOS ESTUDANTIS"]
[130100,"RESTAURANTE UNIVERSITÁRIO - CAMPUS SEROPÉDICA"]
[130200,"DIRETÓRIO CENTRAL DOS ESTUDANTES"]
[130300,"DIVISÃO DE RESIDÊNCIA ESTUDANTIL"]
[140000,"PRÓ-REITORIA DE ENSINO E GRADUAÇÃO"]
[140001,"MONITORIA"]
[140002,"PROGRAMA MILTON SANTOS - PROMISAES"]
[140010,"PROJETO MÍDIAS NA EDUCAÇÃO"]
[140020,"PARFOR"]
[140101,"ADMINISTRAÇÃO INTEGRAL"]
[140102,"ADMINISTRAÇÃO NOTURNO"]
[140103,"ADMINISTRAÇÃO PÚBLICA"]
[140104,"AGRONOMIA"]
[140105,"ARQUITETURA E URBANISMO"]
[140106,"BELAS ARTES"]
[140107,"CIÊNCIAS AGRÍCOLAS (LICA)"]
[140108,"CIÊNCIAS BIOLÓGICAS"]
[140109,"CIÊNCIAS CONTÁBEIS"]
[140110,"CIÊNCIAS ECONÔMICAS"]
[140111,"CIÊNCIAS SOCIAIS"]
[140112,"COMUNICAÇÃO SOCIAL"]
[140113,"DIREITO"]
[140114,"ECONOMIA DOMÉSTICA"]
[140115,"EDUCAÇÃO FÍSICA"]
[140116,"ENGENHARIA AGRÍCOLA E AMBIENTAL"]
[140117,"ENGENHARIA DE AGRIMENSURA E CARTOGRÁFICA"]
[140118,"ENGENHARIA DE ALIMENTOS"]
[140119,"ENGENHARIA DE MATERIAIS"]
[140120,"ENGENHARIA FLORESTAL"]
[140121,"ENGENHARIA QUÍMICA"]
[140122,"FARMÁCIA"]
[140123,"FILOSOFIA"]
[140124,"FÍSICA"]
[140125,"GEOGRAFIA"]
[140126,"GEOLOGIA"]
[140127,"HISTÓRIA NOTURNO"]
[140128,"HISTÓRIA VESPERTINO"]
[140129,"HOTELARIA"]
[140130,"LETRAS"]
[140131,"MATEMÁTICA"]
[140132,"MEDICINA VETERINÁRIA"]
[140133,"PEDAGOGIA"]
[140134,"PSICOLOGIA"]
[140135,"QUÍMICA INTEGRAL"]
[140136,"QUÍMICA NOTURNO"]
[140137,"RELAÇÕES INTERNACIONAIS"]
[140138,"SISTEMAS DE INFORMAÇÃO"]
[140139,"ZOOTECNIA"]
[140140,"ADMINISTRAÇÃO EAD SEROPÉDICA"]
[140201,"ADMINISTRAÇÃO - NOVA IGUAÇU"]
[140202,"CIÊNCIAS ECONÔMICAS - NOVA IGUAÇU"]
[140203,"CIÊNCIA DA COMPUTAÇÃO - NOVA IGUAÇU"]
[140204,"DIREITO - NOVA IGUAÇU"]
[140205,"GEOGRAFIA - NOVA IGUAÇU"]
[140206,"HISTÓRIA - NOVA IGUAÇU"]
[140207,"LETRAS - NOVA IGUAÇU"]
[140208,"MATEMÁTICA - NOVA IGUAÇU"]
[140209,"PEDAGOGIA - NOVA IGUAÇU"]
[140210,"TURISMO - NOVA IGUAÇU"]
[140211,"TURISMO EAD NOVA IGUAÇU"]
[140301,"ADMINISTRAÇÃO - TRÊS RIOS"]
[140302,"CIÊNCIAS ECONÔMICAS - TRÊS RIOS"]
[140303,"DIREITO - TRÊS RIOS"]
[140304,"GESTÃO AMBIENTAL - TRÊS RIOS"]
[140400,"PROJETO DE EXTENSÃO EM ARTE"]
[140401,"PROJETO DE EXTENSÃO EM SAÚDE E MEIO AMBIENTE"]
[140402,"PROJETO DE CURSO DE EXTENSÃO EM HISTÓRIA"]
[140403,"PROJETO GEOGRAFIA ESCOLAR: LINGUAGENS, CULTURA, SABERES E PRÁTICAS DOCENTES"]
[140404,"PROINFO - PROJETO INTRODUÇÃO À EDUCAÇÃO DIGITAL"]
[140500,"COMITÊ GESTOR AÇÃO 20RJ"]
[140510,"CONSELHO ESCOLAR"]
[140515,"ESPECIALIZAÇÃO UNIAPRO"]
[140520,"CONSELHOS MUNICIPAIS DE EDUCAÇÃO"]
[140530,"DOCÊNCIA NA EDUCAÇÃO INFANTIL"]
[140540,"MEMÓRIAS E HISTÓRIAS DA OCUPAÇÃO DA BAIXADA FLUMINENSE"]
[140550,"EDUCAÇÃO DO CAMPO"]
[140560,"EXTENSÃO EM ARTE"]
[140570,"CURSO DE EXTENSÃO EM ALFABETIZAÇÃO"]
[140580,"FUNCIONAMENTO DO COMITÊ GESTOR"]
[140590,"SEMINÁRIO DE FILOSOFIA E EDUCAÇÃO"]
[140600,"ENFRENTANDO OS DESAFIOS DOS TEMAS TRANSVERSAIS"]
[150000,"PRÓ-REITORIA DE EXTENSÃO"]
[150010,"PROEXT - CAPACITAR PARA GERAR - AMPLIAÇÃO DOS HORIZONTES"]
[150020,"PROEXT - OBSERVATÓRIO CULTURAL DA BAIXADA FLUMINENSE"]
[150030,"PROEXT - NÚCLEO DE DIÁLOGOS INTERCULTURAIS"]
[150040,"PROEXT - ECONOMIA SOLIDÁRIA E GÊNERO - PROMOVENDO"]
[150050,"ELABORAÇÃO DE LIVRO-TEXTO PARA OS CURSOS DE EXTENSÃO"]
[150060,"PROEXT - LABORATÓRIO DA IMAGEM ÁUDIO VISUAL - POSSIBILIDADES DIDÁTICAS"]
[150070,"PROEXT - OBSERVATÓRIO DE POLÍTICAS DEMOCRÁTICAS DE ACESSO E PERMANÊNCIA NA EDUCAÇÃO SUPERIOR"]
[150080,"PROEXT - MÃOS QUE CRIAM - PROJETO DE CAPACITAÇÃO PARA PROMOÇÃO SOCIAL"]
[150090,"PROEXT - ESTRATÉGIA DESENVOLVIMENTO CADEIA PRODUTIVA COM ABELHAS"]
[150100,"PRAÇA DE DESPORTOS"]
[150200,"IMPRENSA UNIVERSITÁRIA"]
[150300,"CENTRO DE ARTE E CULTURA"]
[150400,"PROEXT - PROGRAMA APOIO E ACOMPANHAMENTO USO DE LAPTOPS ESCOLA POR ALUNO"]
[150500,"PROEXT - PRODUÇÃO FORMATATOS E EMBUTIDOS DE PESCADO MARINHO ITAGUAÍ RJ"]
[150600,"PROEXT - APOIO À PRÁTICAS TRADICIONAIS NO USO DE PLANTAS MEDICINAIS"]
[160000,"PRÓ-REITORIA DE PESQUISA E PÓS GRADUAÇÃO"]
[160001,"PRÓ - EQUIPAMENTOS"]
[160010,"EDITORA UNIVERSIDADE RURAL"]
[160050,"JARDIM BOTÂNICO"]
[160100,"PROAP - PRÓ-REITORIA DE PESQUISA E PÓS GRADUAÇÃO"]
[160101,"PROAP - BIOLOGIA ANIMAL"]
[160102,"PROAP - CIÊNCIAS AMBIENTAIS E FLORESTAIS"]
[160103,"PROAP - CIÊNCIA DO SOLO"]
[160104,"PROAP - DESENVOLVIMENTO, AGRICULTURA E SOCIEDADE"]
[160105,"PROAP - ENGENHARIA QUÍMICA"]
[160106,"PROAP - FITOTECNIA"]
[160107,"PROAP - MEDICINA VETERINÁRIA"]
[160108,"PROAP - CIÊNCIA E TECNOLOGIA E INOVAÇÃO AGROPECUÁRIA"]
[160109,"PROAP - EDUCAÇÃO AGRÍCOLA"]
[160110,"PROAP - QUÍMICA"]
[160111,"PROAP - TECNOLOGIA DE ALIMENTOS"]
[160112,"PROAP - ZOOTECNIA"]
[160113,"PROAP - FITOSSANIDADE E TECNOLOGIA APLICADA"]
[160114,"PROAP - CIÊNCIAS VETERINÁRIAS"]
[160115,"PROAP - HISTÓRIA"]
[160116,"PROAP - EDUCAÇÃO E DEMANDAS POPULARES"]
[160117,"PROAP - MULTICÊNTRICO EM CIÊNCIAS FISIOLÓGICAS"]
[160118,"PROAP - DESENVOLVIMENTO TERRITORIAL E POLÍTICAS PÚBLICAS"]
[160119,"PROAP - PSICOLOGIA"]
[160120,"PROAP - CIÊNCIAS SOCIAIS"]
[160121,"PROAP - MODELAGEM MATEMÁTICA E COMPUTACIONAL"]
[160122,"PROAP - CIÊNCIAS FISIOLÓGICAS"]
[160201,"RECURSOS PRÓPRIOS - BIOLOGIA ANIMAL"]
[160202,"RECURSOS PRÓPRIOS - CIÊNCIAIS AMBIENTAIS E FLORESTAIS"]
[160203,"RECURSOS PRÓPRIOS - CIÊNCIA DO SOLO"]
[160204,"RECURSOS PRÓPRIOS - DESENVOLVIMENTO, AGRICULTURA E SOCIEDADE"]
[160205,"RECURSOS PRÓPRIOS - ENGENHARIA QUÍMICA"]
[160206,"RECURSOS PRÓPRIOS - FITOTECNIA"]
[160207,"RECURSOS PRÓPRIOS - MEDICINA VETERINÁRIA"]
[160208,"RECURSOS PRÓPRIOS - CIÊNCIA E TECNOLOGIA EM INOVAÇÃO AGROPECUÁRIA"]
[160209,"RECURSOS PRÓPRIOS - EDUCAÇÃO AGRÍCOLA"]
[160210,"RECURSOS PRÓPRIOS - QUÍMICA ORGÂNICA"]
[160211,"RECURSOS PRÓPRIOS - TECNOLOGIA DE ALIMENTOS"]
[160212,"RECURSOS PRÓPRIOS - ZOOTECNIA"]
[160213,"FITOSSANIDADE E TECNOLOGIA APLICADA"]
[160214,"RECURSOS PRÓPRIOS - CIÊNCIAS VETERINÁRIAS"]
[160215,"RECURSOS PRÓPRIOS - HISTÓRIA"]
[160216,"RECURSOS PRÓPRIOS - EDUCAÇÃO E DEMANDAS POPULARES"]
[160217,"RECURSOS PRÓPRIOS - MULTICÊNTRICO EM CIÊNCIAS FISIOLÓGICAS"]
[160218,"RECURSO PRÓPRIO - DESENVOLVIMENTO TERRIT. E POLÍTICAS PÚBLICAS"]
[160219,"RECURSOS PRÓPIOS - PSICOLOGIA"]
[160220,"RECURSOS PRÓPRIOS - CIÊNCIAS SOCIAIS"]
[160221,"RECURSOS PRÓPRIOS - MODELAGEM MATEMÁTICA E COMPUTACIONAL"]
[160222,"RECURSOS PRÓPRIOS - CIÊNCIAS FISIOLÓGICAS"]
[170000,"CAIC"]
[180000,"CTUR"]
[180010,"CTUR - ÁREA DO NÚCLEO COMUM"]
[180020,"CTUR - ÁREA DE HOTELARIA"]
[180030,"CTUR - AGROPECUÁRIA ORGÂNICA"]
[190000,"CAMPUS DR. LEONEL MIRANDA"]
[200000,"PRÓ-REITORIA DE PLANEJAMENTO, AVALIAÇÃO E DESENVOLVIMENTO INSTITUCIONAL"]
[200100,"COORDENADORIA DE DESENVOLVIMENTO INSTITUCIONAL"]
[200200,"COORDENADORIA DE TECNOLOGIA DA INFORMAÇÃO E COMUNICAÇÃO"]
[200300,"COORDENADORIA DE PROJETOS DE ENGENHARIA E ARQUITETURA"]
[210000,"INSTITUTO DE AGRONOMIA"]
[210010,"PROGRAMA DE RESIDÊNCIA EM ENGENHARIA AGRONÔMICA"]
[210020,"CONTRATO MA/UFRRJ - FITOSSANIDADE VEGETAL"]
[210030,"PROGRAMA PÓS-GRADUAÇÃO EM EDUCAÇÃO AGRÍCOLA"]
[210031,"PPGEA - TC INSTITUTO FEDERAL FLUMINENSE"]
[210032,"PPGEA - TC UNIVERSIDADE FEDERAL RURAL DE PERNAMBUCO"]
[210033,"PPGEA - TC INSTITUTO FEDERAL DO ESPÍRITO SANTO"]
[210034,"PPGEA - TC INSTITUTO FEDERAL DE EDUCAÇÃO, CIÊNCIA E TECNOLOGIA DO AMAPÁ"]
[210035,"PPGEA - TC INSTITUTO FEDERAL DE EDUCAÇÃO, CIÊNCIA E TECNOLOGIA DO AMAZONAS"]
[210100,"DEPARTAMENTO DE FITOTECNIA"]
[210101,"CURSO DE PÓS GRADUAÇÃO EM TECNOLOGIA DE SEMENTES"]
[210200,"DEPARTAMENTO DE GEOCIÊNCIAS"]
[210300,"DEPARTAMENTO DE SOLOS"]
[220000,"INSTITUTO DE BIOLOGIA"]
[220100,"DEPARTAMENTO DE BIOLOGIA ANIMAL"]
[220110,"LABORATÓRIO DE IMUNOTOXICOLOGIA E BIOLOGIA PARASITÁRIA"]
[220200,"DEPARTAMENTO DE BOTÂNICA"]
[220300,"DEPARTAMENTO DE CIÊNCIAS FISIOLÓGICAS"]
[220310,"BIOTÉRIO DO DEPARTAMENTO DE CIÊNCIAS FISIOLÓGICAS"]
[220400,"DEPARTAMENTO DE ENTOMOLOGIA E FITOPATOLOGIA"]
[220410,"LABORATÓRIO OFICIAL DE DIAGNÓSTICO FITOSSANITÁRIO"]
[220500,"DEPARTAMENTO DE GENÉTICA"]
[220600,"PROGRAMA DE PÓS-GRADUAÇÃO EM CIÊNCIAS FISIOLÓGICAS"]
[230000,"INSTITUTO DE CIÊNCIAS EXATAS"]
[230100,"DEPARTAMENTO DE FÍSICA"]
[230101,"PROGRAMA DE TREINAMENTO ESPECIAL PARA ALUNOS - PET"]
[230200,"DEPARTAMENTO DE MATEMÁTICA"]
[230210,"PÓS GRADUACAO EM MATEMÁTICA LATO SENSO"]
[230220,"PROJETO DE CRIAÇÃO DO CURSO DE ESPECIALIZAÇÃO EM ESTATÍSTICA APLICADA"]
[230300,"DEPARTAMENTO DE QUÍMICA"]
[240000,"INSTITUTO DE CIÊNCIAS HUMANAS E SOCIAIS"]
[240400,"DEPARTAMENTO DE LETRAS E CIÊNCIAS SOCIAIS"]
[240410,"CURSO DE PÓS GRADUAÇÃO EM CIÊNCIAS SOCIAIS"]
[240500,"MESTRADO EM FILOSOFIA"]
[250000,"INSTITUTO DE EDUCAÇÃO"]
[250010,"CONVÊNIO - ME - IMPLANTAÇÃO NÚCLEO ESPORTE EDUCACIONAL"]
[250020,"LICENCIATURA EM EDUCAÇÃO DO CAMPO - PROCAMPO"]
[250100,"DEPARTAMENTO DE EDUCAÇÃO FÍSICA E DESPORTOS"]
[250110,"PÓS-GRADUAÇÃO EM PEDAGOGIA DA EDUCAÇÃO FÍSICA E DO ESPORTE"]
[250120,"PROGRAMA DE PÓS-GRADUAÇÃO EM LUTAS"]
[250200,"DEPARTAMENTO DE PSICOLOGIA"]
[250210,"LABORATÓRIO DE PSICOLOGIA E INFORMAÇÕES AFRO-DESCENDENTES"]
[250300,"DEPARTAMENTO DE TEORIA E PLANEJAMENTO DE ENSINO"]
[250310,"ESPECIALIZAÇÃO EM COORDENAÇÃO PEDAGÓGICA"]
[250320,"ESPECIALIZAÇÃO EM PSICOPEDAGOGIA"]
[260000,"INSTITUTO DE FLORESTAS"]
[260001,"FLORESTA - PROJETOS"]
[260010,"REVISTA FLORESTA AMBIENTE"]
[260020,"PROGRAMA DE PÓS GRADUAÇÃO EM PRÁTICAS EM DESENVOLVIMENTO SUSTENTÁVEL"]
[260100,"DEPARTAMENTO DE CIÊNCIAS AMBIENTAIS"]
[260200,"DEPARTAMENTO DE PRODUTOS FLORESTAIS"]
[260300,"DEPARTAMENTO SILVICULTURA"]
[260310,"CONV.041/01 - REDE MATA ATLÂNTICA (FNMA-UFRRJ)"]
[270000,"INSTITUTO DE TECNOLOGIA"]
[270100,"DEPARTAMENTO DE ARQUITETURA E URBANISMO"]
[270200,"DEPARTAMENTO DE ENGENHARIA"]
[270300,"DEPARTAMENTO DE ENGENHARIA QUÍMICA"]
[270400,"DEPARTAMENTO DE TECNOLOGIA DE ALIMENTOS"]
[280000,"INSTITUTO DE VETERINÁRIA"]
[280010,"HOSPITAL VETERINÁRIO"]
[280100,"DEPARTAMENTO DE EPIDEMIOLOGIA E SAÚDE PÚBLICA"]
[280200,"DEPARTAMENTO DE MEDICINA E CIRURGIA VETERINÁRIA"]
[280300,"DEPTO DE MICROBIOLOGIA E IMUNOLOGIA VETERINÁRIA"]
[280400,"DEPARTAMENTO DE PARASITOLOGIA ANIMAL"]
[280500,"PROJETO DE CONTROLE POPULACIONAL E BEM ESTAR ANIMAL DA UFRRJ"]
[290000,"INSTITUTO DE ZOOTECNIA"]
[290100,"DEPARTAMENTO DE NUTRIÇÃO ANIMAL E PASTAGENS"]
[290200,"DEPARTAMENTO DE PRODUÇÃO ANIMAL"]
[290300,"DEPARTAMENTO DE REPRODUÇÃO E AVALIAÇÃO ANIMAL"]
[300000,"CAMPUS DA UFRRJ EM NOVA IGUAÇU"]
[300001,"RESTAURANTE UNIVERSITÁRIO - NOVA IGUAÇU"]
[300010,"BIBLIOTECA - NOVA IGUAÇU"]
[300020,"SUPERINTENDÊNCIA DE INFORMÁTICA - NOVA IGUAÇU"]
[300100,"DEPARTAMENTO DE ADMINISTRAÇÃO E TURISMO"]
[300200,"DEPARTAMENTO DE EDUCAÇÃO E SOCIEDADE"]
[300210,"LABORATÓRIO DE ESTUDOS AFRO BRASILEIROS E INDÍGENAS"]
[300220,"GRUPO DE PESQUISA EDUCAÇÃO SUPERIOR E RELAÇÕES ÉTNICO-RACIAIS"]
[300230,"CURRÍCULO, PLANEJAMENTO E ORGANIZAÇÃO DO TRABALHO PEDAGÓGICO NA EDUCAÇÃO INFANTIL"]
[300300,"DEPARTAMENTO DE HISTÓRIA E ECONOMIA"]
[300400,"DEPARTAMENTO DE TECNOLOGIAS E LINGUAGEM"]
[300500,"DEPARTAMENTO DE CIÊNCIAS JURÍDICAS"]
[300600,"DEPARTAMENTO DE LETRAS"]
[300700,"DEPARTAMENTO DA CIÊNCIA DA COMPUTAÇÃO"]
[400000,"CAMPUS DA UFRRJ EM TRÊS RIOS"]
[400100,"DEPARTAMENTO DE CIÊNCIAS ADMINISTRATIVAS E DO AMBIENTE"]
[500000,"DESCENTRALIZAÇÕES DIVERSAS"]
[500001,"INCLUIR"]
[500010,"EJA - APRENDIZADO VIRTUAL MULTIMÍDA EM REDE SOCIAL"]
[500020,"PROEJA"]
[500030,"PROGRAMA INGLÊS SEM FRONTEIRAS"]
[500100,"DESCENTRALIZAÇÕES SECR. EDUC. PROF. E TECNOLÓGICA - COLÉGIO TÉCNICO"]
[500201,"INCRA - EJA - EDUCAR PARA EMANCIPAR"]
[500202,"LICENCIATURA EM EDUCAÇÃO NO CAMPO - CONVÊNIO INCRA"]
[500300,"CONVÊNIOS FUNDO NACIONAL DESENVOLVIMENTO CIENTÍFICO E TECNOLÓGICO"]
[500400,"DESCENTRALIZAÇÕES FUNDO NACIONAL DESENVOLVIMENTO DA EDUCAÇÃO"]
[500401,"ESCOLA ATIVA"]
[500402,"PDE"]
[500403,"MÍDIAS NA EDUCAÇÃO"]
[500404,"PRONATEC - COLÉGIO TÉCNICO"]
[500405,"PROGRAMA DE FORTALECIMENTO DOS CONSELHOS ESCOLARES"]
[500500,"CAPES"]
[500501,"UNIVERSIDADE ABERTA"]
[500600,"DESCENTRALIZAÇÕES PPGEA"]
[500700,"FORMAÇÃO E CAPACITAÇÃO EM EDUCAÇÃO BÁSICA"]
[500710,"PRÁTICAS PEDAGÓGICAS EM EDUCAÇÃO DO CAMPO"]
[600000,"INSTITUTO DE CIÊNCIAS SOCIAIS APLICADAS"]
[600100,"DEPARTAMENTO DE CIÊNCIAS ADMINISTRATIVAS E CONTÁBEIS"]
[600110,"MESTRADO EM GESTÃO ESTRATÉGICA DE NEGÓCIOS"]
[600200,"DEPARTAMENTO DE CIÊNCIAS ECONÔMICAS"]
[600210,"ESPECIALIZAÇÃO EM GESTÃO ESTRATÉGICA NO AGRONEGÓCIO"]
[600300,"DEPARTAMENTO DE ECONOMIA DOMÉSTICA E HOTELARIA"]
[600310,"UNIDADE DE PRODUÇÃO DE ARTIGOS TÊXTEIS - UPAT"]
[800000,"EMENDAS PARLAMENTARES"]

{"sheet":"TD 10000","index":2,"n_rows":6,"n_cols":7,"rows_kept":6,"cut":false,"hidden":false,"merged":[[1,2,2,6]]}
[]
[null,null,{"$f":"IFERROR(VLOOKUP(B3,'Banco de dados'!$A$994:$B$1311,2,0),\"\")","v":"RESERVA TÉCNICA"}]
["Centro de Custo",10000]
[]
["Reqmat","Nº DMSA","Nº do processo","Objeto","Setor requisitante","Localização atual","Situação atual"]
["20/2014",1851,"009340/2014","Conserto e manutenção preventiva do espectrômetro","IT-DEPARTAMENTO DE ENGENHARIA QUÍMICA - DEQ","ARQUIVO","Já houve empenho (2014NE802534), mas o pagamento ainda não foi efetuado."]

{"sheet":"TD 10310","index":3,"n_rows":15,"n_cols":7,"rows_kept":15,"cut":false,"hidden":false,"merged":[[1,2,2,6]]}
[]
[null,null,{"$f":"IFERROR(VLOOKUP(B3,'Banco de dados'!$A$994:$B$1311,2,0),\"\")","v":"CAPACITAÇÃO DE SERVIDORES - RECURSOS ESPECÍFICOS"}]
["Centro de Custo",10310]
[]
["Reqmat","Nº DMSA","Nº do processo","Objeto","Setor requisitante","Localização atual","Situação atual"]
["10/2014",1739,"008289/2014","Contratação de pessoa jurídica para a prestação de serviço de montagem e desmontagem de uma estrutura de palco e serviços de sonorização","COORDENAÇÃO DE DESENVOLVIMENTO DE PESSOAS","ARQUIVO","Arquivado porque  houve empenho (2014NE802043) e pagamento (2014OB808200 e 2014OB808201)."]
["11/2014",1504,"007806/2014","Pagamento de inscrição da servidora Ana Maria Araújo da Silva no curso de retenções de tributos pelos órgãos e entidades","DEPARTEAMENTO DE CONTABILIDADE E FINANÇAS/PROAF","ARQUIVO","Desarquivado pela CODEP para realizar o relatório anual de cursos  do Governo Federal e em breve será novamente arquivado.\nArquivado porque  houve empenho (2014NE801738) e pagamento (2014GR800106)."]
["16/2014",1476,"007506/2014","Pagamento de inscriçãoo no XVIII Seminário Nacional de Bibliotecas Universitárias Belo Horizonte-MG das servidoras Letícia Schettini, Eliane Maricá Soares e Silvia Alves de Andrade","REITORIA/BIBLIOTECA","SAPG","Já houve empenho (2014NE802101), mas o pagamento ainda não foi efetuado."]
["17/2014",1477,"007506/2014","Pagamento de inscriçãoo no XVIII Seminário Nacional de Bibliotecas Universitárias Belo Horizonte-MG das servidoras Letícia Schettini, Eliane Maricá Soares e Silvia Alves de Andrade","REITORIA/BIBLIOTECA","SAPG","Já houve empenho (2014NE802101), mas o pagamento ainda não foi efetuado."]
["08/2014",1401,"006576/2014","Pagamento de inscrição do servidor Edmilson Rangel no evento PCASP - Entendendo o plano de contas plicado ao setor público","DEPARTAMENTO DE CONTABILIDADE E FINANÇAS","ARQUIVO","Desarquivado pela CODEP para realizar o relatório anual de cursos  do Governo Federal e em breve será novamente arquivado.\nArquivado porque  houve empenho (2014NE801904) e pagamento (2014OB807497)."]
["08/2014",1508,"007802/2014","Contratação de serviços de palestra motivacional do dia do servidor","COORDENAÇÃO DE DESENVOLVIMENTO DE PESSOAS","COORD. DE DESENSOLVIMENTO DE PESSOA","Desarquivado pela CODEP para realizar o relatório anual de cursos  do Governo Federal e em breve será novamente arquivado.\nHouve empenho (2014NE801969) e pagamento (2014OB809249)."]
["03/2014",1324,"006172/2014","Pagamento de inscrição do servidor Edmilson Rangel no II Curso de excel avançado aplicado ao setor público","DEPARTAMENTO DE CONTABILIDADE E FINANÇAS","SAPG","O requerente não participou do curso no período de 13 a 17/10/14 e solicitou o aproveitamento do processo para realizar o mesmo curso no período de 06 a 10/04/15."]
["07/2014",1370,"006592/2014","Pagamento de inscrição dos servidores Reginal Zão e André Levino no curso de Retenções de tributos pelos órgãos e entidades da administração pública","DEPARTAMENTO DE CONTABILIDADE E FINANÇAS","ARQUIVO","Desarquivado pela CODEP para realizar o relatório anual de cursos  do Governo Federal e em breve será novamente arquivado.\nArquivado porque  houve empenho (2014NE801687) e pagamento (2014GR800108)."]
["09/2014",1738,"008288/2014","Contratação de pessoa jurídica para prestação de serviço de banda musical","COORDENAÇÃO DE DESENVOLVIMENTO DE PESSOAS","ARQUIVO","Arquivado porque  houve empenho (2014NE802044) e pagamento (2014OB808988)."]
["479/2014",1916,"009793/2014","Inscrição de Raquel Ramos de Souza Ferreira no curso de libras língua brasileira de sinais","DEPARTAMENTO PESSOAL","ARQUIVO","Já houve empenho (2014NE802166), mas o pagamento ainda não foi efetuado."]

{"sheet":"TD 100000","index":4,"n_rows":32,"n_cols":7,"rows_kept":32,"cut":false,"hidden":false,"merged":[[1,2,2,6]]}
[]
[null,null,{"$f":"IFERROR(VLOOKUP(B3,'Banco de dados'!$A$994:$B$1311,2,0),\"\")","v":"REITORIA"}]
["Centro de Custo",100000]
[]
["Reqmat","Nº DMSA","Nº do processo","Objeto","Setor requisitante","Localização atual","Situação atual"]
["10/2013",1307,"006018/2014","Aquisição de equipamentos para laboratório (grupo 52.08)","DEQUIM - ICE - FÍSICO-QUÍMICA","DIREÇÃO DMSA","Buscando informações."]
["12/2014",1872,"009678/2014","Aquisição de dois capacetes de piloto de motocicleta","ALMOXARIFADO","SCD","Abriu cotação mas o capacete cotado foi inferior ao solicitado e com valor acima do estimado."]
["20/2013","S/Nº","000121/2014","Contratação de um serviço de assinatura de jornal, diário de grande circulação com abrangência nacional","REITORIA","ARQUIVO","Arquivado porque houve empenho (2014NE801533) e pagamentos (2014OB807181 e 2014DF801855)."]
["21/2014",841,"000122/2014","Contratação de um serviço de TV por assinatura que contenha os canais ligados à educação e informação","ASSESSORIA DE INFORMAÇÃO E COMUNICAÇÃO","DIREÇÃO DMSA","Não houve interessados em participar da dispensa de licitação e as devidas providências estão sendo adotadas."]
["21/2014",1863,"009285/2014","Pagamento de inscrição da profª. Alessandra Carreiro no V Simpósio Brasileiro de Ciências Geodésicas","INSTITUTO DE TECNOLOGIA","ARQUIVO","Desarquivado pela CODEP para realizar o relatório anual de cursos  do Governo Federal e em breve será novamente arquivado.\nArquivado porque  houve empenho (2014NE802155) e pagamento (2014OB808997)."]
["65/2014",297,"002701/2014","Aquisição de café, açúcar, coador e adoçante","REITORIA","CLOG","Pregão nº 88/2014 finalizado em 03/11/14. Já houve empenho (2014NE802417, 2015NE800302) e pagamento (2015OB800319). O processo está disponível na Seção de Sistema de Registro de Preços para solicitar empenhos."]
["66/2014",295,"002706/2014","Aquisição de artigos de higiene e conservação","SECRETARIA DA REITORIA","SPP","Verificando a possibilidade de atendimento juntamente com a demanda de 2015."]
["67/2014",294,"002704/2014","Aquisição de material de expediente (papel A4, carta, ofício, etc)","SECRETARIA DA REITORIA","CPACS","Consolidar Pesquisas de Preços"]
["68/2014",389,"002699/2014","Aquisição de material de expediente","REITORIA","DIREÇÃO DMSA","Verificando a possibilidade de atendimento juntamente com a demanda de 2015."]
["69/2014",293,"002707/2014","Aquisição de artigos de copa e cozinha","REITORIA","SPP","Verificando a possibilidade de atendimento juntamente com a demanda de 2015."]
["82/2014",459,"005867/2014","Aquisição de aparelhos e utensílios domésticos (grupo 52.12)","SECRETARIA DOS ÓRGÃOS COLEGIADOS","SPP","Realizando ajustes após emissão de parecer jurídico."]
["84/2014",461,"006022/2014","Aquisição de equipamentos eletro-eletrônicos (grupo 52.33)","SECRETARIA DOS ÓRGÃOS COLEGIADOS","SPP","Pesquisa de preço."]
["01/2014",35,"001161/2014","Serviço de editoração eletrônica e impressão dos volumes 22","DIRETORIA DO INSTITUTO DE FLORESTA","SPP","Pregão nº 58/2014 finalizado em 25/09/14. O processo está disponível no Instituto de Florestas para solicitar empenhos."]
["01/2014",266,"002892/2014","Aquisição de 14 mil garrafões de 20 litros de água mineral","ALMOXARIFADO CENTRAL","DIVISÃO DE ADMINISTRAÇÃO FINANCEIRA","Pregão nº 92/2014 finalizado em 25/11/14. Já houve empenho (2014NE802501, 2015NE800192, 2015NE800193, 2015NE800194, 2015NE800195, 2015NE800196) e pagamento (2015OB801330). "]
["01/2014","S/Nº","010614/2014","Contratação de empresa especializada no controle de cupins e outras pragas como: barata, traças, formigas, brocas, aranhas, mosquitos etc.","PROCURADORIA GERAL","ASTEC","Será atendido junto com a Demanda de 2015 - equipe do projeto"]
["01/2014",1102,"005198/2014","Contratação de empresa especializada na prestação de serviços de locação de 03 impressoras multifuncionais (carona)","COORDENAÇÃO DE CONTRATOS E IMPORTAÇÃO","ARQUIVO","Arquivado porque o processo (005691/2013) para locação de copiadoras teve tramitação mais célere do que esta carona e o respectivo pregão (nº 31/2015) foi aberto em 04/03/15."]
["05/2014",1309,"005967/2014","Pagamento de inscrição de Cristiane Venâncio de Oliveira Martins no 8º Congresso Empresarial Aberje Rio de Janeiro","COORDENADORIA DE COMUNICAÇÃO SOCIAL","ARQUIVO","Arquivado porque  houve empenho (2014NE801736) e pagamento (2014OB806917)."]
["78/2014",1484,"007073/2014","Pagamento de inscrição do servidor Duclério José no 41° FONAI-TEC","AUDITORIA INTERNA","ARQUIVO","Desarquivado pela CODEP para realizar o relatório anual de cursos  do Governo Federal e em breve será novamente arquivado.\nArquivado porque  houve empenho (2014NE801685) e pagamento (2014OB809153)."]
["01/2013",1298,"006018/2014","Aquisição de equipamentos para laboratório (grupo 52.08)","DEQUIM - ICE","DIREÇÃO DMSA","Buscando informações."]
["02/2013",1299,"006018/2014","Aquisição de equipamentos para laboratório (grupo 52.08)","DEQUIM - ICE - BIOQUÍMICA","DIREÇÃO DMSA","Buscando informações."]
["07/2013",1304,"006018/2014","Aquisição de equipamentos para laboratório (grupo 52.08)","DEQUIM - ICE - ANÁLISE INSTRUMENTAL","DIREÇÃO DMSA","Buscando informações."]
["S/Nº","S/Nº","000256/2014","Aquisição de revista Síntese Responsabilidade Pública","PROCURADORIA GERAL","ARQUIVO","Arquivado porque  houve empenho (2014NE800304) e pagamento (2014OB803688 e 2014DF801211)."]
["S/Nº","S/Nº","000257/2014","Aquisição de boletim de direito administrativo e boletim de licitações e contratos 2014","PROCURADORIA GERAL","ARQUIVO","Arquivado porque  houve empenho (2014NE800368) e pagamento (2014OB804980 e 2014DF801479)."]
["S/Nº","S/Nº","002827/2014","Aquisição de cartuchos","REITORIA","SAPG","Já houve empenho (2014NE800771), pagamento (2014OB808377) e foi entregue no Almoxarifado em 15/07/14."]
["279/2014",1917,"009789/2014","Serviços de recuperação do assoalho de madeira e acabamento das salas 125, 126,127 e 128 do P1","REITORIA","CADMIN","Realizando ajustes após emissão de parecer jurídico."]
["26/2013","S/Nº","000793/2014","Aquisição de concentrado protéico, lácteo e energético, contendo vitaminas minerais e aminoácidos para uso na fabricação de rações, etc","COORDENADORIA ESPECIAL DE PROD. INTEGRADA ENSINO, PESQ. EXT.","COORDENADORIA ESPECIAL DE PRODUÇÃO INTEGRADA ENSINO, PESQUISA E  EXTENSÃO","Buscando informações."]
["25/2013","S/Nº","000792/2014","Aquisição de milho em grãos máximo 14 de umidade, saco de 50 kg e outros","COORDENADORIA ESPECIAL DE PROD. INTEGRADA ENSINO, PESQ. EXT.","SSRP","Já houve empenho (2014NE800998), pagamento (2014OB805578) e entregas no Almoxarifado em 25/07/14, 01/08/14 e 11/08/14.\nJá houve empenho (2014NE801531), pagamento (2014OB807984) e entregas no Almoxarifado em 30/09/14 e 05/10/14.\nJá houve empenho (2014NE802104), pagamento (2015OB800172) e entregas no Almoxarifado em 21/11/14 e 06/12/14.\nJá houve empenho (2014NE800997), mas o prazo de entrega está vencido e um ofício de cobrança foi emitido à empresa em 04/03/15.\nJá houve empenho (2014NE800999), pagamentos (2014OB805559 e 2014DF801574) e foi entregue no Almoxarifado em 24/07/14.\nJá houve empenho (2014NE802107) e foi entregue no Almoxarifado em 03/02/15."]

{"sheet":"TD 100060","index":5,"n_rows":11,"n_cols":7,"rows_kept":11,"cut":false,"hidden":false,"merged":[[1,2,2,6]]}
[]
[null,null,{"$f":"IFERROR(VLOOKUP(B3,'Banco de dados'!$A$994:$B$1311,2,0),\"\")","v":"DIVISÃO DE GUARDA E VIGILÂNCIA"}]
["Centro de Custo",100060]
[]
["Reqmat","Nº DMSA","Nº do processo","Objeto","Setor requisitante","Localização atual","Situação atual"]
["75/2014","S/Nº","004448/2014","Aquisição de 15 baterias de rádio de comunicação portátil da marca Motorola","DIVISÃO DE GUARDA E VIGILÂNCIA","ARQUIVO","Buscando informações."]
["05/2014",1321,"004445/2014","Aquisição de baterias para motocicletas","DIVISÃO DE GUARDA E VIGILÂNCIA","SEÇÃO DE CONTROLE","Já houve empenho (2014NE801583) e foi entregue no Almoxarifado em 30/09/14."]
["04/2014",1322,"004447/2014","Aquisição de componente (percursor) interno das 2 espingardas calibre 12","DIVISÃO DE GUARDA E VIGILÂNCIA","DIVISÃO DE GUARDA E VIGILÂNCIA","Já houve empenho (2014NE801581) e foi entregue no  Almoxarifado em 25/09/14."]
["02/2014",942,"004446/2014","Revisão de antenas de comunicação instaladas no interior do Campus da UFRRJ","DIVISÃO DE GUARDA E VIGILÂNCIA","ARQUIVO","Arquivado porque houve empenho e pagamento."]
["S/Nº","S/Nº","007152/2014","Aquisição de veículos de transporte não especializado tipo Pick-up","DIVISÃO DE GUARDA E VIGILÂNCIA","ANEXADO    23083.004907/2014-85","Já houve empenho (2014NE801998, 2014NE801999, 2014NE802192), pagamentos (2015OB800232 , 2015OB800413 e 2015DF800135, 2015DF800207) e foi entregue no Almoxarifado em 19/12/14. (anexado ao 004907/2014)."]
["144/2014",1019,"005013/2014","Contratação de empresa especializada em serviços de vigilância patrimonial armada e segurança para atender a UFRRJ","REITORIA/DGV","SPP","Pesquisa de preço."]

{"sheet":"TD 100070","index":6,"n_rows":18,"n_cols":7,"rows_kept":18,"cut":false,"hidden":false,"merged":[[1,2,2,6]]}
[]
[null,null,{"$f":"IFERROR(VLOOKUP(B3,'Banco de dados'!$A$994:$B$1311,2,0),\"\")","v":"POSTO MÉDICO"}]
["Centro de Custo",100070]
[]
["Reqmat","Nº DMSA","Nº do processo","Objeto","Setor requisitante","Localização atual","Situação atual"]
["61/2014",115,"003178/2014","Aquisição de medicamentos de uso humano","POSTO MÉDICO","ANEXADO    23083.002702/2014-64","Elaboração da minuta de edital (anexado ao 002702/2014)."]
["69/2014",409,"002700/2014","Aquisição de gás liquefeito de petróleo","POSTO MÉDICO","DIREÇÃO DMSA","Pregão nº 138/2014 finalizado em 14/11/14. O processo está disponível na Seção de Sistema de Registro de Preços para solicitar empenhos."]
["69/2014",409,"003153/2014","Aquisição de gás medicinal","POSTO MÉDICO","SEC. ADM. DO DEPTO DE CONTABILIDADE E FINANÇAS","Pregão nº 13/2015 (antigo nº 99/2014) finalizado em 22/01/15. Está na SSRP para realizar as cópias das atas e em breve um gestor será designado."]
["70/2014",398,"002701/2014","Aquisição de café, açúcar, coador e adoçante","POSTO MÉDICO","CLOG","Pregão nº 88/2014 finalizado em 03/11/14. Já houve empenho (2014NE802417, 2015NE800302) e pagamento (2015OB800319). O processo está disponível na Seção de Sistema de Registro de Preços para solicitar empenhos."]
["71/2014",399,"002699/2014","Aquisição de material de expediente","POSTO MÉDICO","DIREÇÃO DMSA","Verificando a possibilidade de atendimento juntamente com a demanda de 2015."]
["72/2014",400,"002704/2014","Aquisição de material de expediente (papel A4, carta, ofício, etc)","DIVISÃO DE SAÚDE","CPACS","Consolidar Pesquisas de Preços"]
["73/2014",401,"002707/2014","Aquisição de artigos de copa e cozinha","POSTO MÉDICO","SPP","Verificando a possibilidade de atendimento juntamente com a demanda de 2015."]
["74/2014",402,"002706/2014","Aquisição de artigos de higiene e conservação","DIVISÃO DE SAÚDE","SPP","Verificando a possibilidade de atendimento juntamente com a demanda de 2015."]
["79/2014",404,"005867/2014","Aquisição de aparelhos e utensílios domésticos (grupo 52.12)","DIVISÃO DE SAÚDE","SPP","Realizando ajustes após emissão de parecer jurídico."]
["80/2014",405,"004521/2014","Aquisição de eletrocardiógrafo ECG, digital de 12 canais","DIVISÃO DE SAÚDE","ARQUIVO","Arquivado porque já houve a compra do equipamento."]
["81/2014",407,"006022/2014","Aquisição de equipamentos eletro-eletrônicos (grupo 52.33)","DIVISÃO DE SAÚDE","SPP","Pesquisa de preço."]
["131/2014",1013,"005726/2014","Aquisição de artigos cirúrgicos e de enfermaria (somente para o Posto Médico (grupo 30.36)","DIVISÃO DE SAÚDE","ASTEC","Elaboração da minuta de edital."]
["S/Nº","S/Nº","002446/2014","Conserto do eletrocardiógrafo","DIVISÃO DE SAÚDE","ARQUIVO","Já houve empenho (2014NE801119) e pagamento (2015OB800753)."]

{"sheet":"TD 100090","index":7,"n_rows":15,"n_cols":7,"rows_kept":15,"cut":false,"hidden":false,"merged":[[1,2,2,6]]}
[]
[null,null,{"$f":"IFERROR(VLOOKUP(B3,'Banco de dados'!$A$994:$B$1311,2,0),\"\")","v":"PRAÇA DE DESPORTOS"}]
["Centro de Custo",100090]
[]
["Reqmat","Nº DMSA","Nº do processo","Objeto","Setor requisitante","Localização atual","Situação atual"]
["32/2014",136,"002701/2014","Aquisição de café, açúcar, coador e adoçante","PRAÇA DE DESPORTOS","CLOG","Pregão nº 88/2014 finalizado em 03/11/14. Já houve empenho (2014NE802417, 2015NE800302) e pagamento (2015OB800319). O processo está disponível na Seção de Sistema de Registro de Preços para solicitar empenhos."]
["33/2014",135,"002704/2014","Aquisição de material de expediente (papel A4, carta, ofício, etc)","DEPARTAMENTO DE ESPORTES E LAZER","CPACS","Consolidar Pesquisas de Preços"]
["34/2014",134,"002707/2014","Aquisição de artigos de copa e cozinha","PRAÇA DE DESPORTOS","SPP","Verificando a possibilidade de atendimento juntamente com a demanda de 2015."]
["35/2014",133,"002706/2014","Aquisição de artigos de higiene e conservação","DEPARTAMENTO DE ESPORTES E LAZER","SPP","Verificando a possibilidade de atendimento juntamente com a demanda de 2015."]
["36/2014",132,"002703/2014","Aquisição de material de artes gráficas e desenho","PRAÇA DE DESPORTOS","SSRP","Será atendido junto com a Demanda de 2015 - equipe do projeto"]
["37/2014",131,"002699/2014","Aquisição de material de expediente","PRAÇA DE DESPORTOS","DIREÇÃO DMSA","Verificando a possibilidade de atendimento juntamente com a demanda de 2015."]
["38/2014",1413,"006008/2014","Aquisição de material hidráulico (grupo 30.24)","DEPARTAMENTO DE ESPORTE E LAZER","ASTEC","Elaboração da minuta de edital."]
["39/2014",1414,"006045/2014","Aquisição de material de construção (grupo 30.24A)","DEPARTAMENTO DE ESPORTE E LAZER","PREGÃO","Pregão 30/2015 agendado para abertura 27/03/2015."]
["40/2014",1028,"005968/2014","Aquisição de mobiliário em geral (grupo 52.42)","DEPARTAMENTO DE ESPORTE E LAZER","DIREÇÃO DMSA","Verificando a possibilidade de atendimento juntamente com a demanda de 2015."]
["40/2014","S/Nº","006538/2014","Aquisição de armário, em aço carbono, tipo vestiário, com 12 portas, pitões para cadeado e ventilação, etc","PRAÇA DE DESPORTOS","ARQUIVO","Buscando informações."]

{"sheet":"TD 100100","index":8,"n_rows":15,"n_cols":7,"rows_kept":15,"cut":false,"hidden":false,"merged":[[1,2,2,6]]}
[]
[null,null,{"$f":"IFERROR(VLOOKUP(B3,'Banco de dados'!$A$994:$B$1311,2,0),\"\")","v":"BIBLIOTECA CENTRAL"}]
["Centro de Custo",100100]
[]
["Reqmat","Nº DMSA","Nº do processo","Objeto","Setor requisitante","Localização atual","Situação atual"]
["12/2014",1053,"004998/2014","Aquisição de material permanente/adesão a ata","BIBLIOTECA CENTRAL","CLOG","Já houve empenho (2014NE801897), mas o prazo de entrega está vencido desde 15/01/15.\nJá houve empenho (2014NE801853), anulação parcial do empenho (2014NE801896), mas o prazo de entrega está vencido desde 04/01/15."]
["01/2014",375,"002701/2014","Aquisição de café, açúcar, coador e adoçante","BIBLIOTECA CENTRAL","CLOG","Pregão nº 88/2014 finalizado em 03/11/14. Já houve empenho (2014NE802417, 2015NE800302) e pagamento (2015OB800319). O processo está disponível na Seção de Sistema de Registro de Preços para solicitar empenhos."]
["08/2014",428,"002407/2014","Contratação de serviço especializado em processamento técnico e físico de material bibliográfico","BIBLIOTECA CENTRAL","SPP","Foi reenquadrado de SRP para tradional e em função disso terá que refazer a minuta de edital."]
["06/2014",370,"002707/2014","Aquisição de artigos de copa e cozinha","BIBLIOTECA CENTRAL","SPP","Verificando a possibilidade de atendimento juntamente com a demanda de 2015."]
["05/2014",371,"002706/2014","Aquisição de artigos de higiene e conservação","BIBLIOTECA CENTRAL","SPP","Verificando a possibilidade de atendimento juntamente com a demanda de 2015."]
["03/2014",373,"002703/2014","Aquisição de material de artes gráficas e desenho","BIBLIOTECA CENTRAL","SSRP","Será atendido junto com a Demanda de 2015 - equipe do projeto"]
["04/2014",372,"002704/2014","Aquisição de material de expediente (papel A4, carta, ofício, etc)","BIBLIOTECA CENTRAL","CPACS","Consolidar Pesquisas de Preços"]
["02/2014",374,"002699/2014","Aquisição de material de expediente","BIBLIOTECA CENTRAL","DIREÇÃO DMSA","Verificando a possibilidade de atendimento juntamente com a demanda de 2015."]
["07/2014",369,"002700/2014","Aquisição de gás liquefeito de petróleo","BIBLIOTECA CENTRAL","DIREÇÃO DMSA","Pregão nº 138/2014 finalizado em 14/11/14. O processo está disponível na Seção de Sistema de Registro de Preços para solicitar empenhos."]
["S/Nº","S/Nº","007553/2013","Contratação de serviços de restauração e encadernação de livros pertecentes ao acervo da Biblioteca Central","BIBLIOTECA CENTRAL","SEC. ADM. DO DEPTO DE CONTABILIDADE E FINANÇAS","Analisando manifestação de interesse (IRP) de outros órgãos. Pregão nº 15/2015 (antigo nº 133/2014) com provável abertura em 13/01/15."]

{"sheet":"TD 100200","index":9,"n_rows":19,"n_cols":7,"rows_kept":19,"cut":false,"hidden":false,"merged":[[1,2,2,6]]}
[]
[null,null,{"$f":"IFERROR(VLOOKUP(B3,'Banco de dados'!$A$994:$B$1311,2,0),\"\")","v":"IMPRENSA UNIVERSITÁRIA"}]
["Centro de Custo",100200]
[]
["Reqmat","Nº DMSA","Nº do processo","Objeto","Setor requisitante","Localização atual","Situação atual"]
["20/2013","S/Nº","006016/2014","Aquisição de cartuchos hp, toners e tintas (grupo 30.17A)","IMPRENSA UNIVERSITÁRIA","DMSA","Buscando informações."]
["20/2014",986,"005730/2014","Manutenção mensal de guilhotina automática","DIRETORIA","DRA. IVANI","Emissão de parecer Jurídico"]
["23/2014",1263,"005540/2014","Contratação de serviços para conserto da impressora (Plotter) HP DesignJEt","DIRETORIA DO DEPARTAMENTO","DIREÇÃO DMSA","Reqmat 22 e 26 não serão atendidos pois os valors dos consertos ultrapassam seus respectivos valores de mercado.\nAnálise e posterior encaminhamento À PROAF para autorização da despesa"]
["26/2014",1288,"005540/2014","Contratação de serviços para conserto da impressora RISO HC 5500R multifuncional","DIRETORIA DO DEPARTAMENTO","DIREÇÃO DMSA","Reqmat 22 e 26 não serão atendidos pois os valors dos consertos ultrapassam seus respectivos valores de mercado.\nAnálise e posterior encaminhamento À PROAF para autorização da despesa"]
["32/2014",1342,"006361/2014","Aquisição de suprimentos para impressoras (grupo 30.17)","IMPRENSA UNIVERSITÁRIA","SCD","Realizando ajustes após emissão de parecer jurídico."]
["33/2014",1344,"006364/2014","Aquisição de papel 40 Kg","IMPRENSA UNIVERSITÁRIA","IMPRENSA UNIVERSITÁRIA","A aquisição foi realizada através do processo 000614/2012 e o processo 006364/2014 será arquivado. "]
["37/2014",1438,"007162/2014","Manutenção de equipamentos da Imprensa Universitária (guilhotina, furador, grampeador, etc)","DIRETORIA","IMPRENSA UNIVERSITÁRIA","O requerente solicitou o processo para realizar ajustes no reqmat (os pedidos serão refeitos em 2015)."]
["01/2014",362,"002704/2014","Aquisição de material de expediente (papel A4, carta, ofício, etc)","IMPRENSA UNIVERSITÁRIA","CPACS","Consolidar Pesquisas de Preços"]
["03/2014","S/Nº","002703/2014","Aquisição de material de artes gráficas e desenho","IMPRENSA UNIVERSITÁRIA","SSRP","Será atendido junto com a Demanda de 2015 - equipe do projeto"]
["04/2014",565,"002706/2014","Aquisição de artigos de higiene e conservação","IMPRENSA UNIVERSITÁRIA","SPP","Verificando a possibilidade de atendimento juntamente com a demanda de 2015."]
["02/2014",363,"002701/2014","Aquisição de café, açúcar, coador e adoçante","IMPRENSA UNIVERSITÁRIA","CLOG","Pregão nº 88/2014 finalizado em 03/11/14. Já houve empenho (2014NE802417, 2015NE800302) e pagamento (2015OB800319). O processo está disponível na Seção de Sistema de Registro de Preços para solicitar empenhos."]
["30/2014",1337,"006343/2014","Aquisição de materiais de expediente e pasta vetro-laterial (grupos 30.16B e 30.16)","IMPRENSA UNIVERSITÁRIA","CPACS","Consolidar Pesquisas de Preços"]
["31/2014",1343,"006363/2014","Aquisição de tintas para máquina RISO","IMPRENSA UNIVERSITÁRIA","SPP","Realizando ajustes após emissão de parecer jurídico."]
["S/Nº","S/Nº","004584/2014","Aquisição de material de expediente","IMPRENSA UNIVERSITÁRIA","SSRP","Já houve empenho (2014NE802310), pagamento (2015OB800575) e foi entregue no Almoxarifado em 15/01/15."]

{"sheet":"TD 100300","index":10,"n_rows":29,"n_cols":7,"rows_kept":29,"cut":false,"hidden":false,"merged":[[1,2,2,6]]}
[]
[null,null,{"$f":"IFERROR(VLOOKUP(B3,'Banco de dados'!$A$994:$B$1311,2,0),\"\")","v":"PREFEITURA UNIVERSITÁRIA"}]
["Centro de Custo",100300]
[]
["Reqmat","Nº DMSA","Nº do processo","Objeto","Setor requisitante","Localização atual","Situação atual"]
["11/2014","S/Nº","002959/2014","Serviços de reparos dos veículos Fiat Linea placa HIG 4846 e ônibus Comil Campione placa KXY 3416","PREFEITURA UNIVERSITÁRIA","ARQUIVO","Arquivado após entendimento firmado entre a Direção do DMSA e a Pró Reitoria de Assuntos Financeiros, cujos processos de conserto de veículos deverão ser atendidos pelo contrato de manutenção de automóveis (processo 011591/2013), cuja gestão compete à Prefeitura Universitária. "]
["12/2014",851,"002959/2014","Serviços de reparos dos veículos Fiat Linea placa HIG 4846 e ônibus Comil Campione placa KXY 3416","PREFEITURA UNIVERSITÁRIA","ARQUIVO","Arquivado após entendimento firmado entre a Direção do DMSA e a Pró Reitoria de Assuntos Financeiros, cujos processos de conserto de veículos deverão ser atendidos pelo contrato de manutenção de automóveis (processo 011591/2013), cuja gestão compete à Prefeitura Universitária. "]
["13/2014","S/Nº","004420/2014","Contratação de serviço de balanceamento, alinhamento e cambagem da viatura Nissan, Frontier, placa KPG 9045 e outros","PREFEITURA UNIVERSITÁRIA","ARQUIVO","Arquivado porque  houve empenho (2014NE801401) e pagamento (2014OB808293)."]
["14/2014","S/Nº","003913/2014","Serviço de gerenciamento para fornecimento de óleos","DIVISÃO DE SERVIÇOS GERAIS","SPP","Pesquisa de preço."]
["19/2014",1002,"005202/2014","Contratação de serviço de recuperação da suspensão diantera com subst. das balanças dianteiras, veiculo placa: LLC 588","PREFEITURA UNIVERSITÁRIA","ARQUIVO","Arquivado após entendimento firmado entre a Direção do DMSA e a Pró Reitoria de Assuntos Financeiros, cujos processos de conserto de veículos deverão ser atendidos pelo contrato de manutenção de automóveis (processo 011591/2013), cuja gestão compete à Prefeitura Universitária. "]
["20/2014",1041,"006045/2014","Aquisição de material de construção (grupo 30.24A)","DIVISÃO DE SERVIÇOS GERAIS","PREGÃO","Pregão 30/2015 agendado para abertura 27/03/2015."]
["21/2014",1042,"006008/2014","Aquisição de material hidráulico (grupo 30.24)","DIVISÃO DE SERVIÇOS GERAIS","ASTEC","Elaboração da minuta de edital."]
["24/2014","S/Nº","005124/2014","Contratação de serviço especializado para manutenção de elevador","PREFEITURA UNIVERSITÁRIA","DCF","(vazio)"]
["25/2014","S/Nº","006081/2014","Aquisição de duas baterias de 12v e 150 amperes para grupo gerador do P1","PREFEITURA UNIVERSITÁRIA","SEÇÃO DE CONTROLE","Já houve empenho (2014NE802286), pagamento (2014OB809805) e foi entregue no Almoxarifado em 09/12/14."]
["27/2014",1379,"006501/2014","Aquisição de cesto aéreo de cabine dupla para adaptação em um caminhão Munck","DIVISÃO DE SERVIÇOS GERAIS","SPP","Elaboração da minuta de edital."]
["28/2014",1490,"003666/2014","Aquisição de cartuchos de tinta","SECRETARIA","SPP","Pesquisa de preço."]
["33/2014",1794,"009045/2014","Aquisição de madeira construção","DIVISÃO DE SERVIÇOS GERAIS","DIREÇÃO DMSA","Buscando informações."]
["37/2014",943,"004449/2014","Aquisição de poste duplo t em concreto armado etc","PREFEITURA UNIVERSITÁRIA"," SEC. ADM. DO DEPTO DE CONTABILIDADE E FINANÇAS","Pregão nº 21/2015 (antigo nº 158/2014) finalizado em 26/01/15. Está aguardando o envio das atas assinadas."]
["01/2014",308,"003855/2014","Contratação de pessoa jurídica para prestação de serviços de postos de motorista","DIVISÃO DE SERVIÇOS GERAIS","DIREÇÃO DMSA","O processo será encaminhado ao requerente para adequação do pedido à Instrução Normativa nº 02/2008."]
["01/2014",347,"002701/2014","Aquisição de café, açúcar, coador e adoçante","PREFEITURA","CLOG","Pregão nº 88/2014 finalizado em 03/11/14. Já houve empenho (2014NE802417, 2015NE800302) e pagamento (2015OB800319). O processo está disponível na Seção de Sistema de Registro de Preços para solicitar empenhos."]
["06/2014",1519,"002971/2014","Aquisição de protetor contra surto e tensão","DIVISÃO DE SERVIÇOS GERAIS","DIREÇÃO DMSA","Realizando nova cotação eletrônica para tentar negociar com base no preço de referência."]
["05/2014",852,"003361/2014","Contratação de pessoa jurídica para assistência técnica e manutenção de dois grupos geradores e painéis eletrônicos","DIVISÃO DE SERVIÇOS GERAIS","SPP","Realizando ajustes após emissão de parecer jurídico."]
["03/2014",349,"002706/2014","Aquisição de artigos de higiene e conservação","SECRETARIA","SPP","Verificando a possibilidade de atendimento juntamente com a demanda de 2015."]
["04/2014",350,"002704/2014","Aquisição de material de expediente (papel A4, carta, ofício, etc)","SECRETARIA","CPACS","Consolidar Pesquisas de Preços"]
["02/2014",309,"003830/2014","Instalação e fornecimento de dois mil metros de mangueira tipo lâmpada led de alto brilho","PREFEITURA","REITORIA","Pregão nº 154/2014 finalizado em 24/11/14. Houve empenho (2014NE802433) e pagamento (2014OB809865). "]
["02/2014",348,"002707/2014","Aquisição de artigos de copa e cozinha","PREFEITURA","SPP","Verificando a possibilidade de atendimento juntamente com a demanda de 2015."]
["07/2014","S/Nº","002243/2014","Aquisição de álcool etílico hidratado combustivel e outros","PREFEITURA UNIVERSITÁRIA","ARQUIVO","Buscando informações."]
["108/2014",1389,"007693/2014","Aquisição em caráter de urgência de cartucho para impressora","DIVISÃO DE OBRAS","SEÇÃO DE CONTROLE","Já houve empenho (2014NE802156) e foi entregue no Almoxarifado em 25/11/14."]
["48/2014","S/Nº","006044/2014","Contratação de empresa prestadora de serviço para manutenção do elevador do Pavilhão Central","PREFEITURA UNIVERSITÁRIA","CPACS","Pesquisa de preço."]

{"sheet":"TD 100400","index":11,"n_rows":10,"n_cols":7,"rows_kept":10,"cut":false,"hidden":false,"merged":[[1,2,2,6]]}
[]
[null,null,{"$f":"IFERROR(VLOOKUP(B3,'Banco de dados'!$A$994:$B$1311,2,0),\"\")","v":"COORDENADORIA DE INFORMÁTICA"}]
["Centro de Custo",100400]
[]
["Reqmat","Nº DMSA","Nº do processo","Objeto","Setor requisitante","Localização atual","Situação atual"]
["07/2014",1911,"009727/2014","Pagamento de inscrição  do servidor Sandro Luis Freire no XIV Coloquio Internacional de Gestão Universitária","COTIC","SAPG","Houve empenho (2014NE802154) e pagamento (2014OB809507 e 2014DF802346)."]
["183/2014","S/Nº","010435/2014","Aquisição de softwares administrativos especializados","COORDENADORIA DE INFORMÁTICA","SPP","Enquadramento"]
["184/2014","S/Nº","010436/2014","Serviço de instalação e manutenção de rede elétrica de cabeamento lógico","COORDENADORIA DE INFORMÁTICA","SPP","Pesquisa de preço."]
["117/2014","S/Nº","007100/2014","Contratação de empresa especializada para prestação de apoio técnico ao desenvolvimento de sistemas","COORDENADORIA DE INFORMÁTICA","COINFO","Buscando informações."]
["95/2014","S/Nº","005446/2014","Fornecimento de upgrades de equipamentos existentes de armazenamento de dados","COORDENADORIA DE INFORMÁTICA","ARQUIVO","Buscando informações."]

{"sheet":"TD 100500","index":12,"n_rows":14,"n_cols":7,"rows_kept":14,"cut":false,"hidden":false,"merged":[[1,2,2,6]]}
[]
[null,null,{"$f":"IFERROR(VLOOKUP(B3,'Banco de dados'!$A$994:$B$1311,2,0),\"\")","v":"COORDENADORIA DE DESENVOLVIMENTO DA PRODUÇÃO"}]
["Centro de Custo",100500]
[]
["Reqmat","Nº DMSA","Nº do processo","Objeto","Setor requisitante","Localização atual","Situação atual"]
["01/2014",1073,"005136/2014","Conserto da ordenhadeira mecânica","COORDENADORIA DE PRODUÇÃO ANIMAL","COORDENADORIA ESPECIAL DE PRODUÇÃO INTEGRADA ENSINO, PESQUISA E  EXTENSÃO","Buscando informações."]
["01/2014","S/Nº","000373/2014","Aquisição de vacina contra leptospirose bovina, ovina, caprina e suína frasco de 50ml e outros","COORDENADORIA DE DESENVOLVIMENTO DA PRODUÇÃO","CLOG","Já houve empenho (2014NE800636), pagamentos (2014OB804756 e 2014DF801439) e foi entregue no Almoxarifado em 02/06/14."]
["08/2014",1848,"009266/2014","Aquisição de feno de gramineas cost cross ou tifton 85","COORDENADORIA DE DESENVOLVIMENTO DA PRODUÇÃO","SEÇÃO DE CONTROLE","Já houve empenho (2014NE802106), pagamento (2015OB800187) e foi entregue no Almoxarifado em 23/12/14.\nJá houve empenho (2014NE802086), pagamentos (2015OB800187 e 2015DF800040) e foi entregue no Almoxarifado em 11/12/14."]
["08/2014",763,"003139/2014","Aquisição de milho","COORDENADORIA ESPECIAL DE PROD. INTEGRADA ENSINO, PESQ. EXT.","ARQUIVO","Arquivado porque o material foi atendido através do processo 005817/2012."]
["06/2014",681,"003008/2014","Aquisição de arame farpado com distância entre as farpas de no máximo 125mm","COORDENADORIA DE DESENVOLVIMENTO DA PRODUÇÃO","ARQUIVO","Arquivado porque  houve empenho (2014NE800861) e pagamento (2014OB804762 e 2014DF801441)."]
["05/2014",779,"003190/2014","Aquisição de materiais agrícolas (grupo 30.99)","CEPIEPE","COORDENADORIA ESPECIAL DE PRODUÇÃO INTEGRADA ENSINO, PESQUISA E  EXTENSÃO","Pregão nº 95/2014 finalizado em 29/12/14. O processo está disponível na Coordenadoria Especial de Produção Integrada Ensino, Pesquisa e Extensão para solicitar empenhos."]
["04/2014","S/Nº","001591/2014","Aquisição de semem do reprodutor gir leiteiro casper te kubera, código 11gl070 e outros","COORDENADORIA ESPECIAL DE PROD. INTEGRADA ENSINO, PESQ. EXT.","CLOG","Já houve empenho (2014NE800709), pagamentos (2014OB804696 e 2014DF801420) e foi entregue no Almoxarifado em 16/06/14."]
["02/2014","S/Nº","003661/2014","Aquisição de botijão de gás","COORDENADORIA DE DESENVOLVIMENTO DA PRODUÇÃO","ANEXADO    23083.002205/2013-85","Já houve empenho (2014NE800853), pagamento (2014OB804976 e 2014DF801476) e foi entregue no Almoxarifado em 24/06/14.\nJá houve empenho (2013NE802827), pagamento (2014OB800670 e 2014DF800308) e foi entregue no Almoxarifado em 26/12/13. (Anexado ao 002205/2013)"]
["27/2013","S/Nº","000794/2014","Aquisição de adubo quimico - fórmula n-p-k-14-8 embalados em sacos de 50 kg e outros","COORDENADORIA ESPECIAL DE PROD. INTEGRADA ENSINO, PESQ. EXT.","COORDENADORIA ESPECIAL DE PROD. INTEGRADA ENSINO, PESQ. EXT","Já houve empenho (2014NE801701), pagamentos (2014OB809699 e 2014DF802404) e foi entregue no Almoxarifado em 26/11/14.\nJá houve empenho (2014NE801702), pagamento (2014OB808435) e foi entregue no Almoxarifado em 05/11/14.\nJá houve empenho (2014NE801703), mas o prazo de entrega está vencido e um ofício de cobrança foi emitido à empresa em 29/10/14."]

{"sheet":"TD 100600","index":13,"n_rows":8,"n_cols":7,"rows_kept":8,"cut":false,"hidden":false,"merged":[[1,2,2,6]]}
[]
[null,null,{"$f":"IFERROR(VLOOKUP(B3,'Banco de dados'!$A$994:$B$1311,2,0),\"\")","v":"COORDENADORIA DE PLANEJAMENTO"}]
["Centro de Custo",100600]
[]
["Reqmat","Nº DMSA","Nº do processo","Objeto","Setor requisitante","Localização atual","Situação atual"]
["01/2014",261,"002704/2014","Aquisição de material de expediente (papel A4, carta, ofício, etc)","COORDENADORIA DE PLANEJAMENTO","CPACS","Consolidar Pesquisas de Preços"]
["05/2014",1052,"006016/2014","Aquisição de cartuchos hp, toners e tintas (grupo 30.17A)","COORDENADORIA DE PLANEJAMENTO","DMSA","Buscando informações."]
["04/2014",930,"005733/2014","Aquisição de licença definitiva para uso do pacote Microsoft Office compatível com sistema operacional Windows 8","COORDENADORIA DE PLANEJAMENTO","PRÓ-REITORIA DE PLANEJAMENTO, AVALIAÇÃO E DESENVOLVIMENTO","Buscando informações."]

{"sheet":"TD 110000","index":14,"n_rows":17,"n_cols":7,"rows_kept":17,"cut":false,"hidden":false,"merged":[[1,2,2,6]]}
[]
[null,null,{"$f":"IFERROR(VLOOKUP(B3,'Banco de dados'!$A$994:$B$1311,2,0),\"\")","v":"PRÓ-REITORIA DE ASSUNTOS ADMINISTRATIVOS"}]
["Centro de Custo",110000]
[]
["Reqmat","Nº DMSA","Nº do processo","Objeto","Setor requisitante","Localização atual","Situação atual"]
["11/2014",1768,"008580/2014","Pagamento de inscrição das servidoras Mônica Carneiro de Moraes Inácio  e Regina Maria Van Tol no curso sobre formação e aperfeiçoamento de líderes no serviço público","COORDENAÇÃO DE DESENVOLVIMENTO DE PESSOAS","ARQUIVO","Já houve empenho (2014NE802435), mas o pagamento ainda não foi efetuado."]
["26/2014",323,"002701/2014","Aquisição de café, açúcar, coador e adoçante","PRÓ-REITORIA DE ASSUNTOS ADMINISTRATIVOS","CLOG","Pregão nº 88/2014 finalizado em 03/11/14. Já houve empenho (2014NE802417, 2015NE800302) e pagamento (2015OB800319). O processo está disponível na Seção de Sistema de Registro de Preços para solicitar empenhos."]
["27/2014",322,"002699/2014","Aquisição de material de expediente","PRÓ-REITORIA DE ASSUNTOS ADMINISTRATIVOS","DIREÇÃO DMSA","Verificando a possibilidade de atendimento juntamente com a demanda de 2015."]
["28/2014",321,"002704/2014","Aquisição de material de expediente (papel A4, carta, ofício, etc)","DIVISÃO DE CONCURSOS","CPACS","Consolidar Pesquisas de Preços"]
["29/2014",320,"002706/2014","Aquisição de artigos de higiene e conservação","DIVISÃO DE CONCURSOS","SPP","Verificando a possibilidade de atendimento juntamente com a demanda de 2015."]
["35/2014",1317,"006016/2014","Aquisição de cartuchos hp, toners e tintas (grupo 30.17A)","PROAD - SAPG","DMSA","Buscando informações."]
["40/2014","S/Nº","005618/2014","Aquisição de caixa de arquivo em papelão reforçado padrão medindo 13,5 x 24,5 x 36 cm tamanho ofício e outros","SEÇÃO DE ARQUIVO E PROTOCOLO GERAL","ARQUIVO","Arquivado porque  houve empenho (2014NE801694) e pagamento (2014OB809024).\nArquivado porque  houve empenho (2014NE801695) e pagamento (2014OB808455)."]
["45/2014",1909,"009792/2014","Serviços de confecção com fornecimento de 14.000 cintas elásticas para unir processos","PROAD/PROTOCOLO","DRA. IVANIR","Elaboração da minuta de edital."]
["08/2014",1396,"006577/2014","Pagamento de inscrição de servidores no 8º Congresso de secretários das universidades brasileiras - CONSUB","COORDENAÇÃO DE DESENVOLVIMENTO DE PESSOAS","CODEP","Já houve empenho (2014NE801521), mas o pagamento ainda não foi efetuado."]
["04/2014",429,"002704/2014","Aquisição de material de expediente (papel A4, carta, ofício, etc)","SEÇÃO DE ARQUIVO E PROTOCOLO GERAL","CPACS","Consolidar Pesquisas de Preços"]
["07/2014",1209,"005475/2014","Contratação de execução de cursos in company (gestão e fiscalização de contratos para 30 servidores)","COORDENADORIA DE DESENVOLVIMENTO DE PESSOA","ARQUIVO","Já houve empenho (2014NE000356) e pagamento (2014GR800105/2014GR800104)"]
["S/Nº","S/Nº","002827/2014","Aquisição de cartuchos","PRÓ-REITORIA DE ASSUNTOS ADMINISTRATIVOS","SAPG","Já houve empenho (2014NE800771), pagamento (2014OB808377) e foi entregue no Almoxarifado em 15/07/14."]

{"sheet":"TD 110200","index":15,"n_rows":15,"n_cols":7,"rows_kept":15,"cut":false,"hidden":false,"merged":[[1,2,2,6]]}
[]
[null,null,{"$f":"IFERROR(VLOOKUP(B3,'Banco de dados'!$A$994:$B$1311,2,0),\"\")","v":"SEÇÃO DE ARQUIVO E PROTOCOLO GERAL"}]
["Centro de Custo",110200]
[]
["Reqmat","Nº DMSA","Nº do processo","Objeto","Setor requisitante","Localização atual","Situação atual"]
["20/2014",924,"003931/2014","Serviço de confecção de 50.000 capas de processos personalizadas com brasão da república","SEÇÃO DE ARQUIVO E PROTOCOLO GERAL","ARQUIVO","Já houve empenho (2014NE801255) e pagamento (2014OB805933)"]
["21/2014",923,"003930/2014","Conserto de seis relógios-datador-numerador","SEÇÃO DE ARQUIVO E PROTOCOLO GERAL","ARQUIVO","Já houve empenho (2014NE801176) e pagamento (2014OB807422)."]
["22/2014",925,"003929/2014","Aquisição de unidade de fita com carratel metálica para relógio-numerador-datador","SEÇÃO DE ARQUIVO E PROTOCOLO GERAL","ARQUIVO","Já houve empenho (2014NE800941) e pagamento (2014OB804518)"]
["45/2014",1520,"007820/2014","Aquisição de grampeador rapid 90","SECAO DE ARQUIVO E PROTOCOLO GERAL","SEÇÃO DE CONTROLE","Já houve empenho (2014NE802275) e a data prevista de entrega é até 01/01/15. "]
["46/2014",1629,"008000/2014","Aquisição de furadeira elétrica de 2 furos","SECAO DE ARQUIVO E PROTOCOLO GERAL","CLOG","(vazio)"]
["47/2014",1630,"008002/2014","Aquisição de impressora matricial Okidata","SECAO DE ARQUIVO E PROTOCOLO GERAL","NÚCLEO DE GOVERNANÇA DA TEC. DA INF. E COMUNICAÇÃO","Buscando informações."]
["50/2014",1720,"008155/2014","Aquisição de colchete de aço metálico nº 7 ace caixa com 72 unidades e outros","SEÇÃO DE ARQUIVO E PROTOCOLO GERAL","ALMOXARIFADO","Já houve empenho (2014NE802303), pagamento (2014OB809816) e foi entregue no Almoxarifado em 10/12/14."]
["06/2014",422,"002701/2014","Aquisição de café, açúcar, coador e adoçante","SEÇÃO DE ARQUIVO E PROTOCOLO GERAL","CLOG","Pregão nº 88/2014 finalizado em 03/11/14. Já houve empenho (2014NE802417, 2015NE800302) e pagamento (2015OB800319). O processo está disponível na Seção de Sistema de Registro de Preços para solicitar empenhos."]
["07/2014",421,"002707/2014","Aquisição de artigos de copa e cozinha","SEÇÃO DE ARQUIVO E PROTOCOLO GERAL","SPP","Verificando a possibilidade de atendimento juntamente com a demanda de 2015."]
["48/2014","S/Nº","007877/2014","Pagamento de inscrição do servidor Carlos Alberto Gomes da Rocha no curso de como resumir, indexar e classificar documentos","SEÇÃO DE ARQUIVO E PROTOCOLO GERAL","ARQUIVO","Já houve empenho (2014NE801894), mas o pagamento ainda não foi efetuado."]

{"sheet":"TD 110300","index":16,"n_rows":12,"n_cols":7,"rows_kept":12,"cut":false,"hidden":false,"merged":[[1,2,2,6]]}
[]
[null,null,{"$f":"IFERROR(VLOOKUP(B3,'Banco de dados'!$A$994:$B$1311,2,0),\"\")","v":"DEPARTAMENTO DE PESSOAL"}]
["Centro de Custo",110300]
[]
["Reqmat","Nº DMSA","Nº do processo","Objeto","Setor requisitante","Localização atual","Situação atual"]
["101/2014",575,"002699/2014","Aquisição de material de expediente","DEPARTAMENTO DE PESSOAL","DIREÇÃO DMSA","Verificando a possibilidade de atendimento juntamente com a demanda de 2015."]
["102/2014",56,"002701/2014","Aquisição de café, açúcar, coador e adoçante","DEPARTAMENTO DE PESSOAL","CLOG","Pregão nº 88/2014 finalizado em 03/11/14. Já houve empenho (2014NE802417, 2015NE800302) e pagamento (2015OB800319). O processo está disponível na Seção de Sistema de Registro de Preços para solicitar empenhos."]
["103/2014",58,"002704/2014","Aquisição de material de expediente (papel A4, carta, ofício, etc)","SECRETARIA ADMINISTRATIVA","CPACS","Consolidar Pesquisas de Preços"]
["104/2014",55,"002706/2014","Aquisição de artigos de higiene e conservação","SECRETARIA DO DEPARTAMENTO DE PESSOAL","SPP","Verificando a possibilidade de atendimento juntamente com a demanda de 2015."]
["277/2014",1221,"006343/2014","Aquisição de materiais de expediente e pasta vetro-laterial (grupos 30.16B e 30.16)","SECRETARIA","CPACS","Consolidar Pesquisas de Preços"]
["237/2014",1421,"007037/2014","Conserto e manutenção de impressora Xerox PHASER 6180","SECRETARIA ADMINISTRATIVA","ARQUIVO","Arquivado porque o Departamento de Pessoal informou não haver mais interesse em consertar a impressora, pois não há mais peça no mercado."]
["329/2014",1392,"003666/2014","Aquisição de cartuchos de tinta","SECRETARIA","SPP","Pesquisa de preço."]

{"sheet":"TD 120000","index":17,"n_rows":20,"n_cols":7,"rows_kept":20,"cut":false,"hidden":false,"merged":[[1,2,2,6]]}
[]
[null,null,{"$f":"IFERROR(VLOOKUP(B3,'Banco de dados'!$A$994:$B$1311,2,0),\"\")","v":"PRÓ-REITORIA DE ASSUNTOS FINANCEIROS"}]
["Centro de Custo",120000]
[]
["Reqmat","Nº DMSA","Nº do processo","Objeto","Setor requisitante","Localização atual","Situação atual"]
["13/2014","S/Nº","011372/2014","Abertura de processo de concessão de espaço - Reprografia no Pavilhão Central","SETOR DE PONTOS COMERCIAIS","DR. PAULINO","Emissão de parecer Jurídico"]
["16/2014","S/Nº","011373/2014","Abertura de processo de concessão de espaço - Reprografia no ICE/PQ","SETOR DE PONTOS COMERCIAIS","DR. PAULINO","Emissão de parecer Jurídico"]
["17/2014","S/Nº","011374/2014","Abertura de processo de concessão de espaço - Reprografia IV","SETOR DE PONTOS COMERCIAIS","DRA. IVANI","Emissão de parecer Jurídico"]
["18/2014","S/Nº","011375/2014","Abertura de processo de concessão de espaço - Reprografia no Instituto de Educação","SETOR DE PONTOS COMERCIAIS","DRA. IVANI","Emissão de parecer Jurídico"]
["19/2014","S/Nº","011376/2014","Abertura de processo de concessão de espaço - Venda de livros no Instituto de Educação","SETOR DE PONTOS COMERCIAIS","DRA. JAQUELINE","Elaboração da minuta de edital."]
["35/2014","S/Nº","004540/2014","Licitação de um trailer móvel para oferecer lanches no Instituto de Florestas","SETOR DE CANTINAS","SETOR CONTROLE CANTINA PONTO COM. E ESPAÇO DE DIVULGAÇÃO","Emissão de parecer técnico."]
["36/2014","S/Nº","004541/2014","Licitação de um trailer móvel para oferecer serviços de lanches no Instituto Multidisciplinar","SETOR DE CANTINAS","COMISSÃO DE LICITAÇÃO","Elaboração da minuta de edital."]
["39/2014","S/Nº","004550/2014","Licitação de um trailer móvel - Deverá oferecer o serviço de lanches no Pavilhão de Aulas Teóricas Campus Seropédica","SETOR DE PONTOS COMERCIAIS","SETOR CONTROLE CANTINA PONTO COM. E ESPACO DE DIVULGACAO","Emissão de parecer técnico."]
["80/2014","S/Nº","008931/2014","Licitação para obra de reforma do prédio da cantina do IV","PRÓ-REITORIA DE ASSUNTOS FINANCEIROS","PREFEITURA UNIVERSITÁRIA","Houve empenho (2015NE800190) e está em fase de assinatura do contrato para início da prestação dos serviços."]
["81/2014","S/Nº","008932/2014","Licitação para obra de reforma da cantina do Pavilhão Central","SETOR DE PONTOS COMERCIAIS","SEC. ADM. DO DEPTO DE CONTABILIDADE E FINANÇAS","Elaboração da minuta de edital."]
["01/2014",1485,"007549/2014","Aquisição de cadeiras ergométricas","SECRETARIA DA PRÓ-REITORIA DE ASSUNTOS FINANCEIROS","CLOG","Já houve empenho (2014NE802194) e a data prevista de entrega é até 23/12/14."]
["01/2014","S/Nº","000795/2014","Contratação emergencial de empresa prestadora de serviços continuados de limpeza, conservação e higienização para a UFRRJ","PRÓ-REITORIA DE ASSUNTOS FINANCEIROS","SEC. ADM. DO DECANATO DE ASSUNTOS FINANCEIROS","O processo está na PROAF e deverá seguir para arquivamento."]
["03/2014",1468,"001009/2014","Prestação de serviços continuados de limpeza, conservação e higienização nas dependências da UFRRJ, Campus Seropédica/RJ","PRÓ-REITORIA DE ASSUNTOS FINANCEIROS","DIVISÃO DE ADMINISTRAÇÃO FINANCEIRA","Repactuação do contrato."]
["02/2014","S/Nº","002050/2014","Solicitação de licitação do restautante e lanchonete do ICHS","PRÓ-REITORIA DE ASSUNTOS FINANCEIROS","SEC. ADM. DO DECANATO DE ASSUNTOS FINANCEIROS","Emissão de parecer técnico."]
["31/2014","S/Nº","004677/2014","Contratação da empresa gerenciadora para apoio técnico e fiscal das obras de construcao e reforma dos prédios nos Campis","PREFEITURA UNIVERSITÁRIA","SEC. ADM. DO DECANATO DE ASSUNTOS FINANCEIROS","Buscando informações."]

{"sheet":"TD 120100","index":18,"n_rows":10,"n_cols":7,"rows_kept":10,"cut":false,"hidden":false,"merged":[[1,2,2,6]]}
[]
[null,null,{"$f":"IFERROR(VLOOKUP(B3,'Banco de dados'!$A$994:$B$1311,2,0),\"\")","v":"DEPARTAMENTO DE CONTABILIDADE E FINANÇAS"}]
["Centro de Custo",120100]
[]
["Reqmat","Nº DMSA","Nº do processo","Objeto","Setor requisitante","Localização atual","Situação atual"]
["01/2014",949,"005867/2014","Aquisição de aparelhos e utensílios domésticos (grupo 52.12)","DEPARTAMENTO DE CONTABILIDADE E FINANÇAS","SPP","Realizando ajustes após emissão de parecer jurídico."]
["06/2014","S/Nº","004724/2014","Aquisição de quadro de distribuição de sobrepor com barramento 1004 para 28 disjuntores din+geral e outros","DEPARTAMENTO DE CONTABILIDADE E FINANÇAS","SEÇÃO DE CONTROLE","Buscando informações."]
["03/2014",947,"005734/2014","Aquisição de fita nylon para impressora matricial, cor da tinta da fita preto","DEPARTAMENTO DE CONTABILIDADE E FINANÇAS","ANEXADO    23083.006016/2014-62","Buscando informações (anexado ao 006016/2014)."]
["02/2014","S/Nº","006046/2014","Aquisição de itens do grupo 30.11 - Material químico (demais setores)","DEPARTAMENTO DE CONTABILIDADE E FINANÇAS","CADMIN","Buscando informações."]
["S/Nº","S/Nº","002827/2014","Aquisição de cartuchos","DEPARTAMENTO DE CONTABILIDADE E FINANÇAS","SAPG","Já houve empenho (2014NE800771), pagamento (2014OB808377) e foi entregue no Almoxarifado em 15/07/14."]

{"sheet":"TD 120200","index":19,"n_rows":39,"n_cols":7,"rows_kept":39,"cut":false,"hidden":false,"merged":[[1,2,2,6]]}
[]
[null,null,{"$f":"IFERROR(VLOOKUP(B3,'Banco de dados'!$A$994:$B$1311,2,0),\"\")","v":"DEPARTAMENTO DE MATERIAL E SERVIÇOS AUXILIARES"}]
["Centro de Custo",120200]
[]
["Reqmat","Nº DMSA","Nº do processo","Objeto","Setor requisitante","Localização atual","Situação atual"]
["15/2014",1146,"005219/2014","Pagamento de inscrição dos servidores Luan Gonçalves e Sandro Luis no XXIII Curso sobre contratação de bens e serviços de TI ","ASSESSORIA TÉCNICA DO DMSA","ARQUIVO","Desarquivado pela CODEP para realizar o relatório anual de cursos  do Governo Federal e em breve será novamente arquivado.\nArquivado porque  houve empenho (2014NE801508) e pagamento (2014OB807625 e 2014DR800065)."]
["18/2014",1470,"007545/2014","Pagamento de inscrição do curso XI Semana de Administração Orçamentária Financeira e de Contratações Públicas dos servidores Marcio Bastos e Luan Lima","DEPARTAMENTO DE MATERIAL E SERVIÇOS AUXILIARES","SCD","Buscando informações."]
["19/2014","S/Nº","001017/2014","Aquisicao de sabonete líquido, aspecto fisico líquido perfumado, aplicação saboneteira para sabonetes líquidos etc","DEPARTAMENTO DE MATERIAL E SERVIÇOS AUXILIARES","ARQUIVO","Arquivado porque o processo 000665/2012 foi concluído e contempla esse item."]
["20/2014","S/Nº","001018/2014","Papel higiênico, material celulose virgem, comprimento 30m, largura 10cm, tipo picotado etc","DEPARTAMENTO DE MATERIAL E SERVIÇOS AUXILIARES","ARQUIVO","Arquivado porque o pregão referente a aquisição de papel higiênico foi homologado em 10/02/2014, sendo assim já existe uma ata de registro de preços vigente para futuras aquisições. Além disso, o valor do papel higiênico em nossa ata é mais vantajoso para Administração Pública."]
["21/2014","S/Nº","001019/2014","Aquisição de toalha de papel, tipo folha 3 dobras, comprimento 23cm, largura 22cm,cor branca etc","DEPARTAMENTO DE MATERIAL E SERVIÇOS AUXILIARES","ARQUIVO","Arquivado porque o processo 000665/2012 foi concluído e contempla esse item."]
["24/2014",1776,"001368/2014","Pagamento de inscrição no curso: Contratação direta - dispensa, inexigibilidade e SRP (Denis dos Reis Carvalho)","SEÇÃO DE COMPRAS DIRETAS","ARQUIVO","O curso foi cancelado e o outro curso solicitado não chegou a ser empenhado por não ter sido feito em tempo hábil. Empenho cancelado 2014IN00008"]
["25/2014",1861,"009289/2014","Assinatura anual banco de preços, sistema inteligente de pesquisas baseado em resultados de licitações adjudicadas e homologadas","DEPARTAMENTO DE MATERIAL E SERVIÇOS AUXILIARES","DIREÇÃO DMSA","O empenho foi emitido (2014NE802195) e a empresa já está prestando os serviços."]
["26/2014","S/Nº","001368/2014","Pagamento de inscrição no curso: Contratação direta - dispensa, inexigibilidade e SRP (Denis dos Reis Carvalho)","SEÇÃO DE COMPRAS DIRETAS","ARQUIVO","Buscando informações."]
["27/2014",1881,"009331/2014","Aquisição de papel A4","DEPARTAMENTO DE MATERIAL E SERVIÇOS AUXILIARES","CLOG","Já houve empenhos (2014NE802285, 2014NE802289, 2014NE802485, 2014NE802284, 2014NE802287, 2014NE802483, 2014NE802528 e 2014NE802590) e a data prevista de entrega é até 16/01/15.\n\nJá houve empenhos (2014NE802173, 2014NE802175, 2014NE802176, 2014NE802177, 2014NE802188, 2014NE802189, 2014NE802190 e 2014NE802191) e foram entregues no Almoxarifado em 04/12/14.\n\nJá houve empenhos (2014NE802174 e 2014NE802193) e foram entregues no Almoxarifado em 10/12/14."]
["28/2014",1956,"010332/2014","Aquisição de copos plásticos","DIRETORIA","SEÇÃO DE CONTROLE","Já houve empenho (2014NE802304) e a data prevista de entrega é até 27/12/14. Já houve empenho (2014NE802305) e a entrega foi efetuada no Almoxarifado em 18/12/14."]
["01/2014",100,"001811/2014","Contratação de empresa brasileira de comunicação EBC, para publicação de atos administrativos realizados pelo DMSA","COORDENAÇÃO DE PLANEJAMENTO E ACOMPANHAMENTO DE COMPRAS","SPP","O empenho foi emitido (2014NE800993) e a empresa está prestando o serviço."]
["01/2014","S/Nº","003803/2014","Aquisição de materiais para manutenção de bens imóveis (IRP)","DEPARTAMENTO DE MATERIAL E SERVIÇOS AUXILIARES","SEÇÃO DE CONTROLE","Vai ser encaminhado para o gestor da ata."]
["01/2014","S/Nº","002260/2014","Renovação pelo período de 12 (doze) meses da revista O Pregoeiro, com notícias, informções técnicas","DEPARTAMENTO DE MATERIAL E SERVIÇOS AUXILIARES","SAPG","Buscando informações."]
["01/2014",1896,"009504/2014","Contratação de serviços de engenharia para elaboração de projeto básico e executivo de reforma das atuais dependências do Almoxarifado Central","ALMOXARIFADO","ARQUIVO","O processo será cancelado e arquivado porque existe outro em tramitação."]
["01/2014",1330,"006344/2014","Serviço de manutenção de equipamento de sistema de segurança do Almoxarifado Central","ALMOXARIFADO CENTRAL","SEC. ADM. DO DEPTO DE CONTABILIDADE E FINANÇAS","Pregão nº 24/2015 (antigo nº 119/2014) com provável abertura em 09/03/15."]
["08/2014",418,"002372/2014","Aquisição de cartuchos","DEPARTAMENTO DE MATERIAL E SERVICOS AUXILIARES","CLOG","Já houve empenho (2014NE800742, 2014NE800743, 2014NE800744, 2014NE800741) e pagamento (2014OB804858, 2014OB804667, 2014OB804951)."]
["06/2014","S/Nº","006035/2014","Manifestacao de interesse em processo de srp (contratação de serviço de fornecimento de alimentação) - IRP","DEPARTAMENTO DE MATERIAL E SERVIÇOS AUXILIARES","DIVISÃO DE ADMINISTRAÇÃO FINANCEIRA","O processo já está disponível na Pró-reitoria de Extensão para solicitar empenhos."]
["05/2014",270,"002706/2014","Aquisição de artigos de higiene e conservação","SEÇÃO DE CONTROLE / ALMOXARIFADO CENTRAL / SETOR DE COBRANÇAS","SPP","Verificando a possibilidade de atendimento juntamente com a demanda de 2015."]
["05/2014",1078,"005135/2014","Aquisição de plaqueta laminada de patrimônio (grupo 30.59)","CLOG / ALMOXARIFADO CENTRAL","CLOG","Pregão nº 114/2014 finalizado em 06/11/14. Já houve empenho (2014NE802206), mas o prazo de entrega está vencido e um ofício de cobrança foi emitido à empresa em 16/12/14"]
["05/2014","S/Nº","004585/2014","Aquisição futura de vidraria","DIRETORIA DO DEPARTAMENTO DE MATERIAL E SERVIÇOS AUXILIARES","SSRP","Aguardando o pregão ser realizado."]
["03/2014",268,"002699/2014","Aquisição de material de expediente","DEPARTAMENTO DE MATERIAL E SERVIÇOS AUXILIARES","DIREÇÃO DMSA","Verificando a possibilidade de atendimento juntamente com a demanda de 2015."]
["03/2014","S/Nº","004584/2014","Aquisição de material de expediente","DIRETORIA DO DEPARTAMENTO DE MATERIAL E SERVIÇOS AUXILIARES","SSRP","Já houve empenho (2014NE802311), pagamento (2014OB809822) e foi entregue no Almoxarifado em 02/12/14.\nJá houve empenho (2014NE801925), pagamento (2014OB809821) e foi entregue no Almoxarifado em 05/12/14."]
["04/2014",269,"002707/2014","Aquisição de artigos de copa e cozinha","DEPARTAMENTO DE MATERIAL E SERVIÇOS AUXILIARES","SPP","Verificando a possibilidade de atendimento juntamente com a demanda de 2015."]
["02/2014",1339,"006398/2014","Contratação de serviço de manutenção de sistema de segurança eletrônico","ALMOXARIFADO CENTRAL","DIVISÃO DE ADMINISTRAÇÃO FINANCEIRA","Já houve empenho (2014NE801962) e a previsão de início da prestação do serviço é até 06/02/15."]
["02/2014",267,"002701/2014","Aquisição de café, açúcar, coador e adoçante","DEPARTAMENTO DE MATERIAL E SERVIÇOS AUXILIARES","CLOG","Pregão nº 88/2014 finalizado em 03/11/14. Já houve empenho (2014NE802417, 2015NE800302) e pagamento (2015OB800319). O processo está disponível na Seção de Sistema de Registro de Preços para solicitar empenhos."]
["02/2014","S/Nº","002445/2014","Contrataçao de empresa para efetuar publicações de avisos de editais de licitação (publicaçao no Jornal O Dia)","DEPARTAMENTO DE MATERIAL E SERVIÇOS AUXILIARES","ARQUIVO","Arquivado porque  houve empenho (2014NE800481) e pagamentos (2014OB802341, 2014OB803274, 2014OB804979 e 2014OB805941)."]
["02/2014","S/Nº","003804/2014","Aquisição de materiais elétrico e eletrônico","DEPARTAMENTO DE MATERIAL E SERVIÇOS AUXILIARES","DIREÇÃO DMSA","O processo foi encaminhado da SSRP à SAPG para abrir anexo em 03/09/14 e desde então não retornou."]
["02/2014","S/Nº","002261/2014","Renovação da revista Licicon e contratação dos serviços de consultoria em licitações e contratos administrativos","DEPARTAMENTO DE MATERIAL E SERVIÇOS AUXILIARES","SCD","Buscando informações."]
["09/2014",419,"002371/2014","Aquisição de cartucho de tinta impressora HP ref. C9388-A","DEPARTAMENTO DE MATERIAL E SERVICOS AUXILIARES","CLOG","Buscando informações."]
["S/Nº","S/Nº","006033/2014","Aquisição de materiais para manutenção de bens móveis - ferragens em geral e afins (IRP)","DEPARTAMENTO DE MATERIAL E SERVIÇOS AUXILIARES","SSRP","O pregão do órgão gerenciador ainda não foi realizado."]
["S/Nº","S/Nº","008655/2014","Aquisição de materiais para manutenção de bens imóveis (material hidráulico e afins) - IRP","DEPARTAMENTO DE MATERIAL E SERVIÇOS AUXILIARES","CPACS","Aguardando a ata assinada pelo órgão gerenciadorda IRP."]
["S/Nº","S/Nº","009153/2014","Aquisição de material de higiene e limpeza (IRP)","DEPARTAMENTO DE MATERIAL E SERVIÇOS AUXILIARES","SSRP","Aguardando a ata assinada pelo órgão gerenciadorda IRP."]
["12/2013",78,"002078/2013","Aquisição de material do grupo 30.17 (adaptador 2P+T do padrão novo para o padrão antigo e etc.)","DEPARTAMENTO DE MATERIAL E SERVIÇOS AUXILIARES","DIREÇÃO DMSA","Verificando a possibilidade de atendimento juntamente com a demanda de 2015."]
["120/2014","S/Nº","006268/2014","Contratação de empresa para desenvolvimento de software, de acordo com reqmat n°02 - Pró-reitoria de Extensão","PRÓ-REITORIA DE EXTENSÃO","COORDENADORIA DE TECNOLOGIA DA INFORMAÇÃO E COMUNICAÇÃO","Buscando informações."]

{"sheet":"TD 120210","index":20,"n_rows":6,"n_cols":7,"rows_kept":6,"cut":false,"hidden":false,"merged":[[1,2,2,6]]}
[]
[null,null,{"$f":"IFERROR(VLOOKUP(B3,'Banco de dados'!$A$994:$B$1311,2,0),\"\")","v":"ESTOQUE"}]
["Centro de Custo",120210]
[]
["Reqmat","Nº DMSA","Nº do processo","Objeto","Setor requisitante","Localização atual","Situação atual"]
["S/Nº","S/Nº","002827/2014","Aquisição de cartuchos","ESTOQUE","SAPG","Já houve empenho (2014NE800771), pagamento (2014OB808377) e foi entregue no Almoxarifado em 15/07/14."]

{"sheet":"TD 120400","index":21,"n_rows":9,"n_cols":7,"rows_kept":9,"cut":false,"hidden":false,"merged":[[1,2,2,6]]}
[]
[null,null,{"$f":"IFERROR(VLOOKUP(B3,'Banco de dados'!$A$994:$B$1311,2,0),\"\")","v":"LAVANDERIA"}]
["Centro de Custo",120400]
[]
["Reqmat","Nº DMSA","Nº do processo","Objeto","Setor requisitante","Localização atual","Situação atual"]
["01/2014",251,"002701/2014","Aquisição de café, açúcar, coador e adoçante","LAVANDERIA","CLOG","Pregão nº 88/2014 finalizado em 03/11/14. Já houve empenho (2014NE802417, 2015NE800302) e pagamento (2015OB800319). O processo está disponível na Seção de Sistema de Registro de Preços para solicitar empenhos."]
["03/2014",253,"002706/2014","Aquisição de artigos de higiene e conservação","LAVANDERIA","SPP","Verificando a possibilidade de atendimento juntamente com a demanda de 2015."]
["04/2014",252,"002707/2014","Aquisição de artigos de copa e cozinha","LAVANDERIA","SPP","Verificando a possibilidade de atendimento juntamente com a demanda de 2015."]
["02/2014",254,"002699/2014","Aquisição de material de expediente","LAVANDERIA","DIREÇÃO DMSA","Verificando a possibilidade de atendimento juntamente com a demanda de 2015."]

{"sheet":"TD 130000","index":22,"n_rows":21,"n_cols":7,"rows_kept":21,"cut":false,"hidden":false,"merged":[[1,2,2,6]]}
[]
[null,null,{"$f":"IFERROR(VLOOKUP(B3,'Banco de dados'!$A$994:$B$1311,2,0),\"\")","v":"PRÓ-REITORIA DE ASSUNTOS ESTUDANTIS"}]
["Centro de Custo",130000]
[]
["Reqmat","Nº DMSA","Nº do processo","Objeto","Setor requisitante","Localização atual","Situação atual"]
["10/2014",926,"006021/2014","Aquisição de equipamentos agrícolas (grupo 52.40)","PRÓ-REITORIA DE ASSUNTOS ESTUDANTIS","ASTEC","Pregão 34/2015 - Elaboração da minuta de edital."]
["13/2014",1054,"005968/2014","Aquisição de mobiliário em geral (grupo 52.42)","SECRETARIA","DIREÇÃO DMSA","Verificando a possibilidade de atendimento juntamente com a demanda de 2015."]
["13/2014",1318,"006084/2014","Aquisição de mobiliário em geral (grupo 52.42) - Mesa de refeitório para 6 pessoas (carona)","PRÓ-REITORIA DE ASSUNTOS ESTUDANTIS","DIREÇÃO DMSA","Buscando informações."]
["13/2014",1906,"009790/2014","Aquisição de mesas de reunião ovalada","PRÓ-REITORIA DE ASSUNTOS ESTUDANTIS","SPP","Já houve empenho (2014NE802293), anulação parcial do empenho (2014NE802390) e a data prevista de entrega é até 15/03/15.\nJá houve empenho (2014NE802296) e a data prevista de entrega é até 15/03/15.\nJá houve empenho (2014NE802301) e a data prevista de entrega é até 15/03/15.\nA SSRP está verificando se existem caronas para atendimento das longarinas e posterior tomada de decisão entre a Direção do DMSA e PROAEST."]
["13/2014",1906,"010455/2014","Aquisição de mesa, mesa de reunião ovalada - medindo: 2400 x 1100 x 740mm, cadeiras e outros (carona)","PRÓ-REITORIA DE ASSUNTOS ESTUDANTIS","DIVISÃO DE ADMINISTRAÇÃO FINANCEIRA","As mesas foram atendidas através do processo 009790/2014. Já houve empenho (2014NE802293), anulação parcial do empenho (2014NE802390) e a data prevista de entrega é até 15/03/15.\nJá houve empenho (2014NE802296) e a data prevista de entrega é até 15/03/15.\nAs cadeiras não foram empenhadas porque a empresa apresentou irregularidades no SICAF.\nEnquadramento"]
["14/2014",1081,"006016/2014","Aquisição de cartuchos hp, toners e tintas (grupo 30.17A)","SECRETARIA","DMSA","Buscando informações."]
["15/2014",1287,"006008/2014","Aquisição de material hidráulico (grupo 30.24)","SETOR DE RESIDÊNCIA ESTUDANTIL","ASTEC","Elaboração da minuta de edital."]
["17/2014",1749,"009677/2014","Aquisição de aparelho auditivo programado","PRÓ-REITORIA DE ASSUNTOS ESTUDANTIS","SPP","Pesquisa de preço."]
["01/2014",1062,"006045/2014","Aquisição de material de construção (grupo 30.24A)","SETOR DE RESIDÊNCIA ESTUDANTIL","PREGÃO","Pregão 30/2015 agendado para abertura 27/03/2015."]
["01/2014",352,"002701/2014","Aquisição de café, açúcar, coador e adoçante","PRÓ-REITORIA DE ASSUNTOS ESTUDANTIS","CLOG","Pregão nº 88/2014 finalizado em 03/11/14. Já houve empenho (2014NE802417, 2015NE800302) e pagamento (2015OB800319). O processo está disponível na Seção de Sistema de Registro de Preços para solicitar empenhos."]
["06/2014",351,"002707/2014","Aquisição de artigos de copa e cozinha","PRÓ-REITORIA DE ASSUNTOS ESTUDANTIS","SPP","Verificando a possibilidade de atendimento juntamente com a demanda de 2015."]
["05/2014",354,"002699/2014","Aquisição de material de expediente","PRÓ-REITORIA DE ASSUNTOS ESTUDANTIS","DIREÇÃO DMSA","Verificando a possibilidade de atendimento juntamente com a demanda de 2015."]
["03/2014",355,"002704/2014","Aquisição de material de expediente (papel A4, carta, ofício, etc)","SECRETARIA","CPACS","Consolidar Pesquisas de Preços"]
["04/2014",353,"002706/2014","Aquisição de artigos de higiene e conservação","SECRETARIA","SPP","Verificando a possibilidade de atendimento juntamente com a demanda de 2015."]
["02/2014",356,"002703/2014","Aquisição de material de artes gráficas e desenho","PRÓ-REITORIA DE ASSUNTOS ESTUDANTIS","SSRP","Será atendido junto com a Demanda de 2015 - equipe do projeto"]
["09/2014",891,"006025/2014","Aquisição de dois martelos perfuradores","PRÓ-REITORIA DE ASSUNTOS ESTUDANTIS","CLOG","Já houve empenho (2014NE802605) e pagamento (2015OB801678)."]

{"sheet":"TD 130100","index":23,"n_rows":21,"n_cols":7,"rows_kept":21,"cut":false,"hidden":false,"merged":[[1,2,2,6]]}
[]
[null,null,{"$f":"IFERROR(VLOOKUP(B3,'Banco de dados'!$A$994:$B$1311,2,0),\"\")","v":"RESTAURANTE UNIVERSITÁRIO - CAMPUS SEROPÉDICA"}]
["Centro de Custo",130100]
[]
["Reqmat","Nº DMSA","Nº do processo","Objeto","Setor requisitante","Localização atual","Situação atual"]
["18/2014",1786,"009040/2014","Aquisição de duas cadeiras de rodas","PROAES","ARQUIVO","Já houve empenho (2014NE802489) e pagamento (2015OB800810)"]
["19/2014",1904,"010411/2014","Cordão para crachá personalizado","PRÓ-REITORIA DE ASSUNTOS ESTUDANTIS","ARQUIVO","Já houve empenho (2014NE802544), mas o prazo de entrega está vencido e a SSRP está realizando a devida cobrança."]
["20/2014",1905,"010410/2014","Confecção de canecas redondas, com capacidade para 400ml","PRÓ-REITORIA DE ASSUNTOS ESTUDANTIS","SEÇÃO DE CONTROLE","Já houve empenho (2014NE802367) e a data prevista de entrega é até 26/12/14. "]
["21/2014",1903,"009774/2014","Aquisição de caldeirão a vapor, para cozinha industrial","RESTAURANTE UNIVERSITÁRIO - CAMPUS SEROPÉDICA","CLOG","Já houve empenho (2014NE802458), mas o prazo de entrega está vencido e um ofício de cobrança foi emitido à empresa em 21/01/15."]
["22/2014",1948,"010243/2014","Contratação de empresa para prestação de serviço no ramo de alimentação","PRÓ-REITORIA DE ASSUNTOS ESTUDANTIS","COORDENAÇÃO DE CONTRATOS E IMPORTAÇÃO","Analisando esclarecimentos sobre os cargos solicitados na contratação em questão (despachos envolvendo DP, DMSA e PROAEST)."]
["01/2014",34,"001799/2014","Aquisição de material de limpeza para o Restaurante Universitário","RESTAURANTE UNIVERSITÁRIO - CAMPUS SEROPÉDICA","ASTEC","Pregão nº 11/2015 (antigo nº 115/2014) com provável abertura em 10/02/15."]
["01/2014",1487,"007553/2014","Aquisição de materiais de consumo para o Restaurante Universitário","RESTAURANTE UNIVERSITÁRIO - CAMPUS SEROPÉDICA","PROAES","Já houve empenho (2014NE802129), mas o prazo de entrega está vencido e um ofício de cobrança foi emitido à empresa em 08/12/14."]
["01/2014",2,"000044/2014","Aquisição de pâo francês","RESTAURANTE UNIVERSITÁRIO - CAMPUS SEROPÉDICA","RESTAURANTE UNIVERSITÁRIO DE SEROPÉDICA","Já houve empenho (2014NE800029) e pagamento (2014OB800840)."]
["06/2014",160,"002393/2014","Aquisição de pães e bolos","RESTAURANTE UNIVERSITÁRIO - CAMPUS SEROPÉDICA","RESTAURANTE UNIVERSITÁRIO DO CAMPUS DE NOVA IGUAÇU","Era o pregão nº 74/2014, porém todos os itens foram cancelados na aceitação da proposta porque os preços foram superiores aos estipulados pela Administração. O novo pregão (nº 160/2014) foi finalizado em 16/12/14. O processo está disponível no Restaurante Universitário do Instituto Multidisciplinar para solicitar empenhos."]
["06/2014",611,"003009/2014","Aquisição de alimentos estocáveis","RESTAURANTE UNIVERSITÁRIO - CAMPUS SEROPÉDICA","PROAES","Pregão nº 153/2014 finalizado em 22/12/14. Já houve empenho (2015NE800218, 2015NE800219, 2015NE800213, 2015NE800214, 2015NE800215, 2015NE800216, 2015NE800217). O processo está disponível no Restaurante Universitário de Seropédica para solicitar empenhos."]
["05/2014","S/Nº","002425/2014","Aquisição de carnes","RESTAURANTE UNIVERSITÁRIO - CAMPUS SEROPÉDICA","DIREÇÃO DMSA","Pregão nº 87/2014 finalizado em 07/11/14. Já houve empenho (2014NE802353, 2014NE802354, 2014NE802355, 2014NE802356, 2014NE802357, 2014NE802358, 2014NE802359, 2014NE802360, 2014NE802361, 2014NE802363) e pagamento (2015OB800183, 2015OB800197). O processo está disponível na Pró-reitoria de Assuntos Estudantis para solicitar empenhos."]
["03/2014","S/Nº","002424/2014","Aquisição de pão de forma, etc","PRÓ-REITORIA DE ASSUNTOS ESTUDANTIS","PROAES","Buscando informações."]
["04/2014","S/Nº","002422/2014","Aquisição de frutas, legumes e verduras","RESTAURANTE UNIVERSITÁRIO - CAMPUS SEROPÉDICA","PROAES","Pregão nº 71/2014 finalizado em 29/07/14. Já houve empenho (2014NE801281, 2014NE801282, 2014NE801283, 2014NE801284, 2014NE801285, 2014NE801511, 2014NE801512, 2014NE801513, 2014NE801514, 2014NE801515, 2014NE801516, 2014NE801517, 2014NE801518, 2014NE801519, 2014NE801520, 2014NE1908, 2014NE801909, 2014NE801910, 2014NE801911, 2014NE801912, 2014NE802220, 2014NE802221, 2014NE802222, 2014NE802223, 2014NE802224, 2014NE802260, 2014NE802261, 2014NE802338, 2014NE802339, 2014NE802340, 2014NE802341, 2014NE802619, 2014NE802633, 2014NE802640, 2014NE802642, 2014NE802644, 2014NE802646, 2014NE801286, 2014NE801287, 2014NE801288, 2014NE801289, 2014NE801290, 2014NE801291, 2014NE801292, 2014NE801522, 2014NE801523, 2014NE801524, 2014NE801525, 2014NE801526, 2014NE801527, 2014NE801528, 2014NE801529, 2014NE801913, 2014NE801914, 2014NE801915, 2014NE801916, 2014NE801917, 2014NE802225, 2014NE802226, 2014NE802227, 2014NE802228, 2014NE802229, 2014NE802262, 2014NE802336, 2014NE802337, 2014NE802342, 2014NE802635, 2014NE802638, 2015NE800292, 2015NE800293, 2015NE800294, 2015NE800295) e pagamento (2014OB808371, 2014OB808637, 2014OB000067, 2014OB808800, 2014OB000069, 2014OB808801, 2014OB809315, 2014OB809697, 2014OB809698, 2014OB809701, 2014OB809824, 2014OB809825, 2014OB809826, 2014OB809827, 2014OB809828, 2014OB809829, 2014OB809838, 2014OB806690, 2014OB806810, 2014OB807480, 2014OB807481, 2014OB808040, 2014OB808344, 2014OB809137, 2015OB800533 ). O processo está disponível na Pró-reitoria de Assuntos Estudantis para solicitar empenhos."]
["02/2014",432,"003145/2014","Aquisição de gás liquefeito de petróleo","RESTAURANTE UNIVERSITÁRIO - CAMPUS SEROPÉDICA","SEC. ADM. DO DEPTO DE CONTABILIDADE E FINANÇAS","Pregão nº 94/2014 finalizado em 06/11/14. O processo está disponível na Pró-reitoria de Assuntos Estudantis para solicitar empenhos."]
["07/2014","S/Nº","002108/2014","Contratação de serviço de alimentação - almoço e jantar, na forma de quentinhas, durante 90 dias","RESTAURANTE UNIVERSITÁRIO - CAMPUS SEROPÉDICA","PROAES","Já houve empenho (2014NE800549), anulação parcial do empenho (2014NE801070) e pagamentos (2014OB803910, 2014OB803530, 2014OB803133, 2014OB802778, 2014OB804203 e 2014OB802607)."]
["30/2013",638,"009166/2014","Aquisição de material de equipamentos de epi","RESTAURANTE UNIVERSITÁRIO - CAMPUS SEROPÉDICA","CLOG","Cotação eletrônica nº 04/2015 finalizada em 04/03/15, mas os preços ofertados estão acima do preço de referência."]

{"sheet":"TD 140000","index":24,"n_rows":14,"n_cols":7,"rows_kept":14,"cut":false,"hidden":false,"merged":[[1,2,2,6]]}
[]
[null,null,{"$f":"IFERROR(VLOOKUP(B3,'Banco de dados'!$A$994:$B$1311,2,0),\"\")","v":"PRÓ-REITORIA DE ENSINO E GRADUAÇÃO"}]
["Centro de Custo",140000]
[]
["Reqmat","Nº DMSA","Nº do processo","Objeto","Setor requisitante","Localização atual","Situação atual"]
["01/2014",228,"002699/2014","Aquisição de material de expediente","PRÓ-REITORIA DE ENSINO E GRADUAÇÃO","DIREÇÃO DMSA","Verificando a possibilidade de atendimento juntamente com a demanda de 2015."]
["08/2014",1735,"003666/2014","Aquisição de cartuchos de tinta","DRA, NAP II, MONITORIA","SPP","Pesquisa de preço."]
["06/2014",1199,"005473/2014","Instalação de 5 suportes para projetores","COORDENAÇÃO DO CURSO DE MATEMÁTICA - CAMPUS SEROPÉDICA","ANEXADO    23083.005324/2014-71","Elaboração da minuta de edital (anexado ao 005324/2014)."]
["05/2014",397,"002703/2014","Aquisição de material de artes gráficas e desenho","PRÓ-REITORIA DE ENSINO E GRADUAÇÃO","SSRP","Será atendido junto com a Demanda de 2015 - equipe do projeto"]
["03/2014",226,"002701/2014","Aquisição de café, açúcar, coador e adoçante","PRÓ-REITORIA DE ENSINO E GRADUAÇÃO","CLOG","Pregão nº 88/2014 finalizado em 03/11/14. Já houve empenho (2014NE802417, 2015NE800302) e pagamento (2015OB800319). O processo está disponível na Seção de Sistema de Registro de Preços para solicitar empenhos."]
["04/2014",225,"002707/2014","Aquisição de artigos de copa e cozinha","PRÓ-REITORIA DE ENSINO E GRADUAÇÃO","SPP","Verificando a possibilidade de atendimento juntamente com a demanda de 2015."]
["02/2014",227,"002706/2014","Aquisição de artigos de higiene e conservação","PROGRAD/DEST/PAT","SPP","Verificando a possibilidade de atendimento juntamente com a demanda de 2015."]
["249/2014",1431,"007142/2014","Pagamento de inscrição dos servidores Gabriel Esteves e Janaina da Silva no 8º Congresso de secretários das universidades brasileiras","PRÓ-REITORIA DE GRADUAÇÃO","ARQUIVO","Desarquivado pela CODEP para realizar o relatório anual de cursos  do Governo Federal e em breve será novamente arquivado.\nArquivado porque  houve empenho (2014NE801509) e pagamento (2014GR800110)."]
["09/2014",1808,"009589/2014","Conserto de trinta de cinco projetores","PRÓ-REITORIA DE ENSINO E GRADUAÇÃO","DIREÇÃO DMSA","Buscando informações."]

{"sheet":"TD 140020","index":25,"n_rows":7,"n_cols":7,"rows_kept":7,"cut":false,"hidden":false,"merged":[[1,2,2,6]]}
[]
[null,null,{"$f":"IFERROR(VLOOKUP(B3,'Banco de dados'!$A$994:$B$1311,2,0),\"\")","v":"PARFOR"}]
["Centro de Custo",140020]
[]
["Reqmat","Nº DMSA","Nº do processo","Objeto","Setor requisitante","Localização atual","Situação atual"]
["07/2014",1938,"010415/2014","Aquisição de cartuchos","PARFOR","CLOG","Já houve empenho (2014NE802307) e a data prevista de entrega é até 04/01/15. "]
["07/2014",1938,"010416/2014","Aquisição de cartucho","PARFOR","CLOG","Já houve empenho (2014NE802280) e foi entregue no Almoxarifado em 16/12/14."]

{"sheet":"TD 140113","index":26,"n_rows":6,"n_cols":7,"rows_kept":6,"cut":false,"hidden":false,"merged":[[1,2,2,6]]}
[]
[null,null,{"$f":"IFERROR(VLOOKUP(B3,'Banco de dados'!$A$994:$B$1311,2,0),\"\")","v":"DIREITO"}]
["Centro de Custo",140113]
[]
["Reqmat","Nº DMSA","Nº do processo","Objeto","Setor requisitante","Localização atual","Situação atual"]
["01/2014",909,"005867/2014","Aquisição de aparelhos e utensílios domésticos (grupo 52.12)","COORDENAÇÃO DE DIREITO - ICHS","SPP","Realizando ajustes após emissão de parecer jurídico."]

{"sheet":"TD 140117","index":27,"n_rows":6,"n_cols":7,"rows_kept":6,"cut":false,"hidden":false,"merged":[[1,2,2,6]]}
[]
[null,null,{"$f":"IFERROR(VLOOKUP(B3,'Banco de dados'!$A$994:$B$1311,2,0),\"\")","v":"ENGENHARIA DE AGRIMENSURA E CARTOGRÁFICA"}]
["Centro de Custo",140117]
[]
["Reqmat","Nº DMSA","Nº do processo","Objeto","Setor requisitante","Localização atual","Situação atual"]
["S/Nº","S/Nº","002827/2014","Aquisição de cartuchos","ENGENHARIA DE AGRIMENSURA E CARTOGRAFICA","SAPG","Já houve empenho (2014NE800771), pagamento (2014OB808377) e foi entregue no Almoxarifado em 15/07/14."]

{"sheet":"TD 140120","index":28,"n_rows":9,"n_cols":7,"rows_kept":9,"cut":false,"hidden":false,"merged":[[1,2,2,6]]}
[]
[null,null,{"$f":"IFERROR(VLOOKUP(B3,'Banco de dados'!$A$994:$B$1311,2,0),\"\")","v":"ENGENHARIA FLORESTAL"}]
["Centro de Custo",140120]
[]
["Reqmat","Nº DMSA","Nº do processo","Objeto","Setor requisitante","Localização atual","Situação atual"]
["01/2014",240,"002699/2014","Aquisição de material de expediente"]
["03/2014",242,"002701/2014","Aquisição de café, açúcar, coador e adoçante","ENGENHARIA FLORESTAL","CLOG","Pregão nº 88/2014 finalizado em 03/11/14. Já houve empenho (2014NE802417, 2015NE800302) e pagamento (2015OB800319). O processo está disponível na Seção de Sistema de Registro de Preços para solicitar empenhos."]
["04/2014",241,"002707/2014","Aquisição de artigos de copa e cozinha","ENGENHARIA FLORESTAL","SPP","Verificando a possibilidade de atendimento juntamente com a demanda de 2015."]
["02/2014",239,"002704/2014","Aquisição de material de expediente (papel A4, carta, ofício, etc)","COORDENAÇÃO DO CURSO DE ENGENHARIA FLORESTAL","CPACS","Consolidar Pesquisas de Preços"]

{"sheet":"TD 140132","index":29,"n_rows":7,"n_cols":7,"rows_kept":7,"cut":false,"hidden":false,"merged":[[1,2,2,6]]}
[]
[null,null,{"$f":"IFERROR(VLOOKUP(B3,'Banco de dados'!$A$994:$B$1311,2,0),\"\")","v":"MEDICINA VETERINÁRIA"}]
["Centro de Custo",140132]
[]
["Reqmat","Nº DMSA","Nº do processo","Objeto","Setor requisitante","Localização atual","Situação atual"]
["74/2014",279,"002699/2014","Aquisição de material de expediente","MEDICINA VETERINÁRIA","DIREÇÃO DMSA","Verificando a possibilidade de atendimento juntamente com a demanda de 2015."]
["75/2014",280,"002704/2014","Aquisição de material de expediente (papel A4, carta, ofício, etc)","MEDICINA VETERINÁRIA","CPACS","Consolidar Pesquisas de Preços"]

{"sheet":"TD 140134","index":30,"n_rows":6,"n_cols":7,"rows_kept":6,"cut":false,"hidden":false,"merged":[[1,2,2,5]]}
[]
[null,null,{"$f":"IFERROR(VLOOKUP(B3,'Banco de dados'!$A$994:$B$1311,2,0),\"\")","v":"PSICOLOGIA"}]
["Centro de Custo",140134]
[]
["Reqmat","Nº DMSA","Nº do processo","Objeto","Setor requisitante","Localização atual","Situação atual"]
["01/2014",278,"002699/2014","Aquisição de material de expediente","PSICOLOGIA","DIREÇÃO DMSA","Verificando a possibilidade de atendimento juntamente com a demanda de 2015."]

{"sheet":"TD 140510","index":31,"n_rows":8,"n_cols":7,"rows_kept":8,"cut":false,"hidden":false,"merged":[[1,2,2,6]]}
[]
[null,null,{"$f":"IFERROR(VLOOKUP(B3,'Banco de dados'!$A$994:$B$1311,2,0),\"\")","v":"CONSELHO ESCOLAR"}]
["Centro de Custo",140510]
[]
["Reqmat","Nº DMSA","Nº do processo","Objeto","Setor requisitante","Localização atual","Situação atual"]
["01/2014",1741,"008307/2014","Serviço de editoração e impressão de livros","CURSO DE EXTENSÃO CONSELHO ESCOLAR","SEC. ADM. DO DEPTO DE CONTABILIDADE E FINANÇAS","Realizando ajustes após emissão de parecer jurídico."]
["01/2014",1742,"008307/2014","Serviço de editoração e impressão de livros","CURSO DE EXTENSÃO CONSELHOS MUNICIPAIS DE EDUCAÇÃO","SEC. ADM. DO DEPTO DE CONTABILIDADE E FINANÇAS","Realizando ajustes após emissão de parecer jurídico."]
["S/Nº","S/Nº","004584/2014","Aquisição de material de expediente (copo descartável)","CONSELHO ESCOLAR","SSRP","Já houve empenho (2014NE801926), pagamento (2014OB809821) e foi entregue no Almoxarifado em 05/12/14."]

{"sheet":"TD 140515","index":32,"n_rows":6,"n_cols":7,"rows_kept":6,"cut":false,"hidden":false,"merged":[[1,2,2,6]]}
[]
[null,null,{"$f":"IFERROR(VLOOKUP(B3,'Banco de dados'!$A$994:$B$1311,2,0),\"\")","v":"ESPECIALIZAÇÃO UNIAPRO"}]
["Centro de Custo",140515]
[]
["Reqmat","Nº DMSA","Nº do processo","Objeto","Setor requisitante","Localização atual","Situação atual"]
["S/Nº","S/Nº","004584/2014","Aquisição de material de expediente","ESPECIALIZAÇÃO UNIAPRO","SSRP","Já houve empenho (2014NE802316), pagamento (2015OB800575) e foi entregue no Almoxarifado em 15/01/15.\nJá houve empenho (2014NE802317), pagamentos (2015OB800306 e 2015DF800166) e foi entregue no Almoxarifado em 05/01/15."]

{"sheet":"TD 140530","index":33,"n_rows":9,"n_cols":7,"rows_kept":9,"cut":false,"hidden":false,"merged":[[1,2,2,6]]}
[]
[null,null,{"$f":"IFERROR(VLOOKUP(B3,'Banco de dados'!$A$994:$B$1311,2,0),\"\")","v":"DOCÊNCIA NA EDUCAÇÃO INFANTIL"}]
["Centro de Custo",140530]
[]
["Reqmat","Nº DMSA","Nº do processo","Objeto","Setor requisitante","Localização atual","Situação atual"]
["01/2014",1644,"008025/2014","Aquisição de livros","DOCÊNCIA NA EDUCAÇÃO INFANTIL","ANEXADO    23083.007599/2014-49","Atualizando a Pesquisa de Preços e atendendo recomendações do Parecer da PROGER (anexado ao 007599/2014)."]
["05/2014",1643,"003666/2014","Aquisição de cartuchos de tinta","INSTITUTO MULTIDISCIPLINAR - CURSO DE PÓS-GRADUAÇÃO \"DOCÊNCIA NA EDUCAÇÃO INFANTIL\"","SPP","Pesquisa de preço."]
["03/2014",1645,"008023/2014","Aquisição de bloco de recados e outros","INSTITUTO MULTIDISCIPLINAR - CURSO DE PÓS-GRADUAÇÃO \"DOCÊNCIA NA EDUCAÇÃO INFANTIL\"","DIREÇÃO DMSA","Buscando informações."]
["07/2014",1486,"007514/2014","Contratação de serviço de coffee break ","CURSO DE PÓS-GRADUAÇÃO \"DOCÊNCIA NA EDUCAÇÃO INFANTIL\"","ARQUIVO","Arquivado porque  houve empenho (2014NE801963 e 2014NE801964) e pagamento (2014OB808318 e 2014OB808318)."]

{"sheet":"TD 150000","index":34,"n_rows":28,"n_cols":7,"rows_kept":28,"cut":false,"hidden":false,"merged":[[1,2,2,6]]}
[]
[null,null,{"$f":"IFERROR(VLOOKUP(B3,'Banco de dados'!$A$994:$B$1311,2,0),\"\")","v":"PRÓ-REITORIA DE EXTENSÃO"}]
["Centro de Custo",150000]
[]
["Reqmat","Nº DMSA","Nº do processo","Objeto","Setor requisitante","Localização atual","Situação atual"]
["127/2014",1043,"005968/2014","Aquisição de mobiliário em geral (grupo 52.42)","DEPARTAMENTO DE LOGÍSTICA E INFRAESTRUTURA","DIREÇÃO DMSA","Verificando a possibilidade de atendimento juntamente com a demanda de 2015."]
["13/2014",450,"002701/2014","Aquisição de café, açúcar, coador e adoçante","PRÓ-REITORIA DE EXTENSÃO","CLOG","Pregão nº 88/2014 finalizado em 03/11/14. Já houve empenho (2014NE802417, 2015NE800302) e pagamento (2015OB800319). O processo está disponível na Seção de Sistema de Registro de Preços para solicitar empenhos."]
["14/2014",451,"002704/2014","Aquisição de material de expediente (papel A4, carta, ofício, etc)","DEPARTAMENTO DE ARTE E CULTURA","CPACS","Consolidar Pesquisas de Preços"]
["15/2014",452,"002707/2014","Aquisição de artigos de copa e cozinha","PRÓ-REITORIA DE EXTENSÃO","SPP","Verificando a possibilidade de atendimento juntamente com a demanda de 2015."]
["16/2014",453,"002706/2014","Aquisição de artigos de higiene e conservação","DEPARTAMENTO DE ARTE E CULTURA","SPP","Verificando a possibilidade de atendimento juntamente com a demanda de 2015."]
["17/2014",454,"002699/2014","Aquisição de material de expediente","PRÓ-REITORIA DE EXTENSÃO","DIREÇÃO DMSA","Verificando a possibilidade de atendimento juntamente com a demanda de 2015."]
["19/2014",455,"002703/2014","Aquisição de material de artes gráficas e desenho","PRÓ-REITORIA DE EXTENSÃO","SSRP","Será atendido junto com a Demanda de 2015 - equipe do projeto"]
["50/2014",232,"002699/2014","Aquisição de material de expediente","PRÓ-REITORIA DE EXTENSÃO","DIREÇÃO DMSA","Verificando a possibilidade de atendimento juntamente com a demanda de 2015."]
["52/2014",236,"002701/2014","Aquisição de café, açúcar, coador e adoçante","PRÓ-REITORIA DE EXTENSÃO","CLOG","Pregão nº 88/2014 finalizado em 03/11/14. Já houve empenho (2014NE802417, 2015NE800302) e pagamento (2015OB800319). O processo está disponível na Seção de Sistema de Registro de Preços para solicitar empenhos."]
["53/2014",233,"002704/2014","Aquisição de material de expediente (papel A4, carta, ofício, etc)","DEPARTAMENTO DE LOGÍSTICA E INFRAESTRUTURA","CPACS","Consolidar Pesquisas de Preços"]
["54/2014",231,"002707/2014","Aquisição de artigos de copa e cozinha","PRÓ-REITORIA DE EXTENSÃO","SPP","Verificando a possibilidade de atendimento juntamente com a demanda de 2015."]
["55/2014",234,"002706/2014","Aquisição de artigos de higiene e conservação","PRÓ-REITORIA DE EXTENSÃO","SPP","Verificando a possibilidade de atendimento juntamente com a demanda de 2015."]
["66/2014",457,"005867/2014","Aquisição de aparelhos e utensílios domésticos (grupo 52.12)","DEPARTAMENTO DE LOGÍSTICA E INFRAESTRUTURA","SPP","Realizando ajustes após emissão de parecer jurídico."]
["69/2014",995,"004586/2014","Contratação de serviços de guardiania de piscinas para atuação do Parque Aquático","PRAÇA DE DESPORTOS","SPP","Pesquisa de preço."]
["145/2014",1419,"006679/2014","Pagamento de inscrição das servidoras Kate Hellen e Ana Carolina no 8º Congresso de Secretários das Universidades Brasileiras","PRÓ-REITORIA DE EXTENSÃO","ARQUIVO","Desarquivado pela CODEP para realizar o relatório anual de cursos  do Governo Federal e em breve será novamente arquivado.\nArquivado porque  houve empenho (2014NE801506) e pagamento (2014GR800127)."]
["01/2014",917,"006022/2014","Aquisição de equipamentos eletro-eletrônicos (grupo 52.33)","DEPARTAMENTO DE LOGÍSTICA E INFRAESTRUTURA","SPP","Pesquisa de preço."]
["01/2014",439,"003655/2014","Aquisição de caneta hidrográfica, etc - artes gráficas e desenho (grupo 30.16A)","PRÓ-REITORIA DE EXTNSÃO ","CPACS","Realizando re-enquadramento e em breve será encaminhado à Direção do DMSA e à PROAF para assinatura."]
["06/2014",1183,"005735/2014","Aquisição de equipamentos industriais - banho Maria, moinho, máquina de costura, fogão, liquidificador e seladora (grupo 52.28)","PRÓ-REITORIA DE EXTENSÃO","ASSESSORIA TECNICA/DMSA","Pesquisa de preço."]
["03/2014",873,"005735/2014","Aquisição de equipamentos industriais - banho Maria, moinho, máquina de costura, fogão, liquidificador e seladora (grupo 52.28)","PRÓ-REITORIA DE EXTENSÃO","ASSESSORIA TECNICA/DMSA","Pesquisa de preço."]
["03/2014",1182,"005735/2014","Aquisição de equipamentos industriais - banho Maria, moinho, máquina de costura, fogão, liquidificador e seladora (grupo 52.28)","PRÓ-REITORIA DE EXTENSÃO","ASSESSORIA TECNICA/DMSA","Pesquisa de preço."]
["87/2014",857,"004526/2014","Fornecimento e instalação de 9 persianas verticais","DEPARTAMENTO DE LOGÍSTICA E INFRAESTRUTURA","PRO-REITORIA DE ASSUNTOS FINANCEIROS","Pregão nº 49/2014 finalizado em 07/11/14. Analisando as insconsistências apontadas pela gestora do contrato (quantitativo e especificações do contrato) para tentar saná-las e em breve o processo será encaminhado à Direação do DMSA. (Anexado ao 5649/2013-72)"]
["02/2014",440,"003657/2014","Material de expediente - Aquisição de alfinete mapa, material aço, material cabeça plástico, formato redondo, etc (grupo 30.16)","PRÓ-REITORIA DE EXTENSÃO","CPACS","Equipe CPACS está verificando a possibilidade de juntar os processos 003657, 006343, 002699, 002704, 006056."]
["115/2014",921,"005725/2014","Aquisição de lâmpadas (grupo 30.29)","DEPARTAMENTO DE LOGÍSTICA E INFRAESTRUTURA","CLOG","Já houve empenho (2014NE801699 e 2014NE801698) e  foi entregue no Almoxarifado em 04/11/14 e 05/11/14."]

{"sheet":"TD 150070","index":35,"n_rows":11,"n_cols":7,"rows_kept":11,"cut":false,"hidden":false,"merged":[[1,2,2,5]]}
[]
[null,null,{"$f":"IFERROR(VLOOKUP(B3,'Banco de dados'!$A$994:$B$1311,2,0),\"\")","v":"PROEXT - OBSERVATÓRIO DE POLÍTICAS DEMOCRÁTICAS DE ACESSO E PERMANÊNCIA NA EDUCAÇÃO SUPERIOR"}]
["Centro de Custo",150070]
[]
["Reqmat","Nº DMSA","Nº do processo","Objeto","Setor requisitante","Localização atual","Situação atual"]
["03/2014","S/Nº","006285/2014","Aquisição de microfone de lapela, sem fio, UHF de controle sintetizado Pll com no mínimo 188 canais selecionáveis","PRÓ-REITORIA DE EXTENSÃO","CLOG","Já houve empenho (2014NE801693), pagamento (2014OB809139) e foi entregue no Almoxarifado em 21/11/14."]
["03/2014",1057,"005199/2014","Aquisição de mídia cartão de memória, pen drive, dimensões 59.7mm x 22.3mm x 9.5 mm","PROEXT - OBSERV POLÍTICAS DE DEMOCRAT DE ACESSO E PERMANÊNCIA EDUC. SUPERIOR","ARQUIVO","Arquivado porque o material foi atendido através do processo 002078/2014."]
["03/2014",1964,"010486/2014","Aquisição de cento e cinquenta pen drives capacidade 32 gb","PROEXT - OBSERV POLÍTICAS DE DEMOCRAT DE ACESSO E PERMANÊNCIA EDUC. SUPERIOR","CLOG","Já houve empenho (2014NE802320) e foi entregue no Almoxarifado em 13/01/15."]
["03/2014",1018,"004813/2014","Aquisição de suítes de escritório, contendo planilha eletrônica, programa de apresentações","PRÓ-REITORIA DE EXTENSÃO","ARQUIVO","Arquivado porque o material foi atendido pelo pregão n°55/2013, processo 004424/2013."]
["04/2014",1020,"004814/2014","Aquisição de tablet de 10,1\" e 7\"","PRÓ-REITORIA DE EXTENSÃO","PRÓ-REITORIA DE PLANEJAMENTO, AVALIAÇÃO E DESENVOLVIMENTO","Enviado à COTIC para atendimento da nova legislação."]
["02/2014",754,"003666/2014","Aquisição de cartuchos de tinta","PROEXT - OBSERVATÓRIO DE POLÍTICAS DEMOCRÁTICAS DE ACESSO E PERMANÊNCIA NA EDUCAÇÃO SUPERIOR","SPP","Pesquisa de preço."]

{"sheet":"TD 150080","index":36,"n_rows":11,"n_cols":7,"rows_kept":11,"cut":false,"hidden":false,"merged":[[1,2,2,5]]}
[]
[null,null,{"$f":"IFERROR(VLOOKUP(B3,'Banco de dados'!$A$994:$B$1311,2,0),\"\")","v":"PROEXT - MÃOS QUE CRIAM - PROJETO DE CAPACITAÇÃO PARA PROMOÇÃO SOCIAL"}]
["Centro de Custo",150080]
[]
["Reqmat","Nº DMSA","Nº do processo","Objeto","Setor requisitante","Localização atual","Situação atual"]
["05/2014",980,"006017/2014","Aquisição de artigos de esporte e recreação (grupo 30.14)","PRÓ-REITORIAS DE EXTENSÃO","SEÇÃO DE CONTROLE","Já houve empenho (2014NE802103), mas o prazo de entrega está vencido e um ofício de cobrança foi emitido à empresa em 09/12/14."]
["03/2014",881,"006359/2014","Aquisição dos itens do grupo 52.40 - Equipamento agrícola (arado,etc)","PRÓ-REITORIA DE EXTENSÃO - PROJETO \"MÃOS QUE CRIAM\"","CLOG","Aguardando dispensa."]
["02/2014",963,"006355/2014","Aquisição dos itens do grupo 52.33 - Equipamentos eletro-eletrônicos","PRÓ-REITORIA DE EXTENSÃO - PROJETO \"MÃOS QUE CRIAM\"","CLOG","Já houve empenho (2014NE801883), pagamento (2014OB808794) e foi entregue no Almoxarifado em 05/11/14.\nJá houve empenho (2014NE801882), pagamento (2014OB808736) e foi entregue no Almoxarifado em 04/11/14."]
["07/2014",1149,"006359/2014","Aquisição dos itens do grupo 52.40 - Equipamento agrícola (arado, etc)","PRÓ-REITORIA DE EXTENSÃO - PROJETO \"MÃOS QUE CRIAM\"","CLOG","(vazio)"]
["07/2014",1059,"003666/2014","Aquisição de cartuchos de tinta","PRÓ-REITORIA DE EXTENSÃO - PROJETO \"MÃOS QUE CRIAM\"","SPP","Pesquisa de preço."]
["S/Nº",776,"003666/2014","Aquisição de cartuchos de tinta","PRÓ-REITORIA DE EXTENSÃO - PROJETO \"MÃOS QUE CRIAM\"","SPP","Pesquisa de preço."]

{"sheet":"TD 150090","index":37,"n_rows":8,"n_cols":7,"rows_kept":8,"cut":false,"hidden":false,"merged":[[1,2,2,5]]}
[]
[null,null,{"$f":"IFERROR(VLOOKUP(B3,'Banco de dados'!$A$994:$B$1311,2,0),\"\")","v":"PROEXT - ESTRATÉGIA DESENVOLVIMENTO CADEIA PRODUTIVA COM ABELHAS"}]
["Centro de Custo",150090]
[]
["Reqmat","Nº DMSA","Nº do processo","Objeto","Setor requisitante","Localização atual","Situação atual"]
["01/2014",230,"003653/2014","Aquisição de detergente líquido, etc","PROEXT - ESTRATÉGIA DESENVOLVIMENTO CADEIA PRODUTIVA COM ABELHAS","ARQUIVO","Arquivado porque os itens 3 e 4, constantes no REQMAT presentes às fls 02 do presente processo já foram solicitados através do Quiosque de Compras, conforme PEDMAT anexado às fls 26. Além disso, a aquisição dos itens 1 e 2 não será mais necessária visto que serão fornecidos pela Pró-Reitoria de Extensão e o Instituto de Zootecnia."]
["05/2014",904,"003666/2014","Aquisição de cartuchos de tinta","PROEXT - ESTRATÉGIA DESENVOLVIMENTO CADEIA PRODUTIVA COM ABELHAS","SPP","Pesquisa de preços."]
["S/Nº",229,"003664/2014","Aquisição de papel A4 e papel A3","PROEXT - ESTRATÉGIA DESENVOLVIMENTO CADEIA PRODUTIVA COM ABELHAS","ARQUIVO","Arquivado porque as solitações foram realizadas pelos Coordenadores através do Quiosque de Compras."]

{"sheet":"TD 150100","index":38,"n_rows":12,"n_cols":7,"rows_kept":12,"cut":false,"hidden":false,"merged":[[1,2,2,6]]}
[]
[null,null,{"$f":"IFERROR(VLOOKUP(B3,'Banco de dados'!$A$994:$B$1311,2,0),\"\")","v":"PRAÇA DE DESPORTOS"}]
["Centro de Custo",150100]
[]
["Reqmat","Nº DMSA","Nº do processo","Objeto","Setor requisitante","Localização atual","Situação atual"]
["131/2014",1841,"008940/2014","Aquisição de marcador de campo","DEPARTAMENTO DE ESPORTES E LAZER","DIREÇÃO DMSA","Buscando informações."]
["129/2014",1818,"009163/2014","Aquisição de cloro granulado","DEPARTAMENTO DE ESPORTES E LAZER-PROEXT","ARQUIVO","Já houve empenho (2014NE802496) e a data prevista de entrega é até 04/01/15. "]
["137/2014","S/Nº","010515/2014","Aquisição de dez bolas de vôlei de areia/praia, etc","PRAÇA DE DESPORTOS","CLOG","Já houve empenho (2014NE802281), pagamentos (2015OB800181 e 2015DF800035) e foi entregue no Almoxarifado em 16/12/14."]
["137/2014",1858,"010414/2014","Aquisição de bola de futsal masculina adulto, oficial para jogos internacionais e outras","DEPARTAMENTO DE ESPORTES E LAZER","CLOG","Já houve empenho (2014NE802299) e foi entregue no Almoxarifado em 21/01/15."]
["137/2014",1858,"010493/2014","Aquisição de bola de futsal masculino adulto, etc","DEPARTAMENTO DE ESPORTES E LAZER","ARQUIVO","Já houve empenho (2014NE802295), pagamento (2015OB800249) e foi entregue no Almoxarifado em 06/01/15."]
["130/2014",1793,"008974/2014","Aquisição de cloro gasoso","DEPARTAMENTO DE ESPORTES E LAZER","SPP","Buscando informações."]
["124/2014",1841,"008940/2014","Aquisição de trator cortador de grama dirigível, roçadeira, reboque para cortador, etc","DEPARTAMENTO DE ESPORTES E LAZER","DIREÇÃO DMSA","Buscando informações."]

{"sheet":"TD 150200","index":39,"n_rows":6,"n_cols":7,"rows_kept":6,"cut":false,"hidden":false,"merged":[[1,2,2,6]]}
[]
[null,null,{"$f":"IFERROR(VLOOKUP(B3,'Banco de dados'!$A$994:$B$1311,2,0),\"\")","v":"IMPRENSA UNIVERSITÁRIA"}]
["Centro de Custo",150200]
[]
["Reqmat","Nº DMSA","Nº do processo","Objeto","Setor requisitante","Localização atual","Situação atual"]
["22/2014",1262,"005540/2014","Contratação de serviços para conserto da impressora laser colorida a3 marca Lexmark - c910n","IMPRENSA UNIVERSITÁRIA","DIREÇÃO DMSA","Reqmat 22 e 26 não serão atendidos pois os valors dos consertos ultrapassam seus respectivos valores de mercado.\nAnálise e posterior encaminhamento À PROAF para autorização da despesa"]

{"sheet":"TD 150400","index":40,"n_rows":7,"n_cols":7,"rows_kept":7,"cut":false,"hidden":false,"merged":[[1,2,2,5]]}
[]
[null,null,{"$f":"IFERROR(VLOOKUP(B3,'Banco de dados'!$A$994:$B$1311,2,0),\"\")","v":"PROEXT - PROGRAMA APOIO E ACOMPANHAMENTO USO DE LAPTOPS ESCOLA POR ALUNO"}]
["Centro de Custo",150400]
[]
["Reqmat","Nº DMSA","Nº do processo","Objeto","Setor requisitante","Localização atual","Situação atual"]
["01/2014",1056,"003666/2014","Aquisição de cartuchos de tinta","PROEXT - PROGRAMA APOIO E ACOMPANHAMENTO NO USO DE LAPTOPS ESCOLA POR ALUNO ","SPP","Pesquisa de preço."]
["03/2014",1148,"006356/2014","Aquisição dos itens do grupo 30.16 - Material de expediente (papel em geral, etc)","PROEXT - PROGRAMA APOIO E ACOMPANHAMENTO NO USO DE LAPTOPS ESCOLA POR ALUNO ","ANEXADO    23083.006343/2014-14","Consolidar Pesquisa de Preço (anexado ao 006343/2014)."]

{"sheet":"TD 150600","index":41,"n_rows":15,"n_cols":7,"rows_kept":15,"cut":false,"hidden":false,"merged":[[1,2,2,5]]}
[]
[null,null,{"$f":"IFERROR(VLOOKUP(B3,'Banco de dados'!$A$994:$B$1311,2,0),\"\")","v":"PROEXT - APOIO À PRÁTICAS TRADICIONAIS NO USO DE PLANTAS MEDICINAIS"}]
["Centro de Custo",150600]
[]
["Reqmat","Nº DMSA","Nº do processo","Objeto","Setor requisitante","Localização atual","Situação atual"]
["11/2014",1186,"006354/2014","Aquisição de itens do grupo 52.42 (cavalete e tela de proteção)","PROJETO PROEXT-MEC 2014 \"MÃOS QUE CRIAM - PROJETO DE CAPACITAÇÃO PARA PROMOÇÃO SOCIAL\"","SEÇÃO DE CONTROLE","Já houve empenho (2014NE802003) e  foi entregue no Almoxarifado em 12/11/14."]
["01/2014",1274,"005786/2014","Aquisição de frascos de PET, válvulas, frascos de vidro (embalagens para produção de xaropes, doces e geléias)","Projeto PROEXT-MEC 2014 \"APOIO ÀS PRÁTICAS TRADICIONAIS...\"","SPP","Elaboração da minuta de edital."]
["01/2014",281,"003663/2014","Aquisição de assadeira cozinha comercial, etc","PRÓ-REITORIA DE EXTENSÃO","ARQUIVO","Arquivado porque o requerente solicitou o cancelamento do pedido constante no reqmat n°01 (fls. 01 a 07 do presente processo)."]
["06/2014",1273,"005786/2014","Aquisição de frascos de PET, válvulas, frascos de vidro (embalagens para produção de xaropes, doces e geléias)","Projeto PROEXT-MEC 2014 \"APOIO ÀS PRÁTICAS TRADICIONAIS...\"","SPP","Elaboração da minuta de edital."]
["06/2014",1184,"006354/2014","Aquisição de itens do grupo 52.42 (cavalete e tela de proteção)","PROJETO PROEXT-MEC 2014 \"ESTRATÉGIAS PARA DESENVOLVIMENTO DE CADEIA PRODUTIVA COM ABELHAS POR MEIOO DA CAPACITAÇÃO E ASSISTÊNCIA TÉCNICA\"","SEÇÃO DE CONTROLE","Já houve empenho (2014NE802003) e  foi entregue no Almoxarifado em 12/11/14."]
["05/2014",1185,"006354/2014","Aquisição de itens do grupo 52.42 (cavalete e tela de proteção)","Projeto PROEXT-MEC 2014 \"APOIO ÀS PRÁTICAS TRADICIONAIS...\"","SEÇÃO DE CONTROLE","Já houve empenho (2014NE802003) e  foi entregue no Almoxarifado em 12/11/14."]
["05/2014",1264,"006590/2014","Aquisição do grupo 30.11 - Material químico (solventes, ácidos, etc)","PROJETO PROEXT - MEC \"APOIO AS PRÁTICAS TRADICIONAIS, USO DE PLANTAS MEDICINAIS E SISTEMAS AGROALIMENTARES\"","DIREÇÃO DMSA","A Direção está verificando a possibilidade de atendimento juntamente com a demanda de 2015."]
["03/2014",228,"003664/2014","Aquisição de papel A4 e papel A3","PROGRAMA PROEXT-MEC 2014 ","ARQUIVO","Arquivado porque as solitações foram realizadas pelos Coordenadores através do Quiosque de Compras."]
["04/2014",1058,"003666/2014","Aquisição de cartuchos de tinta","PROGRAMA PROEXT MEC 2014","SPP","Pesquisa de preço."]
["07/2014",1269,"005735/2014","Aquisição de equipamentos industriais - banho Maria, moinho, máquina de costura, fogão, liquidificador e seladora (grupo 52.28)","Projeto PROEXT-MEC 2014","ASSESSORIA TECNICA/DMSA","Pesquisa de preço."]

{"sheet":"TD 160000","index":42,"n_rows":10,"n_cols":7,"rows_kept":10,"cut":false,"hidden":false,"merged":[[1,2,2,6]]}
[]
[null,null,{"$f":"IFERROR(VLOOKUP(B3,'Banco de dados'!$A$994:$B$1311,2,0),\"\")","v":"PRÓ-REITORIA DE PESQUISA E PÓS GRADUAÇÃO"}]
["Centro de Custo",160000]
[]
["Reqmat","Nº DMSA","Nº do processo","Objeto","Setor requisitante","Localização atual","Situação atual"]
["16/2014",1912,"009792/2014","Serviços de confecção com fornecimento de 14.000 cintas elásticas para unir processos","PRÓ-REITORIA DE PESQUISA E PÓS GRADUAÇÃO","DRA. IVANIR","Elaboração da minuta de edital."]
["06/2014",342,"002699/2014","Aquisição de material de expediente","PRÓ-REITORIA DE PESQUISA E PÓS GRADUAÇÃO","DIREÇÃO DMSA","Verificando a possibilidade de atendimento juntamente com a demanda de 2015."]
["03/2014",345,"002706/2014","Aquisição de artigos de higiene e conservação","PRÓ-REITORIA DE PESQUISA E PÓS GRADUAÇÃO","SPP","Verificando a possibilidade de atendimento juntamente com a demanda de 2015."]
["04/2014",346,"002700/2014","Aquisição de gás liquefeito de petróleo","PRÓ-REITORIA DE PESQUISA E PÓS GRADUAÇÃO","DIREÇÃO DMSA","Pregão nº 138/2014 finalizado em 14/11/14. O processo está disponível na Seção de Sistema de Registro de Preços para solicitar empenhos."]
["02/2014",344,"002701/2014","Aquisição de café, açúcar, coador e adoçante","PRÓ-REITORIA DE PESQUISA E PÓS GRADUAÇÃO","CLOG","Pregão nº 88/2014 finalizado em 03/11/14. Já houve empenho (2014NE802417, 2015NE800302) e pagamento (2015OB800319). O processo está disponível na Seção de Sistema de Registro de Preços para solicitar empenhos."]

{"sheet":"TD 160001","index":43,"n_rows":20,"n_cols":7,"rows_kept":20,"cut":false,"hidden":false,"merged":[[1,2,2,6]]}
[]
[null,null,{"$f":"IFERROR(VLOOKUP(B3,'Banco de dados'!$A$994:$B$1311,2,0),\"\")","v":"PRÓ - EQUIPAMENTOS"}]
["Centro de Custo",160001]
[]
["Reqmat","Nº DMSA","Nº do processo","Objeto","Setor requisitante","Localização atual","Situação atual"]
["10/2014",1277,"005684/2014","Aquisição de servidor de cálculo intel supermicro com switch hub 16 - Pró-equipamentos/Capes","PROPPG","SCD","Realizando ajustes após emissão de parecer jurídico."]
["11/2014",1281,"006504/2014","Aquisição de cromatógrafo","PROPPG","SEÇÃO DE CONTROLE","Já houve empenho (2014NE802205) e a data prevista de entrega é até 23/12/14. "]
["12/2014",1335,"006280/2014","Aquisição de microscópio de fluorescencia BX43-L-FL-URA-I 00","PROPPG","CLOG","Realizando ajustes após emissão de parecer jurídico."]
["12/2014",1332,"006283/2014","Aquisição de contador automático de células Moxi ZTM","PROPPG","PRO-REITORIA DE PESQUISA E POS-GRADUAÇÃO","Realizando ajustes após emissão de parecer jurídico."]
["14/2014",1280,"006505/2014","Aquisição de ultra freezer -80ºc","PROPPG","CLOG","Realizando ajustes após emissão de parecer jurídico."]
["15/2014",1331,"006284/2014","Aquisição de microscópio trinolucar","PROPPG","CLOG","Já houve empenho (2014NE802219), mas faltam informações sobre a entrega."]
["16/2014",1334,"006281/2014","Aquisição de scanner Copibbik Cobalt - Pró-equipamento","PROPPG","DIVISÃO DE ADMINISTRAÇÃO FINANCEIRA","Já houve empenho (2014NE802212), mas faltam informações sobre a entrega."]
["17/2014",1333,"006282/2014","Aquisição de criostato para cortes em congelados","PROPPG","CLOG","Buscando informações."]
["18/2014",1279,"006506/2014","Aquisição de sistema Bio-plex MagPix Sistema Bio-plex MagPix","PROPPG","CLOG","Já houve empenho (2014NE802216), mas faltam informações sobre a entrega."]
["19/2014",1278,"005685/2014","Aquisição de estação de lavagem Bioplex","PROPPG","CLOG","Já houve empenho (2014NE802215) e foi entregue no Almoxarifado em 02/03/15."]
["08/2014",1282,"006503/2014","Aquisição de FTIR para análise de sólidos","PROPPG","CLOG","Já houve empenho (2014NE802207), mas faltam informações sobre a entrega."]
["06/2014",1336,"006279/2014","Aquisição de Steponeplus Real-time PCR System","PROPPG","CLOG","Realizando ajustes após emissão de parecer jurídico."]
["06/2014",1284,"006507/2014","Aquisição de sistema protean I12 IEF, 90-240 vac","PROPPG","CLOG","Já houve empenho (2014NE802210), mas faltam informações sobre a entrega."]
["07/2014",1283,"006502/2014","Aquisição de sistema de concentração de amostras","PROPPG","CLOG","Já houve empenho (2014NE802213) e a data prevista de entrega é até 09/03/15. "]
["09/2014",1276,"005684/2014","Aquisição de servidor de cálculo intel supermicro com switch hub 16 - Pró-equipamentos/Capes","PROPPG","SCD","Realizando ajustes após emissão de parecer jurídico."]

{"sheet":"TD 160010","index":44,"n_rows":12,"n_cols":7,"rows_kept":12,"cut":false,"hidden":false,"merged":[[1,2,2,6]]}
[]
[null,null,{"$f":"IFERROR(VLOOKUP(B3,'Banco de dados'!$A$994:$B$1311,2,0),\"\")","v":"EDITORA UNIVERSIDADE RURAL"}]
["Centro de Custo",160010]
[]
["Reqmat","Nº DMSA","Nº do processo","Objeto","Setor requisitante","Localização atual","Situação atual"]
["10/2014",191,"002706/2014","Aquisição de artigos de higiene e conservação","EDITORA UNIVERSIDADE RURAL","SPP","Verificando a possibilidade de atendimento juntamente com a demanda de 2015."]
["11/2014",187,"002699/2014","Aquisição de material de expediente","EDITORA UNIVERSIDADE RURAL","DIREÇÃO DMSA","Verificando a possibilidade de atendimento juntamente com a demanda de 2015."]
["12/2014",189,"002704/2014","Aquisição de material de expediente (papel A4, carta, ofício, etc)","EDITORA UNIVERSIDADE RURAL","CPACS","Consolidar Pesquisas de Preços"]
["14/2014",188,"002703/2014","Aquisição de material de artes gráficas e desenho","EDITORA UNIVERSIDADE RURAL","SSRP","Será atendido junto com a Demanda de 2015 - equipe do projeto"]
["15/2014",190,"002707/2014","Aquisição de artigos de copa e cozinha","EDITORA UNIVERSIDADE RURAL","SPP","Verificando a possibilidade de atendimento juntamente com a demanda de 2015."]
["70/2014","S/Nº","002701/2014","Aquisição de café, açúcar, coador e adoçante","EDITORA UNIVERSIDADE RURAL","CLOG","Pregão nº 88/2014 finalizado em 03/11/14. Já houve empenho (2014NE802417, 2015NE800302) e pagamento (2015OB800319). O processo está disponível na Seção de Sistema de Registro de Preços para solicitar empenhos."]
["09/2014",186,"002701/2014","Aquisição de café, açúcar, coador e adoçante","EDITORA UNIVERSIDADE RURAL","CLOG","Pregão nº 88/2014 finalizado em 03/11/14. Já houve empenho (2014NE802417, 2015NE800302) e pagamento (2015OB800319). O processo está disponível na Seção de Sistema de Registro de Preços para solicitar empenhos."]

{"sheet":"TD 160050","index":45,"n_rows":6,"n_cols":7,"rows_kept":6,"cut":false,"hidden":false,"merged":[[1,2,2,6]]}
[]
[null,null,{"$f":"IFERROR(VLOOKUP(B3,'Banco de dados'!$A$994:$B$1311,2,0),\"\")","v":"JARDIM BOTÂNICO"}]
["Centro de Custo",160050]
[]
["Reqmat","Nº DMSA","Nº do processo","Objeto","Setor requisitante","Localização atual","Situação atual"]
["05/2014",912,"006021/2014","Aquisição de equipamentos agrícolas (grupo 52.40)","JARDIM BOTÂNICO","ASTEC","Pregão 34/2015 - Elaboração da minuta de edital."]

{"sheet":"TD 160100","index":46,"n_rows":6,"n_cols":7,"rows_kept":6,"cut":false,"hidden":false,"merged":[[1,2,2,6]]}
[]
[null,null,{"$f":"IFERROR(VLOOKUP(B3,'Banco de dados'!$A$994:$B$1311,2,0),\"\")","v":"PROAP - PRÓ-REITORIA DE PESQUISA E PÓS GRADUAÇÃO"}]
["Centro de Custo",160100]
[]
["Reqmat","Nº DMSA","Nº do processo","Objeto","Setor requisitante","Localização atual","Situação atual"]
["01/2014",1238,"006590/2014","Aquisição do grupo 30.11 - Material químico (solventes, ácidos, etc)","DEPARTAMENTO DE ENGENHARIA","DIREÇÃO DMSA","A Direção está verificando a possibilidade de atendimento juntamente com a demanda de 2015."]

{"sheet":"TD 160102","index":47,"n_rows":7,"n_cols":7,"rows_kept":7,"cut":false,"hidden":false,"merged":[[1,2,2,6]]}
[]
[null,null,{"$f":"IFERROR(VLOOKUP(B3,'Banco de dados'!$A$994:$B$1311,2,0),\"\")","v":"PROAP - CIÊNCIAS AMBIENTAIS E FLORESTAIS"}]
["Centro de Custo",160102]
[]
["Reqmat","Nº DMSA","Nº do processo","Objeto","Setor requisitante","Localização atual","Situação atual"]
["03/2014",223,"006056/2014","Aquisição de material de artes gráficas, desenho e expediente (grupos 30.16 e 30.16B)","PROGRAMA DE PÓS-GRADUAÇÃO EM CIÊNCIAS AMBIENTAIS E FLORESTAIS","SSRP","Verificando a possibilidade de atendimento juntamente com a demanda de 2015."]
["02/2014",224,"006056/2014","Aquisição de material de artes gráficas, desenho e expediente (grupos 30.16 e 30.16B)","PROGRAMA DE PÓS-GRADUAÇÃO EM CIÊNCIAS AMBIENTAIS E FLORESTAIS","SSRP","Verificando a possibilidade de atendimento juntamente com a demanda de 2015."]

{"sheet":"TD 160105","index":48,"n_rows":11,"n_cols":7,"rows_kept":11,"cut":false,"hidden":false,"merged":[[1,2,2,6]]}
[]
[null,null,{"$f":"IFERROR(VLOOKUP(B3,'Banco de dados'!$A$994:$B$1311,2,0),\"\")","v":"PROAP - ENGENHARIA QUÍMICA"}]
["Centro de Custo",160105]
[]
["Reqmat","Nº DMSA","Nº do processo","Objeto","Setor requisitante","Localização atual","Situação atual"]
["01/2014",936,"006590/2014","Aquisição do grupo 30.11 - Material químico (solventes, ácidos, etc)","PROAP - ENGENHARIA QUÍMICA","DIREÇÃO DMSA","A Direção está verificando a possibilidade de atendimento juntamente com a demanda de 2015."]
["06/2014",1217,"006356/2014","Aquisição dos itens do grupo 30.16 - Material de expediente (papel em geral, etc)","PROGRAMA DE PÓS-GRADUAÇÃO EM ENGENHARIA QUÍMICA","ANEXADO    23083.006343/2014-16","Consolidar Pesquisa de Preço (anexado ao 006343/2014)."]
["03/2014",1215,"006356/2014","Aquisição dos itens do grupo 30.16 - Material de expediente (papel em geral, etc)","PROGRAMA DE PÓS-GRADUAÇÃO EM ENGENHARIA QUÍMICA","ANEXADO    23083.006343/2014-15","Consolidar Pesquisa de Preço (anexado ao 006343/2014)."]
["04/2014",1222,"007530/2014","Aquisição de memória portátil microcomputador (grupo 30.17B)","PPGEQ","COORD. DO CURSO DE POS-GRADUAÇÃO EM ENGENHARIA QUÍMICA","Buscando informações."]
["07/2014",1219,"006358/2014","Aquisição dos itens do grupo 30.35 - Material de laboratório (frascos, etc)","PROGRAMA DE PÓS-GRADUAÇÃO EM ENGENHARIA QUÍMICA","DIREÇÃO DMSA","Aguardando avaliação da Direção após pesquisa de preços."]
["07/2014",1219,"008809/2014","Aquisição de materiais dos itens 18, 19, 21 e 22 do reqmat 07, processo 006358/2014, que não foram comprados","PROGRAMA DE PÓS-GRADUAÇÃO EM ENGENHARIA QUÍMICA","DIREÇÃO DMSA","Buscando solução para uso do recurso do PROAP 2014."]

{"sheet":"TD 160106","index":49,"n_rows":10,"n_cols":7,"rows_kept":10,"cut":false,"hidden":false,"merged":[[1,2,2,6]]}
[]
[null,null,{"$f":"IFERROR(VLOOKUP(B3,'Banco de dados'!$A$994:$B$1311,2,0),\"\")","v":"PROAP - FITOTECNIA"}]
["Centro de Custo",160106]
[]
["Reqmat","Nº DMSA","Nº do processo","Objeto","Setor requisitante","Localização atual","Situação atual"]
["01/2014",1064,"006333/2014","Aquisição de cartuchos HP (grupo 30.17)","PROGRAMA DE PÓS-GRADUAÇÃO EM FITOTECNIA","INSTITUTO DE EDUCAÇÃO","Já houve empenho (2014NE802494) e  foi entregue no Almoxarifado em 16/12/14."]
["05/2014",1416,"006680/2014","Conserto de câmara fria para conservação de sementes","PROGRAMA DE PÓS-GRADUAÇÃO EM FITOTECNIA","ANEXADO    23083.006058/2014-01","O empenho já foi emitido (2014NE802290) e transmitido à empresa. A prestação do serviço já pode ser iniciada (20 dias para execução). (anexado ao 006058/2014)."]
["05/2014",1465,"009584/2014","Aquisição de materiais de alguns itens do grupo 30.31 - Insumos agrícolas (formicida e semente de espécie de milho híbrido)","PROGRAMA DE PÓS-GRADUAÇÃO EM FITOTECNIA","DIREÇÃO DMSA","Buscando informações."]
["03/2014",1320,"005968/2014","Aquisição de mobiliário em geral (grupo 52.42)","PROGRAMA DE PÓS-GRADUAÇÃO EM FITOTECNIA","DIREÇÃO DMSA","Verificando a possibilidade de atendimento juntamente com a demanda de 2015."]
["02/2014",1080,"006058/2014","Conserto de câmaras de germinação","INSTITUTO DE AGRONOMIA - PROGRAMA DE PÓS-GRADUAÇÃO EM FITOTECNIA","SAPG","O empenho já foi emitido (2014NE802290) e transmitido à empresa. A prestação do serviço já pode ser iniciada (20 dias para execução)."]

{"sheet":"TD 160107","index":50,"n_rows":10,"n_cols":7,"rows_kept":10,"cut":false,"hidden":false,"merged":[[1,2,2,6]]}
[]
[null,null,{"$f":"IFERROR(VLOOKUP(B3,'Banco de dados'!$A$994:$B$1311,2,0),\"\")","v":"PROAP - MEDICINA VETERINÁRIA"}]
["Centro de Custo",160107]
[]
["Reqmat","Nº DMSA","Nº do processo","Objeto","Setor requisitante","Localização atual","Situação atual"]
["01/2014",962,"006591/2014","Aquisição de KIT Nefa (ácidos graxos não estereficados)","PROGRAMA DE PÓS-GRADUAÇÃO EM MEDICINA VETERINÁRIA","CLOG","Realizando ajustes após emissão de parecer jurídico."]
["01/2014",962,"006590/2014","Aquisição do grupo 30.11 - Material químico (solventes, ácidos, etc)","PROAP - MEDICINA VETERINÁRIA","DIREÇÃO DMSA","A Direção está verificando a possibilidade de atendimento juntamente com a demanda de 2015."]
["03/2014",1030,"006085/2014","Serviço de instalação de aparelhos de ar condicionado","PROGRAMA DE PÓS-GRADUAÇÃO EM MEDICINA VETERINÁRIA","SAPG","O empenho já foi emitido (2014NE802065) e a empresa está realizando o serviço."]
["04/2014",1028,"005968/2014","Aquisição de mobiliário em geral (grupo 52.42)","PROGRAMA DE PÓS-GRADUAÇÃO EM MEDICINA VETERINÁRIA","DIREÇÃO DMSA","Verificando a possibilidade de atendimento juntamente com a demanda de 2015."]
["02/2014",963,"006353/2014","Aquisição de agulha, tipo agulha hipodérmica, tamanho 13 x 4,5, material corpo em aco inox e etc","PROGRAMA DE PÓS-GRADUAÇÃO EM MEDICINA VETERINÁRIA","DIREÇÃO DMSA","Aguardando avaliação da Direção após pesquisa de preços."]

{"sheet":"TD 160110","index":51,"n_rows":7,"n_cols":7,"rows_kept":7,"cut":false,"hidden":false,"merged":[[1,2,2,6]]}
[]
[null,null,{"$f":"IFERROR(VLOOKUP(B3,'Banco de dados'!$A$994:$B$1311,2,0),\"\")","v":"PROAP - QUÍMICA"}]
["Centro de Custo",160110]
[]
["Reqmat","Nº DMSA","Nº do processo","Objeto","Setor requisitante","Localização atual","Situação atual"]
["01/2014",1800,"009046/2014","Aquisição de gás comprimido (nitrogênio líquido)","PROGRAMA DE PÓS-GRADUAÇÃO EM QUÍMICA","DRA. IVANIR","Elaboração da minuta de edital."]
["07/2014",1802,"009047/2014","Aquisição de gás hélio comprimido","PROGRAMA DE PÓS-GRADUAÇÃO EM QUÍMICA","COORD. DO CURSO DE POS-GRADUAÇÃO EM QUÍMICA ORGÂNICA","Já houve empenho (2014NE802308), mas o prazo de entrega está vencido e um ofício de cobrança foi emitido à empresa em 06/02/15."]

{"sheet":"TD 160112","index":52,"n_rows":9,"n_cols":7,"rows_kept":9,"cut":false,"hidden":false,"merged":[[1,2,2,6]]}
[]
[null,null,{"$f":"IFERROR(VLOOKUP(B3,'Banco de dados'!$A$994:$B$1311,2,0),\"\")","v":"PROAP - ZOOTECNIA"}]
["Centro de Custo",160112]
[]
["Reqmat","Nº DMSA","Nº do processo","Objeto","Setor requisitante","Localização atual","Situação atual"]
["01/2014",78,"006056/2014","Aquisição de material de artes gráficas, desenho e expediente (grupos 30.16 e 30.16B)","PROGRAMA DE PÓS-GRADUAÇÃO EM ZOOTECNIA","SSRP","Verificando a possibilidade de atendimento juntamente com a demanda de 2015."]
["06/2014",1811,"009173/2014","Reparo e mautenção de estufa de secagem e esterelização","PROGRAMA DE PÓS-GRADUAÇÃO EM ZOOTECNIA","SPP","Pesquisa de preço."]
["05/2014",1812,"009173/2014","Reparo e mautenção de estufa de secagem e esterelização","PROGRAMA DE PÓS-GRADUAÇÃO EM ZOOTECNIA","SPP","Pesquisa de preço."]
["02/2014",79,"006056/2014","Aquisição de material de artes gráficas, desenho e expediente (grupos 30.16 e 30.16B)","PROGRAMA DE PÓS-GRADUAÇÃO EM ZOOTECNIA","SSRP","Verificando a possibilidade de atendimento juntamente com a demanda de 2015."]

{"sheet":"TD 160114","index":53,"n_rows":7,"n_cols":7,"rows_kept":7,"cut":false,"hidden":false,"merged":[[1,2,2,6]]}
[]
[null,null,{"$f":"IFERROR(VLOOKUP(B3,'Banco de dados'!$A$994:$B$1311,2,0),\"\")","v":"PROAP - CIÊNCIAS VETERINÁRIAS"}]
["Centro de Custo",160114]
[]
["Reqmat","Nº DMSA","Nº do processo","Objeto","Setor requisitante","Localização atual","Situação atual"]
["56/2014",139,"006056/2014","Aquisição de material de artes gráficas, desenho e expediente (grupos 30.16 e 30.16B)","CURSO DE PÓS-GRADUAÇÃO EM CIÊNCIAS VETERINÁRIAS","SSRP","Verificando a possibilidade de atendimento juntamente com a demanda de 2015."]
["64/2014",395,"004381/2014","Manutenção preventiva referente ao analisador genético 3500","CURSO DE PÓS-GRADUAÇÃO EM CIÊNCIAS VETERINÁRIAS/LAB. DE BIOLOGIA MOLECULAR","DIVISÃO DE ADMINISTRAÇÃO FINANCEIRA","Buscando informações."]

{"sheet":"TD 160117","index":54,"n_rows":7,"n_cols":7,"rows_kept":7,"cut":false,"hidden":false,"merged":[[1,2,2,6]]}
[]
[null,null,{"$f":"IFERROR(VLOOKUP(B3,'Banco de dados'!$A$994:$B$1311,2,0),\"\")","v":"PROAP - MULTICÊNTRICO EM CIÊNCIAS FISIOLÓGICAS"}]
["Centro de Custo",160117]
[]
["Reqmat","Nº DMSA","Nº do processo","Objeto","Setor requisitante","Localização atual","Situação atual"]
["01/2014",139,"006056/2014","Aquisição de material de artes gráficas, desenho e expediente (grupos 30.16 e 30.16B)","INSTITUTO DE BIOLOGIA","SSRP","Verificando a possibilidade de atendimento juntamente com a demanda de 2015."]
["02/2014",138,"006056/2014","Aquisição de material de artes gráficas, desenho e expediente (grupos 30.16 e 30.16B)","INSTITUTO DE BIOLOGIA","SSRP","Verificando a possibilidade de atendimento juntamente com a demanda de 2015."]

{"sheet":"TD 160119","index":55,"n_rows":7,"n_cols":7,"rows_kept":7,"cut":false,"hidden":false,"merged":[[1,2,2,6]]}
[]
[null,null,{"$f":"IFERROR(VLOOKUP(B3,'Banco de dados'!$A$994:$B$1311,2,0),\"\")","v":"PROAP - PSICOLOGIA"}]
["Centro de Custo",160119]
[]
["Reqmat","Nº DMSA","Nº do processo","Objeto","Setor requisitante","Localização atual","Situação atual"]
["01/2014",324,"006056/2014","Aquisição de material de artes gráficas, desenho e expediente (grupos 30.16 e 30.16B)","PROGRAMA DE PÓS-GRADUAÇÃO EM PSICOLOGIA","SSRP","Verificando a possibilidade de atendimento juntamente com a demanda de 2015."]
["02/2014",212,"006056/2014","Aquisição de material de artes gráficas, desenho e expediente (grupos 30.16 e 30.16B)","PROGRAMA DE PÓS-GRADUAÇÃO EM PSICOLOGIA","SSRP","Verificando a possibilidade de atendimento juntamente com a demanda de 2015."]

{"sheet":"TD 170000","index":56,"n_rows":17,"n_cols":7,"rows_kept":17,"cut":false,"hidden":false,"merged":[[1,2,2,6]]}
[]
[null,null,{"$f":"IFERROR(VLOOKUP(B3,'Banco de dados'!$A$994:$B$1311,2,0),\"\")","v":"CAIC"}]
["Centro de Custo",170000]
[]
["Reqmat","Nº DMSA","Nº do processo","Objeto","Setor requisitante","Localização atual","Situação atual"]
["11/2014",939,"006022/2014","Aquisição de equipamentos eletro-eletrônicos (grupo 52.33)","CAIC","SPP","Pesquisa de preço."]
["12/2014",1111,"005968/2014","Aquisição de mobiliário em geral (grupo 52.42)","CAIC","DIREÇÃO DMSA","Verificando a possibilidade de atendimento juntamente com a demanda de 2015."]
["01/2014",387,"002700/2014","Aquisição de gás liquefeito de petróleo","CAIC","DIREÇÃO DMSA","Pregão nº 138/2014 finalizado em 14/11/14. O processo está disponível na Seção de Sistema de Registro de Preços para solicitar empenhos."]
["08/2014",393,"002706/2014","Aquisição de artigos de higiene e conservação","CAIC","SPP","Verificando a possibilidade de atendimento juntamente com a demanda de 2015."]
["06/2014",391,"002704/2014","Aquisição de material de expediente (papel A4, carta, ofício, etc)","CAIC","CPACS","Consolidar Pesquisas de Preços"]
["05/2014",390,"002703/2014","Aquisição de material de artes gráficas e desenho","CAIC","SSRP","Será atendido junto com a Demanda de 2015 - equipe do projeto"]
["03/2014",388,"002701/2014","Aquisição de café, açúcar, coador e adoçante","CAIC","CLOG","Pregão nº 88/2014 finalizado em 03/11/14. Já houve empenho (2014NE802417, 2015NE800302) e pagamento (2015OB800319). O processo está disponível na Seção de Sistema de Registro de Preços para solicitar empenhos."]
["04/2014",389,"002699/2014","Aquisição de material de expediente","CAIC","DIREÇÃO DMSA","Verificando a possibilidade de atendimento juntamente com a demanda de 2015."]
["02/2014",386,"003205/2014","Aquisição de gêneros alimentícios","CAIC","CAIC","Pregão nº 135/2014 finalizado em 01/12/14. O processo está disponível no CAIC para solicitar empenhos. "]
["07/2014",392,"002707/2014","Aquisição de artigos de copa e cozinha","CAIC","SPP","Verificando a possibilidade de atendimento juntamente com a demanda de 2015."]
["09/2014",937,"004258/2014","Aquisição de livros","CAIC","CLOG","Pregão nº 10/2015 (antigo nº 140/2014) iniciado em 05/03/15."]
["134/2014","S/Nº","004123/2014","Reparo na tela que cerca o CAIC","CAIC","PROAES","Buscando informações."]

{"sheet":"TD 180000","index":57,"n_rows":34,"n_cols":7,"rows_kept":34,"cut":false,"hidden":false,"merged":[[1,2,2,6]]}
[]
[null,null,{"$f":"IFERROR(VLOOKUP(B3,'Banco de dados'!$A$994:$B$1311,2,0),\"\")","v":"CTUR"}]
["Centro de Custo",180000]
[]
["Reqmat","Nº DMSA","Nº do processo","Objeto","Setor requisitante","Localização atual","Situação atual"]
["12/2014",1006,"004596/2014","Fornecimento e instalação de 250 metros de cabo óptico, etc no CTUR","CTUR","ARQUIVO","Já houve empenho (2014NE800992) e pagamento (2014OB805920)"]
["13/2014",1054,"006008/2014","Aquisição de material hidráulico (grupo 30.24)","CTUR","ASTEC","Elaboração da minuta de edital."]
["14/2014",1053,"006045/2014","Aquisição de material de construção (grupo 30.24A)","CTUR","PREGÃO","Pregão 30/2015 agendado para abertura 27/03/2015."]
["16/2014",1255,"005968/2014","Aquisição de mobiliário em geral (grupo 52.42)","CTUR","DIREÇÃO DMSA","Verificando a possibilidade de atendimento juntamente com a demanda de 2015."]
["17/2014",1456,"007599/2014","Aquisição de título: Estudo do lazer","CTUR","SPP","Atualizando a Pesquisa de Preços e atendendo recomendações do Parecer da PROGER"]
["18/2014",1407,"007038/2014","Aquisição de tanque para fabricação de queijo","CTUR","ASSESSORIA TECNICA/DMSA","Elaboração da minuta de edital."]
["18/2014",1427,"007161/2014","Aquisição de tanque elétrico para fabricação de queijo de 50l e etc","CTUR","ARQUIVO","Aguardando a ata assinada pelo órgão gerenciador da IRP."]
["21/2014",1480,"007505/2014","Aquisição de equipamentos agrícolas - tanque, plantadeiras, podão, pulverizador, arado, carreta, etc (grupo 52.40)","CTUR","SPP","Pesquisa de preço."]
["24/2014",1426,"007531/2014","Aquisição de micro trator (grupo 52.52)","CTUR","ARQUIVO","Foi atendido pelo 008123/2011, houve empenho (2014NE802609) e foi encaminhado ao CTUR para ciência."]
["25/2014",1478,"007548/2014","Aquisição de material hidráulico - tubo ultra JE, luva de correr (grupo 30.24)","CTUR","SIRERR","(vazio)"]
["27/2014",1429,"007163/2014","Aquisição de veículo (zero) 0 km, de fabricação nacional, modelo sedan, ano e mod. de fabricação 2014 ou superior (carona)","CTUR","ARQUIVO","Não houve tempo hábil para realizar a carona, pois a empresa enviou a negativa no último dia de empenho."]
["28/2014",1428,"007163/2014","Aquisição de veículo (zero) 0 km, de fabricação nacional, modelo sedan, ano e mod. de fabricação 2014 ou superior (carona)","CTUR","ARQUIVO","Não houve tempo hábil para realizar a carona, pois a empresa enviou a negativa no último dia de empenho."]
["34/2014",1734,"009342/2014","Solicitação de contratação de serviço especializado em processamento de material bibliográfico","CTUR","DIREÇÃO DMSA","Buscando informações."]
["36/2014",1891,"010419/2014","Aquisição de liquidificador industrial","CTUR","CLOG","Já houve empenho (2014NE802294) e pagamento (2014OB809802)"]
["37/2014",1890,"010418/2014","Aquisição de equipamentos industriais","CTUR","CLOG","Já houve empenho (2014NE802451) e a data prevista de entrega é até 12/01/15. "]
["38/2014",1889,"009467/2014","Aquisição de equipamentos industriais","CTUR","CLOG","Já houve empenho (2014NE802450) e a data prevista de entrega é até 12/01/15. "]
["50/2014",1961,"010485/2014","Aquisição de dois veículos pickpus","CTUR","DMSA","Buscando informações."]
["08/2014",377,"002394/2014","Aquisição de gêneros alimentícios","CTUR","DIVISÃO DE ADMINISTRAÇÃO FINANCEIRA","Pregão nº 81/2014 finalizado em 25/11/14. O processo está disponível no Colégio Técnico da UFRRJ para solicitar empenhos."]
["05/2014",298,"002706/2014","Aquisição de artigos de higiene e conservação","CTUR","SPP","Verificando a possibilidade de atendimento juntamente com a demanda de 2015."]
["03/2014",276,"002699/2014","Aquisição de material de expediente","CTUR","DIREÇÃO DMSA","Verificando a possibilidade de atendimento juntamente com a demanda de 2015."]
["04/2014",324,"002704/2014","Aquisição de material de expediente (papel A4, carta, ofício, etc)","CTUR","CPACS","Consolidar Pesquisas de Preços"]
["02/2014",277,"002701/2014","Aquisição de café, açúcar, coador e adoçante","CTUR","CLOG","Pregão nº 88/2014 finalizado em 03/11/14. Já houve empenho (2014NE802417, 2015NE800302) e pagamento (2015OB800319). O processo está disponível na Seção de Sistema de Registro de Preços para solicitar empenhos."]
["02/2014",1737,"008354/2014","Solicitação de transporte rodoviário com 44 lugares","CTUR","ARQUIVO","Arquivado porque o pedido será atendido através do processo 008337/2012."]
["07/2014",299,"002707/2014","Aquisição de artigos de copa e cozinha","CTUR","SPP","Verificando a possibilidade de atendimento juntamente com a demanda de 2015."]
["09/2014",340,"002707/2014","Aquisição de artigos de copa e cozinha","CTUR","SPP","Verificando a possibilidade de atendimento juntamente com a demanda de 2015."]
["30/2014",1479,"007504/2014","Aquisição de ordenhadeira móvel (grupo 52.40)","CTUR","CLOG","Já houve empenho (2014NE802182) e a data prevista de entrega é até 23/12/14."]
["31/2014",1535,"007860/2014","Aquisição de tela arame galvanizado (emergencial)","CTUR","CLOG","Já houve empenho (2014NE802588) e a data prevista de entrega é até 20/02/15. "]
["41/2014",1830,"009127/2014","Pagamento de inscrição da professora Lívia Nolasco Macedo no curso de análise sensorial de leite e derivados","CTUR","DIREÇÃO DMSA","Já houve empenho (2014NE802437), mas o pagamento ainda não foi efetuado."]
["S/Nº","S/Nº","004583/2014","Aquisição de móveis e equipamentos de uso geral","CTUR","CLOG","Já houve empenhos (2014NE802421, 2014NE802423, 2014NE802425 e 2014NE802426), mas o prazo de entrega está vencido e um ofício de cobrança foi emitido à empresa em 05/03/15.\nJá houve empenho (2014NE802424), pagamento (2015OB800559) e foi entregue no Almoxarifado em 26/01/15."]

{"sheet":"TD 190000","index":58,"n_rows":9,"n_cols":7,"rows_kept":9,"cut":false,"hidden":false,"merged":[[1,2,2,6]]}
[]
[null,null,{"$f":"IFERROR(VLOOKUP(B3,'Banco de dados'!$A$994:$B$1311,2,0),\"\")","v":"CAMPUS DR. LEONEL MIRANDA"}]
["Centro de Custo",190000]
[]
["Reqmat","Nº DMSA","Nº do processo","Objeto","Setor requisitante","Localização atual","Situação atual"]
["01/2014","S/Nº","000313/2014","Contratação de empresa terceirizada para prestação de serviços de vigilância e segurança armada nas dependências do Campus Campos dos Goytacazes","SERVIÇOS GERAIS - CAMPUS CAMPOS DOS GOYTACAZES","DIVISÃO DE ADMINISTRAÇÃO FINANCEIRA","Pregão nº 83/2014 finalizado em 04/12/14. Já houve empenho (2014NE802540, ) e pagamento (2015OB801274)"]
["03/2014",246,"002699/2014","Aquisição de material de expediente","CAMPUS DR. LEONEL MIRANDA","DIREÇÃO DMSA","Verificando a possibilidade de atendimento juntamente com a demanda de 2015."]
["04/2014",245,"002706/2014","Aquisição de artigos de higiene e conservação","DIREÇÃO","SPP","Verificando a possibilidade de atendimento juntamente com a demanda de 2015."]
["02/2014",244,"002701/2014","Aquisição de café, açúcar, coador e adoçante","CAMPUS DR. LEONEL MIRANDA","CLOG","Pregão nº 88/2014 finalizado em 03/11/14. Já houve empenho (2014NE802417, 2015NE800302) e pagamento (2015OB800319). O processo está disponível na Seção de Sistema de Registro de Preços para solicitar empenhos."]

{"sheet":"TD 200000","index":59,"n_rows":6,"n_cols":7,"rows_kept":6,"cut":false,"hidden":false,"merged":[[1,2,2,5]]}
[]
[null,null,{"$f":"IFERROR(VLOOKUP(B3,'Banco de dados'!$A$994:$B$1311,2,0),\"\")","v":"PRÓ-REITORIA DE PLANEJAMENTO, AVALIAÇÃO E DESENVOLVIMENTO INSTITUCIONAL"}]
["Centro de Custo",200000]
[]
["Reqmat","Nº DMSA","Nº do processo","Objeto","Setor requisitante","Localização atual","Situação atual"]
["S/Nº","S/Nº","006067/2014","Serviço de instalação e manutenção de rede elétrica, cabeamento lógico, telefônico e manutenção de grupo gerador","PRÓ-REITORIA DE PLANEJAMENTO, AVALIAÇÃO E DESENVOLVIMENTO INSTITUCIONAL","CPACS","Buscando informações."]

{"sheet":"TD 210000","index":60,"n_rows":15,"n_cols":7,"rows_kept":15,"cut":false,"hidden":false,"merged":[[1,2,2,6]]}
[]
[null,null,{"$f":"IFERROR(VLOOKUP(B3,'Banco de dados'!$A$994:$B$1311,2,0),\"\")","v":"INSTITUTO DE AGRONOMIA"}]
["Centro de Custo",210000]
[]
["Reqmat","Nº DMSA","Nº do processo","Objeto","Setor requisitante","Localização atual","Situação atual"]
["10/2014",1838,"009268/2014","Aquisição de bebedouros de água","DIRETORIA","ARQUIVO","Já houve empenho (2014NE802258 e 2014NE802449) e a data prevista de entrega é até 14/01/15. "]
["01/2014",302,"002701/2014","Aquisição de café, açúcar, coador e adoçante","INSTITUTO DE AGRONOMIA","CLOG","Pregão nº 88/2014 finalizado em 03/11/14. Já houve empenho (2014NE802417, 2015NE800302) e pagamento (2015OB800319). O processo está disponível na Seção de Sistema de Registro de Preços para solicitar empenhos."]
["08/2014",1422,"003666/2014","Aquisição de cartuchos de tinta","DIRETORIA","SPP","Pesquisa de preço."]
["06/2014",301,"004522/2014","Aquisição de torrador, descascador e moinho para café (grupo 52.28)","DIREÇÃO","SEÇÃO DE CONTROLE","Pregão nº 118/2014 finalizado em 18/11/14. Já houve empenho do descascador (2014NE802456) e a data prevista de entrega é até 06/01/15. Já houve empenho do torrador e do moinho para café (2014NE802454) e a data prevista de entrega é até 16/01/15."]
["05/2014",311,"002699/2014","Aquisição de material de expediente","INSTITUTO DE AGRONOMIA","DIREÇÃO DMSA","Verificando a possibilidade de atendimento juntamente com a demanda de 2015."]
["03/2014",303,"002704/2014","Aquisição de material de expediente (papel A4, carta, ofício, etc)","SECRETARIA ADMINISTRATIVA DO INSTITUTO","CPACS","Consolidar Pesquisas de Preços"]
["04/2014",304,"002703/2014","Aquisição de material de artes gráficas e desenho","INSTITUTO DE AGRONOMIA","SSRP","Será atendido junto com a Demanda de 2015 - equipe do projeto"]
["02/2014",310,"002706/2014","Aquisição de artigos de higiene e conservação","SECRETARIA ADMINISTRATIVA DO INSTITUTO","SPP","Verificando a possibilidade de atendimento juntamente com a demanda de 2015."]
["07/2014",1110,"005968/2014","Aquisição de mobiliário em geral (grupo 52.42)","DIRETORIA","DIREÇÃO DMSA","Verificando a possibilidade de atendimento juntamente com a demanda de 2015."]
["S/Nº","S/Nº","007182/2014","Aquisição de 12 automóveis","INSTITUTO DE AGRONOMIA","SEC. ADM. DO DECANATO DE ASSUNTOS FINANCEIROS","Já houve empenho (2014NE801671), pagamentos (2015OB800136 e 2015DF800023) e foi entregue no Almoxarifado em 15/12/14."]

{"sheet":"TD 210100","index":61,"n_rows":10,"n_cols":7,"rows_kept":10,"cut":false,"hidden":false,"merged":[[1,2,2,6]]}
[]
[null,null,{"$f":"IFERROR(VLOOKUP(B3,'Banco de dados'!$A$994:$B$1311,2,0),\"\")","v":"DEPARTAMENTO DE FITOTECNIA"}]
["Centro de Custo",210100]
[]
["Reqmat","Nº DMSA","Nº do processo","Objeto","Setor requisitante","Localização atual","Situação atual"]
["22/2014",95,"002701/2014","Aquisição de café, açúcar, coador e adoçante","DEPARTAMENTO DE FITOTECNIA","CLOG","Pregão nº 88/2014 finalizado em 03/11/14. Já houve empenho (2014NE802417, 2015NE800302) e pagamento (2015OB800319). O processo está disponível na Seção de Sistema de Registro de Preços para solicitar empenhos."]
["23/2014",96,"002699/2014","Aquisição de material de expediente","DEPARTAMENTO DE FITOTECNIA","DIREÇÃO DMSA","Verificando a possibilidade de atendimento juntamente com a demanda de 2015."]
["24/2014",97,"002704/2014","Aquisição de material de expediente (papel A4, carta, ofício, etc)","DEPARTAMENTO DE FITOTECNIA","CPACS","Consolidar Pesquisas de Preços"]
["25/2014",98,"002706/2014","Aquisição de artigos de higiene e conservação","DEPARTAMENTO DE FITOTECNIA","SPP","Verificando a possibilidade de atendimento juntamente com a demanda de 2015."]
["26/2014",99,"002707/2014","Aquisição de artigos de copa e cozinha","DEPARTAMENTO DE FITOTECNIA","SPP","Verificando a possibilidade de atendimento juntamente com a demanda de 2015."]

{"sheet":"TD 210200","index":62,"n_rows":10,"n_cols":7,"rows_kept":10,"cut":false,"hidden":false,"merged":[[1,2,2,6]]}
[]
[null,null,{"$f":"IFERROR(VLOOKUP(B3,'Banco de dados'!$A$994:$B$1311,2,0),\"\")","v":"DEPARTAMENTO DE GEOCIÊNCIAS"}]
["Centro de Custo",210200]
[]
["Reqmat","Nº DMSA","Nº do processo","Objeto","Setor requisitante","Localização atual","Situação atual"]
["01/2014",333,"002701/2014","Aquisição de café, açúcar, coador e adoçante","DEPARTAMENTO DE GEOCIÊNCIAS","CLOG","Pregão nº 88/2014 finalizado em 03/11/14. Já houve empenho (2014NE802417, 2015NE800302) e pagamento (2015OB800319). O processo está disponível na Seção de Sistema de Registro de Preços para solicitar empenhos."]
["06/2014",359,"002707/2014","Aquisição de artigos de copa e cozinha","DEPARTAMENTO DE GEOCIÊNCIAS","SPP","Verificando a possibilidade de atendimento juntamente com a demanda de 2015."]
["05/2014",360,"002704/2014","Aquisição de material de expediente (papel A4, carta, ofício, etc)","DEPARTAMENTO DE GEOCIÊNCIAS","CPACS","Consolidar Pesquisas de Preços"]
["03/2014",357,"002699/2014","Aquisição de material de expediente","DEPARTAMENTO DE GEOCIÊNCIAS","DIREÇÃO DMSA","Verificando a possibilidade de atendimento juntamente com a demanda de 2015."]
["07/2014",358,"002706/2014","Aquisição de artigos de higiene e conservação","DEPARTAMENTO DE GEOCIÊNCIAS","SPP","Verificando a possibilidade de atendimento juntamente com a demanda de 2015."]

{"sheet":"TD 210300","index":63,"n_rows":6,"n_cols":7,"rows_kept":6,"cut":false,"hidden":false,"merged":[[1,2,2,6]]}
[]
[null,null,{"$f":"IFERROR(VLOOKUP(B3,'Banco de dados'!$A$994:$B$1311,2,0),\"\")","v":"DEPARTAMENTO DE SOLOS"}]
["Centro de Custo",210300]
[]
["Reqmat","Nº DMSA","Nº do processo","Objeto","Setor requisitante","Localização atual","Situação atual"]
["05/2014","S/Nº","006008/2014","Aquisição de material hidráulico (grupo 30.24)","DEPARTAMENTO DE SOLOS","ASTEC","Elaboração da minuta de edital."]

{"sheet":"TD 220000","index":64,"n_rows":14,"n_cols":7,"rows_kept":14,"cut":false,"hidden":false,"merged":[[1,2,2,6]]}
[]
[null,null,{"$f":"IFERROR(VLOOKUP(B3,'Banco de dados'!$A$994:$B$1311,2,0),\"\")","v":"INSTITUTO DE BIOLOGIA"}]
["Centro de Custo",220000]
[]
["Reqmat","Nº DMSA","Nº do processo","Objeto","Setor requisitante","Localização atual","Situação atual"]
["11/2014",208,"002433/2014","Serviço de limpeza, manutenção e revisão de retroprojetores e placa de aquecimento","INSTITUTO DE BIOLOGIA ","DIREÇÃO DMSA","Buscando informações."]
["16/2014",430,"002700/2014","Aquisição de gás liquefeito de petróleo","INSTITUTO DE BIOLOGIA","DIREÇÃO DMSA","Pregão nº 138/2014 finalizado em 14/11/14. O processo está disponível na Seção de Sistema de Registro de Preços para solicitar empenhos."]
["17/2014",257,"002701/2014","Aquisição de café, açúcar, coador e adoçante","INSTITUTO DE BIOLOGIA","CLOG","Pregão nº 88/2014 finalizado em 03/11/14. Já houve empenho (2014NE802417, 2015NE800302) e pagamento (2015OB800319). O processo está disponível na Seção de Sistema de Registro de Preços para solicitar empenhos."]
["18/2014",274,"002699/2014","Aquisição de material de expediente","INSTITUTO DE BIOLOGIA","DIREÇÃO DMSA","Verificando a possibilidade de atendimento juntamente com a demanda de 2015."]
["19/2014",259,"002706/2014","Aquisição de artigos de higiene e conservação","DEPARTAMENTO DE GENÉTICA","SPP","Verificando a possibilidade de atendimento juntamente com a demanda de 2015."]
["20/2014",260,"002707/2014","Aquisição de artigos de copa e cozinha","INSTITUTO DE BIOLOGIA","SPP","Verificando a possibilidade de atendimento juntamente com a demanda de 2015."]
["47/2014","S/Nº","002096/2014","Alerta sobre preços praticados em pregões eletrônicos na UFRRJ","INSTITUTO DE BIOLOGIA","ARQUIVO","Arquivado após entendimento firmado entre a Pró-reitora de Assuntos Financeiros e a Direção do Instituto de Biologia sobre o cancelamento dos itens com preços praticados acima da média de mercado e devidos esclarecimentos dos técnicos do DMSA."]
["01/2014",275,"002701/2014","Aquisição de café, açúcar, coador e adoçante","INSTITUTO DE BIOLOGIA","CLOG","Pregão nº 88/2014 finalizado em 03/11/14. Já houve empenho (2014NE802417, 2015NE800302) e pagamento (2015OB800319). O processo está disponível na Seção de Sistema de Registro de Preços para solicitar empenhos."]
["S/Nº","S/Nº","007182/2014","Aquisição de 12 automóveis","INSTITUTO DE BIOLOGIA","SEC. ADM. DO DECANATO DE ASSUNTOS FINANCEIROS","Já houve empenho (2014NE801671), pagamentos (2015OB800136 e 2015DF800023) e foi entregue no Almoxarifado em 15/12/14."]

{"sheet":"TD 220100","index":65,"n_rows":13,"n_cols":7,"rows_kept":13,"cut":false,"hidden":false,"merged":[[1,2,2,6]]}
[]
[null,null,{"$f":"IFERROR(VLOOKUP(B3,'Banco de dados'!$A$994:$B$1311,2,0),\"\")","v":"DEPARTAMENTO DE BIOLOGIA ANIMAL"}]
["Centro de Custo",220100]
[]
["Reqmat","Nº DMSA","Nº do processo","Objeto","Setor requisitante","Localização atual","Situação atual"]
["10/2014",969,"005807/2014","Aquisição de itens do grupo 30.36 - Artigos cirúrgicos e de enfermaria","IB - DEPARTAMENTO DE BIOLOGIA ANIMAL","PREGÃO","Aguardando manifestação de interesse (IRP) de outros órgãos para realizar o pregão. Pregão nº 12/2015."]
["11/2014",970,"005725/2014","Aquisição de lâmpadas (grupo 30.29)","ÁREA DE HISTOLOGIA E EMBRIOLOGIA","CLOG","Já houve empenhos (2014NE801699 e 2014NE801698) e  foram entregues no Almoxarifado em 04/11/14 e 05/11/14."]
["01/2014",120,"002699/2014","Aquisição de material de expediente","DEPARTAMENTO DE BIOLOGIA ANIMAL","DIREÇÃO DMSA","Verificando a possibilidade de atendimento juntamente com a demanda de 2015."]
["06/2014",466,"002675/2014","Conserto de quarenta e oito microscópios","COORD. DA AREA DE HISTOLOGIA E EMBRIOLOGIA","ARQUIVO","Já houve empenho(2014NE800832) e pagamento(2014OB805137)"]
["05/2014",465,"002674/2014","Conserto de dois no-breaks","ÁREA DE HISTOLOGIA E EMBRIOLOGIA","SEÇÃO DE CONTROLE","Já houve empenho (2014NE802023) e  foi entregue no Almoxarifado em 19/12/14."]
["03/2014",122,"002706/2014","Aquisição de artigos de higiene e conservação","DEPARTAMENTO DE BIOLOGIA ANIMAL","SPP","Verificando a possibilidade de atendimento juntamente com a demanda de 2015."]
["02/2014",121,"002703/2014","Aquisição de material de artes gráficas e desenho","DEPARTAMENTO DE BIOLOGIA ANIMAL","SSRP","Será atendido junto com a Demanda de 2015 - equipe do projeto"]
["09/2014","S/Nº","006046/2014","Aquisição de itens do grupo 30.11 - Material químico (demais setores)","DEPARTAMENTO DE BIOLOGIA ANIMAL","CADMIN","Buscando informações."]

{"sheet":"TD 220200","index":66,"n_rows":7,"n_cols":7,"rows_kept":7,"cut":false,"hidden":false,"merged":[[1,2,2,6]]}
[]
[null,null,{"$f":"IFERROR(VLOOKUP(B3,'Banco de dados'!$A$994:$B$1311,2,0),\"\")","v":"DEPARTAMENTO DE BOTÂNICA"}]
["Centro de Custo",220200]
[]
["Reqmat","Nº DMSA","Nº do processo","Objeto","Setor requisitante","Localização atual","Situação atual"]
["02/2014",1935,"010080/2014","Aquisição de cadeira de encosto baixo, com l duplo em tubo 7/8, sem regulagem e outros","DEPARTAMENTO DE BOTÂNICA","DIREÇÃO DMSA","Buscando informações."]
["S/Nº","S/Nº","002827/2014","Aquisição de cartuchos","DEPARTAMENTO DE BOTÂNICA","SAPG","Já houve empenho (2014NE800771), pagamento (2014OB808377) e foi entregue no Almoxarifado em 15/07/14."]

{"sheet":"TD 220300","index":67,"n_rows":24,"n_cols":7,"rows_kept":24,"cut":false,"hidden":false,"merged":[[1,2,2,6]]}
[]
[null,null,{"$f":"IFERROR(VLOOKUP(B3,'Banco de dados'!$A$994:$B$1311,2,0),\"\")","v":"DEPARTAMENTO DE CIÊNCIAS FISIOLÓGICAS"}]
["Centro de Custo",220300]
[]
["Reqmat","Nº DMSA","Nº do processo","Objeto","Setor requisitante","Localização atual","Situação atual"]
["10/2014","Nº DMSA","002702/2014","Aquisição de medicamentos de uso humano","DEPARTAMENTO DE CIÊNCIAS FISIOLÓGICAS","ASTEC","Pregão n° 28/2015. houve manifestação de interesse no pregão. Elaborando Edital com as informações e quantitativo dos Órgãos participantes"]
["13/2014",180,"002706/2014","Aquisição de artigos de higiene e conservação","DEPARTAMENTO DE CIÊNCIAS FISIOLÓGICAS","SPP","Verificando a possibilidade de atendimento juntamente com a demanda de 2015."]
["21/2014",1060,"006016/2014","Aquisição de cartuchos hp, toners e tintas (grupo 30.17A)","DEPARTAMENTO DE CIÊNCIAS FISIOLÓGICAS","DMSA","Buscando informações."]
["22/2014",1063,"005203/2014","Contratação de serviços para tratamento preventivo e curativo de descupinização","DEPARTAMENTO DE CIÊNCIAS FISIOLÓGICAS","DEPARTAMENTO DE CIENCIAS FISIOLOGICAS","Realizando alteração de pregoeiro em virtude de férias e em breve o pregão será agendado."]
["24/2014",1175,"006087/2014","Aquisição de material químico (grupo 30.11)","DEPARTAMENTO DE CIÊNCIAS FISIOLÓGICAS","SPP","Pesquisa de preço."]
["25/2014",1176,"005807/2014","Aquisição de itens do grupo 30.36 - Artigos cirúrgicos e de enfermaria","DEPARTAMENTO DE CIÊNCIAS FISIOLÓGICAS","PREGÃO","Aguardando manifestação de interesse (IRP) de outros órgãos para realizar o pregão. Pregão nº 12/2015."]
["27/2014",1744,"008327/2014","Serviço com fornecimento de divisórias","DEPARTAMENTO DE CIÊNCIAS FISIOLÓGICAS","DRA. JAQUELINE","Aguardando solicitação de nova dotação orçamentária junto à PROAF."]
["01/2014",305,"006020/2014","Aquisição de gerador de energia (grupo 52.39)","DEPARTAMENTO DE CIÊNCIAS FISIOLÓGICAS","DEPARTAMENTO DE CIÊNCIAS FISIOLÓGICAS","Buscando informações."]
["08/2014",178,"002707/2014","Aquisição de artigos de copa e cozinha","DEPARTAMENTO DE CIÊNCIAS FISIOLÓGICAS","SPP","Verificando a possibilidade de atendimento juntamente com a demanda de 2015."]
["06/2014",243,"002699/2014","Aquisição de material de expediente","DEPARTAMENTO DE CIÊNCIAS FISIOLÓGICAS","DIREÇÃO DMSA","Verificando a possibilidade de atendimento juntamente com a demanda de 2015."]
["03/2014",205,"002709/2014","Aquisição de gaiolas metabólicas para ratos","DEPARTAMENTO DE CIÊNCIAS FISIOLÓGICAS","SEÇÃO DE CONTROLE","Pregão nº 110/2014 finalizado em 24/11/14. Já houve empenho (2014NE802604) e a data prevista de entrega é até 16/04/15. "]
["03/2014",205,"007036/2014","Aquisição de gaiolas metabólicas para ratos","DEPARTAMENTO DE CIÊNCIAS FISIOLÓGICAS","ARQUIVO","Arquivado porque o material foi atendido pelo processo 002709/2014 (pregão nº 110/2014)."]
["04/2014",306,"007547/2014","Aquisição de racks e mini-isolador para ratos","DEPARTAMENTO DE CIÊNCIAS FISIOLÓGICAS","SPP","Pesquisa de preço."]
["02/2014",203,"006018/2014","Aquisição de equipamentos para laboratório (grupo 52.08)","DEPARTAMENTO DE CIÊNCIAS FISIOLÓGICAS","DIREÇÃO DMSA","Buscando informações."]
["07/2014",177,"002704/2014","Aquisição de material de expediente (papel A4, carta, ofício, etc)","SECRETARIA","CPACS","Consolidar Pesquisas de Preços"]
["07/2014","S/Nº","002705/2014","Aquisição de medicamentos de uso veterinário","DEPARTAMENTO DE CIÊNCIAS FISIOLÓGICAS","SPP","Realizando ajustes após emissão de parecer jurídico."]
["89/2014",1246,"005474/2014","Fornecimento e instalação de 39m² de parede de divisória","DEPARTAMENTO DE CIÊNCIAS FISIOLÓGICAS","SPP","atualização da pesquisa de preços."]
["09/2014",179,"002706/2014","Aquisição de artigos de higiene e conservação","DEPARTAMENTO DE CIÊNCIAS FISIOLÓGICAS","SPP","Verificando a possibilidade de atendimento juntamente com a demanda de 2015."]
["09/2014",179,"002706/2014","Aquisição de artigos de higiene e conservação","SECRETARIA","SPP","Verificando a possibilidade de atendimento juntamente com a demanda de 2015."]

{"sheet":"TD 220410","index":68,"n_rows":16,"n_cols":7,"rows_kept":16,"cut":false,"hidden":false,"merged":[[1,2,2,6]]}
[]
[null,null,{"$f":"IFERROR(VLOOKUP(B3,'Banco de dados'!$A$994:$B$1311,2,0),\"\")","v":"LABORATÓRIO OFICIAL DE DIAGNÓSTICO FITOSSANITÁRIO"}]
["Centro de Custo",220410]
[]
["Reqmat","Nº DMSA","Nº do processo","Objeto","Setor requisitante","Localização atual","Situação atual"]
["01/2014",71,"002699/2014","Aquisição de material de expediente","LABORATÓRIO OFICIAL DE DIAGNÓSTICO FITOSSANITÁRIO","DIREÇÃO DMSA","Verificando a possibilidade de atendimento juntamente com a demanda de 2015."]
["08/2014",956,"005807/2014","Aquisição de itens do grupo 30.36 - Artigos cirúrgicos e de enfermaria","LABORATÓRIO OFICIAL DE DIAGNÓSTICO FITOSSANITÁRIO","PREGÃO","Aguardando manifestação de interesse (IRP) de outros órgãos para realizar o pregão. Pregão nº 12/2015."]
["06/2014","S/Nº","006046/2014","Aquisição de itens do grupo 30.11 - Material químico (demais setores)","LABORATÓRIO OFICIAL DE DIAGNÓSTICO FITOSSANITÁRIO","CADMIN","Buscando informações."]
["05/2014",361,"003179/2014","Aquisição de gás medicinal","LABORATÓRIO OFICIAL DE DIAGNÓSTICO FITOSSANITÁRIO","ANEXADO    23083.003153/2014-45","Pregão nº 13/2015 (antigo nº 99/2014) finalizado em 22/01/15. Está na SSRP para realizar as cópias das atas e em breve um gestor será designado (anexado ao 003153/2014)."]
["05/2014",67,"002700/2014","Aquisição de gás liquefeito de petróleo","LABORATÓRIO OFICIAL DE DIAGNÓSTICO FITOSSANITÁRIO","DIREÇÃO DMSA","Pregão nº 138/2014 finalizado em 14/11/14. O processo está disponível na Seção de Sistema de Registro de Preços para solicitar empenhos."]
["03/2014","S/Nº","002707/2014","Aquisição de artigos de copa e cozinha","LABORATÓRIO OFICIAL DE DIAGNÓSTICO FITOSSANITÁRIO","SPP","Verificando a possibilidade de atendimento juntamente com a demanda de 2015."]
["04/2014",60,"002706/2014","Aquisição de artigos de higiene e conservação","LABORATÓRIO OFICIAL DE DIAGNÓSTICO FITOSSANITÁRIO","SPP","Verificando a possibilidade de atendimento juntamente com a demanda de 2015."]
["02/2014",70,"002704/2014","Aquisição de material de expediente (papel A4, carta, ofício, etc)","LABORATÓRIO OFICIAL DE DIAGNÓSTICO FITOSSANITÁRIO","CPACS","Consolidar Pesquisas de Preços"]
["07/2014",955,"006390/2014","Aquisição de material químico sujeito à controle governamental (grupo 30.11A)","LABORATÓRIO OFICIAL DE DIAGNÓSTICO FITOSSANITÁRIO","ASSESSORIA TECNICA/DMSA","Realizando ajustes na minuta de edital após solicitação de aumento do quantitativo e reenquadramento como SRP, realizadas pelo Pró-reitora de Assuntos Financeiros."]
["S/Nº","S/Nº","004584/2014","Aquisição de material de expediente (copo descartável)","LABORATÓRIO OFICIAL DE DIAGNÓSTICO FITOSSANITÁRIO","SSRP","Já houve empenho (2014NE801928), pagamento (2014OB809871) e foi entregue no Almoxarifado em 05/12/14."]
["S/Nº",1878,"009339/2014","Aquisição de bebedouro industrial - Material do grupo 52.12 aparelhos e utensílios domésticos - (carona)","LABORATÓRIO OFICIAL DE DIAGNÓSTICO FITOSSANITÁRIO","SSRP","Já houve empenho (2014NE802167), mas o prazo de entrega está vencido desde 23/12/14."]

{"sheet":"TD 220500","index":69,"n_rows":6,"n_cols":7,"rows_kept":6,"cut":false,"hidden":false,"merged":[[1,2,2,6]]}
[]
[null,null,{"$f":"IFERROR(VLOOKUP(B3,'Banco de dados'!$A$994:$B$1311,2,0),\"\")","v":"DEPARTAMENTO DE GENÉTICA"}]
["Centro de Custo",220500]
[]
["Reqmat","Nº DMSA","Nº do processo","Objeto","Setor requisitante","Localização atual","Situação atual"]
["70/2014",1462,"003666/2014","Aquisição de cartuchos de tinta","DEPARTAMENTO DE GENÉTICA","SPP","Pesquisa de preço."]

{"sheet":"TD 230000","index":70,"n_rows":9,"n_cols":7,"rows_kept":9,"cut":false,"hidden":false,"merged":[[1,2,2,6]]}
[]
[null,null,{"$f":"IFERROR(VLOOKUP(B3,'Banco de dados'!$A$994:$B$1311,2,0),\"\")","v":"INSTITUTO DE CIÊNCIAS EXATAS"}]
["Centro de Custo",230000]
[]
["Reqmat","Nº DMSA","Nº do processo","Objeto","Setor requisitante","Localização atual","Situação atual"]
["65/2014","S/Nº","001761/2014","Aquisição de béquer, material vidro, graduação graduado capacidade 50, formato forma baixa, adicional com orla e bico e outros","INSTITUTO DE CIÊNCIAS EXATAS","DIREÇÃO DMSA","Buscando informações."]
["67/2014",127,"002707/2014","Aquisição de artigos de copa e cozinha","INSTITUTO DE CIÊNCIAS EXATAS","SPP","Verificando a possibilidade de atendimento juntamente com a demanda de 2015."]
["04/2014","S/Nº","001126/2014","Aquisição de transformador trifásico, potência de 300 kva, para tensão primária (superior) a 13.2kv e outros","INSTITUTO DE CIÊNCIAS EXATAS","ALMOXARIFADO","Já houve empenho (2014NE800282), pagamentos (2014OB804890 e 2014DF801465) e foi entregue no Almoxarifado em 08/04/14.\nJá houve empenho (2014NE800283), pagamento (2014OB802664) e foi entregue no Almoxarifado em 29/04/14."]
["S/Nº","S/Nº","007182/2014","Aquisição de 12 automóveis","INSTITUTO DE CIÊNCIAS EXATAS","SEC. ADM. DO DECANATO DE ASSUNTOS FINANCEIROS","Já houve empenho (2014NE801671), pagamentos (2015OB800136 e 2015DF800023) e foi entregue no Almoxarifado em 15/12/14."]

{"sheet":"TD 230100","index":71,"n_rows":11,"n_cols":7,"rows_kept":11,"cut":false,"hidden":false,"merged":[[1,2,2,6]]}
[]
[null,null,{"$f":"IFERROR(VLOOKUP(B3,'Banco de dados'!$A$994:$B$1311,2,0),\"\")","v":"DEPARTAMENTO DE FÍSICA"}]
["Centro de Custo",230100]
[]
["Reqmat","Nº DMSA","Nº do processo","Objeto","Setor requisitante","Localização atual","Situação atual"]
["01/2014",1118,"006016/2014","Aquisição de cartuchos hp, toners e tintas (grupo 30.17A)","ICE - DEFÍS","DMSA","Buscando informações."]
["01/2014",183,"002701/2014","Aquisição de café, açúcar, coador e adoçante","DEPARTAMENTO DE FÍSICA","CLOG","Pregão nº 88/2014 finalizado em 03/11/14. Já houve empenho (2014NE802417, 2015NE800302) e pagamento (2015OB800319). O processo está disponível na Seção de Sistema de Registro de Preços para solicitar empenhos."]
["05/2014",180,"002706/2014","Aquisição de artigos de higiene e conservação","DEPARTAMENTO DE FÍSICA","SPP","Verificando a possibilidade de atendimento juntamente com a demanda de 2015."]
["03/2014",184,"002704/2014","Aquisição de material de expediente (papel A4, carta, ofício, etc)","DEPARTAMENTO DE FÍSICA","CPACS","Consolidar Pesquisas de Preços"]
["04/2014",181,"002707/2014","Aquisição de artigos de copa e cozinha","DEPARTAMENTO DE FÍSICA","SPP","Verificando a possibilidade de atendimento juntamente com a demanda de 2015."]
["02/2014",152,"002699/2014","Aquisição de material de expediente","DEPARTAMENTO DE FÍSICA","DIREÇÃO DMSA","Verificando a possibilidade de atendimento juntamente com a demanda de 2015."]

{"sheet":"TD 230300","index":72,"n_rows":18,"n_cols":7,"rows_kept":18,"cut":false,"hidden":false,"merged":[[1,2,2,6]]}
[]
[null,null,{"$f":"IFERROR(VLOOKUP(B3,'Banco de dados'!$A$994:$B$1311,2,0),\"\")","v":"DEPARTAMENTO DE QUÍMICA"}]
["Centro de Custo",230300]
[]
["Reqmat","Nº DMSA","Nº do processo","Objeto","Setor requisitante","Localização atual","Situação atual"]
["63/2014",129,"002701/2014","Aquisição de café, açúcar, coador e adoçante","DEPARTAMENTO DE QUÍMICA","CLOG","Pregão nº 88/2014 finalizado em 03/11/14. Já houve empenho (2014NE802417, 2015NE800302) e pagamento (2015OB800319). O processo está disponível na Seção de Sistema de Registro de Preços para solicitar empenhos."]
["66/2014",128,"002706/2014","Aquisição de artigos de higiene e conservação","DEPARTAMENTO DE QUÍMICA","SPP","Verificando a possibilidade de atendimento juntamente com a demanda de 2015."]
["68/2014",16,"002702/2014","Aquisição de medicamentos de uso humano","DEPARTAMENTO DE QUÍMICA","ASTEC","Pregão n° 28/2015. houve manifestação de interesse no pregão. Elaborando Edital com as informações e quantitativo dos Órgãos participantes"]
["69/2014",125,"002699/2014","Aquisição de material de expediente","DEPARTAMENTO DE QUÍMICA","DIREÇÃO DMSA","Verificando a possibilidade de atendimento juntamente com a demanda de 2015."]
["71/2014",124,"002704/2014","Aquisição de material de expediente (papel A4, carta, ofício, etc)","DEPARTAMENTO DE QUÍMICA","CPACS","Consolidar Pesquisas de Preços"]
["79/2014",411,"006018/2014","Aquisição de equipamentos para laboratório (grupo 52.08)","DEPARTAMENTO DE QUÍMICA","DIREÇÃO DMSA","Buscando informações."]
["80/2014",413,"006022/2014","Aquisição de equipamentos eletro-eletrônicos (grupo 52.33)","DEPARTAMENTO DE QUÍMICA","SPP","Pesquisa de preço."]
["80/2014",1375,"003666/2014","Aquisição de cartuchos de tinta","DEPARTAMENTO DE QUÍMICA","SPP","Pesquisa de preço."]
["81/2014",410,"005867/2014","Aquisição de aparelhos e utensílios domésticos (grupo 52.12)","DEPARTAMENTO DE QUÍMICA","SPP","Realizando ajustes após emissão de parecer jurídico."]
["167/2014",1354,"006390/2014","Aquisição de material químico sujeito à controle governamental (grupo 30.11A)","DEPARTAMENTO DE QUÍMICA","ASSESSORIA TECNICA/DMSA","Realizando ajustes na minuta de edital após solicitação de aumento do quantitativo e reenquadramento como SRP, realizadas pelo Pró-reitora de Assuntos Financeiros."]
["166/2014",1353,"006087/2014","Aquisição de material químico (grupo 30.11)","DEPARTAMENTO DE QUÍMICA","SPP","Pesquisa de preço."]
["64/2014","S/Nº","001762/2014","Aquisição de ácido acético, aspecto físico límpido transparente, peso molecular 60,05 e outros","DEPARTAMENTO DE QUÍMICA","CLOG","Já houve empenho (2014NE800833), pagamento (2014OB805108) e foi entregue no Almoxarifado em 23/07/14.\nJá houve empenho (2014NE800836), pagamento (2014OB805125) e foi entregue no Almoxarifado em 24/07/14.\nJá houve empenho (2014NE800834), pagamentos (2014OB807567 e 2014DF801934) e foi entregue no Almoxarifado em 16/08/14.\nJá houve empenho (2014NE800835), pagamentos (2015OB800335 e 2015DF800183) e foi entregue no Almoxarifado em 08/01/15."]
["247/2014",1836,"009267/2014","Adequação do espaco físico da sala da Coordenação do Curso de Química","DEPARTAMENTO DE QUÍMICA","SPP","Pesquisa de preço."]

{"sheet":"TD 240000","index":73,"n_rows":18,"n_cols":7,"rows_kept":18,"cut":false,"hidden":false,"merged":[[1,2,2,6]]}
[]
[null,null,{"$f":"IFERROR(VLOOKUP(B3,'Banco de dados'!$A$994:$B$1311,2,0),\"\")","v":"INSTITUTO DE CIÊNCIAS HUMANAS E SOCIAIS"}]
["Centro de Custo",240000]
[]
["Reqmat","Nº DMSA","Nº do processo","Objeto","Setor requisitante","Localização atual","Situação atual"]
["10/2014",1467,"007152/2014","Aquisição de veículos de transporte não especializado tipo Pick-up","DIREÇÃO","ANEXADO    23083.004907/2014-84 ","Já houve empenho (2014NE801998, 2014NE801999, 2014NE802192), pagamentos (2015OB800232 , 2015OB800413 e 2015DF800135, 2015DF800207) e foi entregue no Almoxarifado em 19/12/14. (anexado ao 004907/2014)."]
["23/2014","S/Nº","006543/2014","Aquisição dos itens do grupo 30.90 - Material de propriedade intelectual - Software sound forge pro 11 e outros","INSTITUTO DE CIÊNCIAS HUMANAS E SOCIAIS","COINFO","Buscando informações."]
["50/2014",1440,"007185/2014","Pagamento de inscrição do servidor José Carlos no Congresso de Secretárops - CONSUB","DEPARTAMENTO DE FILOSOFIA","ARQUIVO","Desarquivado pela CODEP para realizar o relatório anual de cursos  do Governo Federal e em breve será novamente arquivado.\nJá houve empenho (2014NE801510), mas o pagamento ainda não foi efetuado."]
["01/2014","S/Nº","002701/2014","Aquisição de café, açúcar, coador e adoçante","INSTITUTO DE CIÊNCIAS HUMANAS E SOCIAIS","CLOG","Pregão nº 88/2014 finalizado em 03/11/14. Já houve empenho (2014NE802417, 2015NE800302) e pagamento (2015OB800319). O processo está disponível na Seção de Sistema de Registro de Preços para solicitar empenhos."]
["08/2014",944,"004667/2014","Instalação de 26 pontos de rede RJ 45 - CAT6","DIREÇÃO","SEÇÃO DE CONTROLE","O empenho foi emitido (2014NE802428) e transmitido à empresa. Está nas fases de liquidação e pagamento da despesa."]
["06/2014",973,"005736/2014","Aquisição de bebedouro industrial","INSTITUTO DE CIÊNCIAS HUMANAS E SOCIAIS","ANEXADO    23083.005867/2014-98","Realizando ajustes após emisssão do parecer jurídico (anexado ao 005867/2014)."]
["05/2014",117,"002706/2014","Aquisição de artigos de higiene e conservação","DIREÇÃO","SPP","Verificando a possibilidade de atendimento juntamente com a demanda de 2015."]
["03/2014",116,"002704/2014","Aquisição de material de expediente (papel A4, carta, ofício, etc)","DIREÇÃO","CPACS","Consolidar Pesquisas de Preços"]
["04/2014",93,"001931/2014","Pagamento de anuidade de Associação Nacional de Pós-graduaçãoo em Ciências Sociais, referente à 2014","PROGRAMA DE PÓS-GRADUAÇÃO EM CIÊNCIAS SOCIAIS","ARQUIVO","Arquivado porque  houve empenho (2014NE000447) e pagamento (2014OB808074)."]
["04/2014",119,"002707/2014","Aquisição de artigos de copa e cozinha","INSTITUTO DE CIÊNCIAS HUMANAS E SOCIAIS","SPP","Verificando a possibilidade de atendimento juntamente com a demanda de 2015."]
["02/2014",115,"002699/2014","Aquisição de material de expediente","INSTITUTO DE CIÊNCIAS HUMANAS E SOCIAIS","DIREÇÃO DMSA","Verificando a possibilidade de atendimento juntamente com a demanda de 2015."]
["S/Nº","S/Nº","007182/2014","Aquisição de 12 automóveis","INSTITUTO DE CIÊNCIAS HUMANAS E SOCIAIS","SEC. ADM. DO DECANATO DE ASSUNTOS FINANCEIROS","Já houve empenho (2014NE801671), pagamentos (2015OB800136 e 2015DF800023) e foi entregue no Almoxarifado em 15/12/14."]
["S/Nº","S/Nº","002827/2014","Aquisição de cartuchos","INSTITUTO DE CIÊNCIAS HUMANAS E SOCIAIS","SAPG","Já houve empenho (2014NE800771), pagamento (2014OB808377) e foi entregue no Almoxarifado em 15/07/14."]

{"sheet":"TD 250000","index":74,"n_rows":15,"n_cols":7,"rows_kept":15,"cut":false,"hidden":false,"merged":[[1,2,2,6]]}
[]
[null,null,{"$f":"IFERROR(VLOOKUP(B3,'Banco de dados'!$A$994:$B$1311,2,0),\"\")","v":"INSTITUTO DE EDUCAÇÃO"}]
["Centro de Custo",250000]
[]
["Reqmat","Nº DMSA","Nº do processo","Objeto","Setor requisitante","Localização atual","Situação atual"]
["01/2014",150,"002706/2014","Aquisição de artigos de higiene e conservação","DIREÇÃO","SPP","Verificando a possibilidade de atendimento juntamente com a demanda de 2015."]
["05/2014",154,"002701/2014","Aquisição de café, açúcar, coador e adoçante","INSTITUTO DE EDUCAÇÃO","CLOG","Pregão nº 88/2014 finalizado em 03/11/14. Já houve empenho (2014NE802417, 2015NE800302) e pagamento (2015OB800319). O processo está disponível na Seção de Sistema de Registro de Preços para solicitar empenhos."]
["03/2014",152,"002704/2014","Aquisição de material de expediente (papel A4, carta, ofício, etc)","DIREÇÃO","CPACS","Consolidar Pesquisas de Preços"]
["04/2014",153,"002707/2014","Aquisição de artigos de copa e cozinha","INSTITUTO DE EDUCAÇÃO","SPP","Verificando a possibilidade de atendimento juntamente com a demanda de 2015."]
["02/2014",151,"002699/2014","Aquisição de material de expediente","INSTITUTO DE EDUCAÇÃO","DIREÇÃO DMSA","Verificando a possibilidade de atendimento juntamente com a demanda de 2015."]
["02/2014",1849,"009341/2014","Locação de espaço de hotel (2 dias) para realização do V Seminário de Avaliação do PPGEDUC","INSTITUTO DE EDUCAÇÃO","SAPG","Houve empenho (2014NE802438) e pagamento (2015OB800259)."]
["07/2014",1044,"006016/2014","Aquisição de cartuchos hp, toners e tintas (grupo 30.17A)","DIREÇÃO","DMSA","Buscando informações."]
["115/2014","S/Nº","008758/2014","Construção de edificação de um pavimento para atender ao curso de educacao física","INSTITUTO DE EDUCAÇÃO","PRÓ-REITORIA DE PLANEJAMENTO, AVALIAÇÃO E DESENVOLVIMENTO","Buscando informações."]
["S/Nº","S/Nº","007182/2014","Aquisição de 12 automóveis","INSTITUTO DE EDUCAÇÃO","SEC. ADM. DO DECANATO DE ASSUNTOS FINANCEIROS","Já houve empenho (2014NE801671), pagamentos (2015OB800136 e 2015DF800023) e foi entregue no Almoxarifado em 15/12/14."]
["365/2014","S/Nº","011220/2014","Abertura de processo de licitação - Fotocopiadora no IE","SETOR DE CANTINAS","DR. PAULINO","Emissão de parecer Jurídico"]

{"sheet":"TD 250020","index":75,"n_rows":10,"n_cols":7,"rows_kept":10,"cut":false,"hidden":false,"merged":[[1,2,2,6]]}
[]
[null,null,{"$f":"IFERROR(VLOOKUP(B3,'Banco de dados'!$A$994:$B$1311,2,0),\"\")","v":"LICENCIATURA EM EDUCAÇÃO DO CAMPO - PROCAMPO"}]
["Centro de Custo",250020]
[]
["Reqmat","Nº DMSA","Nº do processo","Objeto","Setor requisitante","Localização atual","Situação atual"]
["01/2014",868,"006333/2014","Aquisição de cartuchos HP (grupo 30.17)","CURSO DE LICENCIATURA EM EDUCAÇÃO DO CAMPO","INSTITUTO DE EDUCAÇÃO","Já houve empenho (2014NE802494) e  foi entregue no Almoxarifado em 16/12/14."]
["01/2014",319,"002699/2014","Aquisição de material de expediente","LICENCIATURA EM EDUCAÇÃO DO CAMPO - PROCAMPO","DIREÇÃO DMSA","Verificando a possibilidade de atendimento juntamente com a demanda de 2015."]
["03/2014",318,"002704/2014","Aquisição de material de expediente (papel A4, carta, ofício, etc)","INSTITUTO DE EDUCAÇÃO - DEPARTAMENTO DE TEORIA E PLANEJAMENTO DE ENSINO (DTPE)","CPACS","Consolidar Pesquisas de Preços"]
["02/2014",317,"002703/2014","Aquisição de material de artes gráficas e desenho","LICENCIATURA EM EDUCAÇÃO DO CAMPO - PROCAMPO","SSRP","Será atendido junto com a Demanda de 2015 - equipe do projeto"]
["02/2014","S/Nº","005199/2014","Aquisição de mídia cartão de memória, pen drive, dimensões 59.7mm x 22.3mm x 9.5 mm","LICENCIATURA EM EDUCAÇÃO DO CAMPO - PROCAMPO","ARQUIVO","Arquivado porque o material foi atendido através do processo 002078/2014."]

{"sheet":"TD 250300","index":76,"n_rows":6,"n_cols":7,"rows_kept":6,"cut":false,"hidden":false,"merged":[[1,2,2,6]]}
[]
[null,null,{"$f":"IFERROR(VLOOKUP(B3,'Banco de dados'!$A$994:$B$1311,2,0),\"\")","v":"DEPARTAMENTO DE TEORIA E PLANEJAMENTO DE ENSINO"}]
["Centro de Custo",250300]
[]
["Reqmat","Nº DMSA","Nº do processo","Objeto","Setor requisitante","Localização atual","Situação atual"]
["04/2014",1087,"006016/2014","Aquisição de cartuchos hp, toners e tintas (grupo 30.17A)","DEPARTAMENTO DE TEORIA E PLANEJAMENTO DE ENSINO","DMSA","Buscando informações."]

{"sheet":"TD 260000","index":77,"n_rows":28,"n_cols":7,"rows_kept":28,"cut":false,"hidden":false,"merged":[[1,2,2,6]]}
[]
[null,null,{"$f":"IFERROR(VLOOKUP(B3,'Banco de dados'!$A$994:$B$1311,2,0),\"\")","v":"INSTITUTO DE FLORESTAS"}]
["Centro de Custo",260000]
[]
["Reqmat","Nº DMSA","Nº do processo","Objeto","Setor requisitante","Localização atual","Situação atual"]
["10/2014",1357,"006418/2014","Contratação de serviços para revisão geral de bomba e bicos injetores e substituição dos filtros","INSTITUTO DE FLORESTAS","ARQUIVO","Arquivado após entendimento firmado entre a Direção do DMSA e a Pró Reitoria de Assuntos Financeiros, cujos processos de conserto de veículos deverão ser atendidos pelo contrato de manutenção de automóveis (processo 011591/2013), cuja gestão compete à Prefeitura Universitária. "]
["11/2014",854,"004588/2014","Conserto de sistema de circuito fechado de segurança do Instituto de Florestas","DIREÇÃO","DIVISÃO DE ADMINISTRAÇÃO FINANCEIRA","Pregão nº 108/2014 finalizado em 23/10/14. Já houve empenho (2014NE802108) e o serviço está sendo prestado."]
["12/2014",1507,"007799/2014","Aquisição de estabilizador de 1000 VA características de entrada: tensão nominal 115v/220v","INSTITUTO DE FLORESTAS","DIREÇÃO DMSA","Verificando a possibilidade de atendimento juntamente com a demanda de 2015."]
["13/2014","S/Nº","005201/2014","Contratação de serviço para conserto e reparo da autoclave de tratamento de madeira do IF","INSTITUTO DE FLORESTAS","INSTITUTO DE FLORESTAS","Buscando informações."]
["39/2014",1458,"007549/2014","Aquisição de cadeiras ergométricas","INSTITUTO DE FLORESTAS","CLOG","Já houve empenho (2014NE802194) e a data prevista de entrega é até 23/12/14."]
["40/2014",1459,"008202/2014","Aquisição de toners e cartuchos","INSTITUTO DE FLORESTAS","CLOG","Buscando informações."]
["40/2014",1459,"003666/2014","Aquisição de cartuchos de tinta","DIRETORIA","SPP","Pesquisa de preço."]
["44/2014",1515,"007801/2014","Aquisição de nobreak 2KVA","INSTITUTO DE FLORESTAS","INSTITUTO DE FLORESTAS","Verificando a possibilidade de atendimento através do processo 003598/2013 (pregão nº 112/2014)."]
["45/2014",1514,"007800/2014","Aquisição de nobreak","INSTITUTO DE FLORESTAS","INSTITUTO DE FLORESTAS","Verificando a possibilidade de atendimento através do processo 003598/2013 (pregão nº 112/2014)."]
["47/2014",1748,"009851/2014","Contratação de serviços (conserto/manutenção) de micrótomo microm hm450, RM 235609; Manutenção preventiva","INSTITUTO DE FLORESTAS","SCD","Verificando a situação da carta de exclusividade, que não está válida."]
["01/2014",314,"002699/2014","Aquisição de material de expediente","INSTITUTO DE FLORESTAS","DIREÇÃO DMSA","Verificando a possibilidade de atendimento juntamente com a demanda de 2015."]
["01/2014","S/Nº","002325/2014","Aquisição de empilhadeira florestal com tração 4x4, com motor de aproximadamente 80cv","INSTITUTO DE FLORESTAS","CLOG","Pregão nº 26/2015 (antigo nº 109/2014) com provável abertura em 04/03/15."]
["08/2014",147,"002704/2014","Aquisição de material de expediente (papel A4, carta, ofício, etc)","DIRETORIA","CPACS","Consolidar Pesquisas de Preços"]
["06/2014",145,"002701/2014","Aquisição de café, açúcar, coador e adoçante","INSTITUTO DE FLORESTAS","CLOG","Pregão nº 88/2014 finalizado em 03/11/14. Já houve empenho (2014NE802417, 2015NE800302) e pagamento (2015OB800319). O processo está disponível na Seção de Sistema de Registro de Preços para solicitar empenhos."]
["05/2014",144,"002700/2014","Aquisição de gás liquefeito de petróleo","INSTITUTO DE FLORESTAS","DIREÇÃO DMSA","Pregão nº 138/2014 finalizado em 14/11/14. O processo está disponível na Seção de Sistema de Registro de Preços para solicitar empenhos."]
["03/2014",312,"002706/2014","Aquisição de artigos de higiene e conservação","PPGPDS - PROGRAMA DE PÓS-GRADUAÇÃO EM DESENVOLVIMENTO SUSTENTÁVEL","SPP","Verificando a possibilidade de atendimento juntamente com a demanda de 2015."]
["04/2014",143,"002706/2014","Aquisição de artigos de higiene e conservação","DIRETORIA","SPP","Verificando a possibilidade de atendimento juntamente com a demanda de 2015."]
["04/2014",313,"002707/2014","Aquisição de artigos de copa e cozinha","INSTITUTO DE FLORESTAS","SPP","Verificando a possibilidade de atendimento juntamente com a demanda de 2015."]
["02/2014",315,"002704/2014","Aquisição de material de expediente (papel A4, carta, ofício, etc)","PPGPDS - PROGRAMA DE PÓS-GRADUAÇÃO EM DESENVOLVIMENTO SUSTENTÁVEL","CPACS","Consolidar Pesquisas de Preços"]
["07/2014",146,"002699/2014","Aquisição de material de expediente","INSTITUTO DE FLORESTAS","DIREÇÃO DMSA","Verificando a possibilidade de atendimento juntamente com a demanda de 2015."]
["09/2014",148,"002707/2014","Aquisição de artigos de copa e cozinha","INSTITUTO DE FLORESTAS","SPP","Verificando a possibilidade de atendimento juntamente com a demanda de 2015."]
["42/2014",1460,"007272/2014","Serviço de instalação e programação de 4 (quatro) placas de 8 ramais Corp 16000","DIRETORIA","INSTITUTO DE FLORESTAS","As propostas serão solicitadas em breve para realização de dispensa."]
["S/Nº","S/Nº","007182/2014","Aquisição de 12 automoveis.reqmat.s/n/ichs/icsa/ie/ice/it ia/iv/iz/ib/if/itr/im...alexis rosa nummer e outros","INSTITUTO DE FLORESTAS","SEC. ADM. DO DECANATO DE ASSUNTOS FINANCEIROS","Já houve empenho (2014NE801671), pagamentos (2015OB800136 e 2015DF800023) e foi entregue no Almoxarifado em 15/12/14."]

{"sheet":"TD 260200","index":78,"n_rows":13,"n_cols":7,"rows_kept":13,"cut":false,"hidden":false,"merged":[[1,2,2,6]]}
[]
[null,null,{"$f":"IFERROR(VLOOKUP(B3,'Banco de dados'!$A$994:$B$1311,2,0),\"\")","v":"DEPARTAMENTO DE PRODUTOS FLORESTAIS"}]
["Centro de Custo",260200]
[]
["Reqmat","Nº DMSA","Nº do processo","Objeto","Setor requisitante","Localização atual","Situação atual"]
["01/2014",284,"002700/2014","Aquisição de gás liquefeito de petróleo","DEPARTAMENTO DE PRODUTOS FLORESTAIS","DIREÇÃO DMSA","Pregão nº 138/2014 finalizado em 14/11/14. O processo está disponível na Seção de Sistema de Registro de Preços para solicitar empenhos."]
["01/2014",284,"003179/2014","Aquisição de gás medicinal","DEPARTAMENTO DE PRODUTOS FLORESTAIS","ANEXADO    23083.003153/2014-45","Pregão nº 13/2015 (antigo nº 99/2014) finalizado em 22/01/15. Está na SSRP para realizar as cópias das atas e em breve um gestor será designado (anexado ao 003153/2014)."]
["06/2014",289,"002707/2014","Aquisição de artigos de copa e cozinha","DEPARTAMENTO DE PRODUTOS FLORESTAIS","SPP","Verificando a possibilidade de atendimento juntamente com a demanda de 2015."]
["05/2014",288,"002704/2014","Aquisição de material de expediente (papel A4, carta, ofício, etc)","DEPARTAMENTO DE PRODUTOS FLORESTAIS","CPACS","Consolidar Pesquisas de Preços"]
["03/2014",286,"002699/2014","Aquisição de material de expediente","DEPARTAMENTO DE PRODUTOS FLORESTAIS","DIREÇÃO DMSA","Verificando a possibilidade de atendimento juntamente com a demanda de 2015."]
["04/2014",287,"002703/2014","Aquisição de material de artes gráficas e desenho","DEPARTAMENTO DE PRODUTOS FLORESTAIS","SSRP","Será atendido junto com a Demanda de 2015 - equipe do projeto"]
["02/2014",285,"002701/2014","Aquisição de café, açúcar, coador e adoçante","DEPARTAMENTO DE PRODUTOS FLORESTAIS","CLOG","Pregão nº 88/2014 finalizado em 03/11/14. Já houve empenho (2014NE802417, 2015NE800302) e pagamento (2015OB800319). O processo está disponível na Seção de Sistema de Registro de Preços para solicitar empenhos."]
["07/2014",290,"002706/2014","Aquisição de artigos de higiene e conservação","DEPARTAMENTO DE PRODUTOS FLORESTAIS","SPP","Verificando a possibilidade de atendimento juntamente com a demanda de 2015."]

{"sheet":"TD 270000","index":79,"n_rows":28,"n_cols":7,"rows_kept":28,"cut":false,"hidden":false,"merged":[[1,2,2,6]]}
[]
[null,null,{"$f":"IFERROR(VLOOKUP(B3,'Banco de dados'!$A$994:$B$1311,2,0),\"\")","v":"INSTITUTO DE TECNOLOGIA"}]
["Centro de Custo",270000]
[]
["Reqmat","Nº DMSA","Nº do processo","Objeto","Setor requisitante","Localização atual","Situação atual"]
["10/2014",1014,"005324/2014","Instalação de data show multimídia","INSTITUTO DE TECNOLOGIA","ASTEC","Elaboração da minuta de edital."]
["15/2014","S/Nº","008047/2014","Confecção de calçada, reforma de escada e colocação de revestimento em área final do Pavilhao de Aulas","INSTITUTO DE TECNOLOGIA","ARQUIVO","O processo foi encaminhado da Secretaria Administrativa do Instituto de Tecnologia à SAPG em 29/01/15 (carga no Sistema Protocolo), mas ainda não chegou in loco."]
["16/2014",1523,"008048/2014","Contratação de serviço de pessoa jurídica para recuperação emergencial de rede de esgoto","INSTITUTO DE TECNOLOGIA","ARQUIVO","Está sendo atendido pelo 010408/2014 e provavelmente em breve será encaminhado para empenho."]
["17/2014","S/Nº","008026/2014","Recuperação de área no Pavilhão de Aulas do IT para almoxarifado de produtos limpeza e instalação de tanques de lavagem","INSTITUTO DE TECNOLOGIA","INSTITUTO DE TECNOLOGIA","Buscando informações."]
["18/2014",1638,"008027/2014","Recuperação de tetos em gesso nos laboratórios do DAU","DEPARTAMENTO DE ARQUITETURA E URBANISMO","DIVISÃO DE ADMINISTRAÇÃO FINANCEIRA","Emissão da Nota de empenho"]
["18/2014","S/Nº","004157/2014","Aquisição de cadeira escritório, material revestimento assento e encosto tecido 100 poliester e outros","INSTITUTO DE TECNOLOGIA","DIREÇÃO DMSA","Buscando informações."]
["19/2014",1949,"010408/2014","Recuperação na rede de esgoto do pavilhão de aulas do IT","INSTITUTO DE TECNOLOGIA","DIVISÃO DE CONTABILIDADE","Houve empenho (2015NE800197) e está elaborando a minuta de contrato."]
["20/2014",1862,"009286/2014","Pagamento de inscriçãoo no V SIMGEO Simpósio Brasileiro de Ciências Geodésicas e Tecnologias da Geoinformação","DEPARTAMENTO DE ENGENHARIA","ARQUIVO","Desarquivado pela CODEP para realizar o relatório anual de cursos  do Governo Federal e em breve será novamente arquivado.\nArquivado porque  houve empenho (2014NE802153) e pagamento (2014OB808998)."]
["01/2014","S/Nº","004035/2014","Aquisição de cadeira escritório , material estrutura metálica, material revestimento assento e encosto tecido 100 e outros","INSTITUTO DE TECNOLOGIA","INSTITUTO DE TECNOLOGIA","Buscando informações."]
["01/2014",424,"002699/2014","Aquisição de material de expediente","INSTITUTO DE TECNOLOGIA","DIREÇÃO DMSA","Verificando a possibilidade de atendimento juntamente com a demanda de 2015."]
["08/2014",977,"005738/2014","Aquisição de quadro geral 3f + n+ t 600a acompanha kit","INSTITUTO DE TECNOLOGIA","ARQUIVO","Arquivado porque o material foi comprado através do cartão corporativo."]
["06/2014","S/Nº","003137/2014","Aquisição de ventilador de parede oscilante 60 cm bivolt","INSTITUTO DE TECNOLOGIA","SEÇÃO DE CONTROLE","Já houve empenho (2014NE801387), pagamentos (2014OB806995 e 2014DF801832) e foi entregue no Almoxarifado em 15/09/14."]
["05/2014",423,"002703/2014","Aquisição de material de artes gráficas e desenho","INSTITUTO DE TECNOLOGIA","SSRP","Será atendido junto com a Demanda de 2015 - equipe do projeto"]
["05/2014","S/Nº","003094/2014","Recuperação da rede de gás do Laboratório de Microbiologia e Fermentação","DEPARTAMENTO DE TECNOLOGIA E ALIMENTOS","ARQUIVO","Já houve empenho (2014NE800708) e pagamento (2014OB804537)"]
["03/2014",427,"002707/2014","Aquisição de artigos de copa e cozinha","INSTITUTO DE TECNOLOGIA","SPP","Verificando a possibilidade de atendimento juntamente com a demanda de 2015."]
["03/2014",209,"002707/2014","Aquisição de artigos de copa e cozinha","INSTITUTO DE TECNOLOGIA","SPP","Verificando a possibilidade de atendimento juntamente com a demanda de 2015."]
["04/2014",425,"002704/2014","Aquisição de material de expediente (papel A4, carta, ofício, etc)","DEPARTAMENTO DE ARQUITETURA E URBANISMO","CPACS","Consolidar Pesquisas de Preços"]
["02/2014",210,"002704/2014","Aquisição de material de expediente (papel A4, carta, ofício, etc)","DIRETORIA","CPACS","Consolidar Pesquisas de Preços"]
["02/2014",426,"002706/2014","Aquisição de artigos de higiene e conservação","DEPARTAMENTO DE ARQUITETURA E URBANISMO","SPP","Verificando a possibilidade de atendimento juntamente com a demanda de 2015."]
["07/2014","S/Nº","004486/2014","Fornecimento e instalação de cabo óptico multimodo,etc","INSTITUTO DE TECNOLOGIA","COINFO","Buscando informações."]
["78/2014","S/Nº","003939/2014","Obras nos Laboratórios de Microbiologia de Alimentos e Fermentações para o conserto de vazamento de gás","DEPARTAMENTO DE TECNOLOGIA DE ALIMENTOS","ARQUIVO","Arquivado porque a contratação da empresa para adequação da tubulação e conserto do vazamento de gás nos Laboratórios de Microbiologia de Alimentos e Fermentações do DTA já foi efetuada através do processo 003094/2014 e gerou a emissão da nota de empenho 2014NE800708. Além disso, o referido empenho já foi transmitido à empresa e a previsão de início dos serviços é na próxima semana (despacho em 04/06/14)."]
["09/2014","S/Nº","005200/2014","Instalação de 16 aparelhos ar condicionados split (12 de 80.000 btus e 4 de 60.000 btus)","INSTITUTO DE TECNOLOGIA","DEPARTAMENTO DE CONTABILIDADE E FINANÇAS","Buscando informações."]
["S/Nº","S/Nº","007182/2014","Aquisição de 12 automóveis","INSTITUTO DE TECNOLOGIA","SEC. ADM. DO DECANATO DE ASSUNTOS FINANCEIROS","Já houve empenho (2014NE801671), pagamentos (2015OB800136 e 2015DF800023) e foi entregue no Almoxarifado em 15/12/14."]

{"sheet":"TD 270400","index":80,"n_rows":12,"n_cols":7,"rows_kept":12,"cut":false,"hidden":false,"merged":[[1,2,2,6]]}
[]
[null,null,{"$f":"IFERROR(VLOOKUP(B3,'Banco de dados'!$A$994:$B$1311,2,0),\"\")","v":"DEPARTAMENTO DE TECNOLOGIA DE ALIMENTOS"}]
["Centro de Custo",270400]
[]
["Reqmat","Nº DMSA","Nº do processo","Objeto","Setor requisitante","Localização atual","Situação atual"]
["39/2014",1840,"009343/2014","Adequação da planta de frutas do DTA","DEPARTAMENTO DFE TECNOLOGIA DE ALIMENTOS","DIREÇÃO DMSA","Buscando informações."]
["01/2014",216,"002700/2014","Aquisição de gás liquefeito de petróleo","DEPARTAMENTO DE TECNOLOGIA DE ALIMENTOS","DIREÇÃO DMSA","Pregão nº 138/2014 finalizado em 14/11/14. O processo está disponível na Seção de Sistema de Registro de Preços para solicitar empenhos."]
["06/2014",217,"002701/2014","Aquisição de café, açúcar, coador e adoçante","DEPARTAMENTO DE TECNOLOGIA DE ALIMENTOS","CLOG","Pregão nº 88/2014 finalizado em 03/11/14. Já houve empenho (2014NE802417, 2015NE800302) e pagamento (2015OB800319). O processo está disponível na Seção de Sistema de Registro de Preços para solicitar empenhos."]
["05/2014",219,"002704/2014","Aquisição de material de expediente (papel A4, carta, ofício, etc)","DEPARTAMENTOS DE TECNOLOGIA DE ALIMENTOS","CPACS","Consolidar Pesquisas de Preços"]
["03/2014",220,"002699/2014","Aquisição de material de expediente","DEPARTAMENTO DE TECNOLOGIA DE ALIMENTOS","DIREÇÃO DMSA","Verificando a possibilidade de atendimento juntamente com a demanda de 2015."]
["04/2014",218,"002706/2014","Aquisição de artigos de higiene e conservação","DEPARTAMENTO DE TECNOLOGIA DE ALIMENTOS","SPP","Verificando a possibilidade de atendimento juntamente com a demanda de 2015."]
["02/2014",215,"003204/2014","Aquisição de gêneros alimentícios","DEPARTAMENTO DE TECNOLOGIA DE ALIMENTOS","DIREÇÃO DMSA","Pregão nº 14/2015 (antigo nº 117/2014) iniciado em 02/02/15."]

{"sheet":"TD 280000","index":81,"n_rows":21,"n_cols":7,"rows_kept":21,"cut":false,"hidden":false,"merged":[[1,2,2,6]]}
[]
[null,null,{"$f":"IFERROR(VLOOKUP(B3,'Banco de dados'!$A$994:$B$1311,2,0),\"\")","v":"INSTITUTO DE VETERINÁRIA"}]
["Centro de Custo",280000]
[]
["Reqmat","Nº DMSA","Nº do processo","Objeto","Setor requisitante","Localização atual","Situação atual"]
["20/2014",114,"006018/2014","Aquisição de equipamentos para laboratório (grupo 52.08)","DIRETORIA","DIREÇÃO DMSA","Buscando informações."]
["22/2014",72,"002701/2014","Aquisição de café, açúcar, coador e adoçante","INSTITUTO DE VETERINÁRIA","CLOG","Pregão nº 88/2014 finalizado em 03/11/14. Já houve empenho (2014NE802417, 2015NE800302) e pagamento (2015OB800319). O processo está disponível na Seção de Sistema de Registro de Preços para solicitar empenhos."]
["23/2014",73,"002706/2014","Aquisição de artigos de higiene e conservação","SECRETARIA DA DIRETORIA","SPP","Verificando a possibilidade de atendimento juntamente com a demanda de 2015."]
["24/2014",74,"002704/2014","Aquisição de material de expediente (papel A4, carta, ofício, etc)","SECRETARIA DA DIRETORIA","CPACS","Consolidar Pesquisas de Preços"]
["25/2014",75,"002699/2014","Aquisição de material de expediente","INSTITUTO DE VETERINÁRIA","DIREÇÃO DMSA","Verificando a possibilidade de atendimento juntamente com a demanda de 2015."]
["26/2014",76,"002707/2014","Aquisição de artigos de copa e cozinha","INSTITUTO DE VETERINÁRIA","SPP","Verificando a possibilidade de atendimento juntamente com a demanda de 2015."]
["53/2014",1043,"006016/2014","Aquisição de cartuchos hp, toners e tintas (grupo 30.17A)","DIRETORIA","DMSA","Buscando informações."]
["54/2014",1148,"006008/2014","Aquisição de material hidráulico (grupo 30.24)","DIRETORIA","ASTEC","Elaboração da minuta de edital."]
["74/2014",1803,"009585/2014","Instalação e fornecimento porta de madeira almofadada de madeira maciça, etc. no térreo do prédio principal do IV","INSTITUTO DE VETERINÁRIA","DIREÇÃO DMSA","Buscando informações."]
["75/2014",1804,"009586/2014","Restauração com substituição de peças de janelas de esquadria de madeira ,etc","INSTITUTO DE VETERINÁRIA","SPP","Pesquisa de preço."]
["79/2014",1778,"009588/2014","Conserto de carteiras montadas em longarinas de 03 lugares","INSTITUTO DE VETERINÁRIA","SPP","Pesquisa de preço."]
["01/2014",61,"004380/2014","Aquisição de capela de exaustão","DEPARTAMENTO DE PARASITOLOGIA ANIMAL","ARQUIVO","Já houve empenho (2014NE801379) e foi entregue no Almoxarifado em 17/09/14."]
["08/2014",958,"005725/2014","Aquisição de lâmpadas (grupo 30.29)","DEPARTAMENTO DE MICROBIOLOGIA E IMUNOLOGIA VETERINÁRIA","CLOG","Já houve empenho (2014NE801699 e 2014NE801698) e  foi entregue no Almoxarifado em 04/11/14 e 05/11/14."]
["59/2014",1173,"005324/2014","Instalação de data show multimídia","DIRETORIA DO IV","ASTEC","Elaboração da minuta de edital."]
["S/Nº","S/Nº","007182/2014","Aquisição de 12 automóveis","INSTITUTO DE VETERINÁRIA","SEC. ADM. DO DECANATO DE ASSUNTOS FINANCEIROS","Já houve empenho (2014NE801671), pagamentos (2015OB800136 e 2015DF800023) e foi entregue no Almoxarifado em 15/12/14."]
["S/Nº","S/Nº","002827/2014","Aquisição de cartuchos","INSTITUTO DE VETERINÁRIA","SAPG","Já houve empenho (2014NE800771), pagamento (2014OB808377) e foi entregue no Almoxarifado em 15/07/14."]

{"sheet":"TD 280010","index":82,"n_rows":29,"n_cols":7,"rows_kept":29,"cut":false,"hidden":false,"merged":[[1,2,2,6]]}
[]
[null,null,{"$f":"IFERROR(VLOOKUP(B3,'Banco de dados'!$A$994:$B$1311,2,0),\"\")","v":"HOSPITAL VETERINÁRIO"}]
["Centro de Custo",280010]
[]
["Reqmat","Nº DMSA","Nº do processo","Objeto","Setor requisitante","Localização atual","Situação atual"]
["10/2014",1040,"004921/2014","Aquisição de mesa cirúrgica para grandes animais (equinos)","HOSPITAL VETERINÁRIO","SPP","O órgão não autorizou a solicitação de carona."]
["11/2014",1046,"004957/2014","Kit artroscopia veterinária","HOSPITAL VETERINÁRIO","SEC. ADM. DO DEPTO DE CONTABILIDADE E FINANÇAS","Realizando ajustes após emissão de parecer jurídico."]
["12/2014",1039,"004920/2014","Aquisição de sistema de vídeo endoscópio veterinário (grupo 52.08)","HOSPITAL VETERINÁRIO","SPP","Em 22/09/14 o processo chegou à SSRP, com despacho da Profª. Nidia informando que a aquisição deverá ocorrer em 2015."]
["13/2014",1047,"004957/2014","Tronco de concentração para equinos","HOSPITAL VETERINÁRIO","SEC. ADM. DO DEPTO DE CONTABILIDADE E FINANÇAS","Realizando ajustes após emissão de parecer jurídico."]
["14/2014",1048,"004957/2014","Bomba de infusão linear peristáltica de uso veterinário","HOSPITAL VETERINÁRIO","SEC. ADM. DO DEPTO DE CONTABILIDADE E FINANÇAS","Realizando ajustes após emissão de parecer jurídico."]
["16/2014",1051,"004957/2014","Serra óssea oscilatória à bateria","HOSPITAL VETERINÁRIO","SEC. ADM. DO DEPTO DE CONTABILIDADE E FINANÇAS","Realizando ajustes após emissão de parecer jurídico."]
["17/2014",1049,"004957/2014","Conjunto de canil em aço inoxidável 304","HOSPITAL VETERINÁRIO","SEC. ADM. DO DEPTO DE CONTABILIDADE E FINANÇAS","Realizando ajustes após emissão de parecer jurídico."]
["18/2014",1033,"004906/2014","Aquisição de videogastroscópio pediátrico ultra-fino Olympus (grupo 52.08)","HOSPITAL VETERINÁRIO","CLOG","Aguardando autorização da PROAF para empenho."]
["19/2014",1050,"004957/2014","Central de análise de holter com licença de uso de software central","HOSPITAL VETERINÁRIO","SEC. ADM. DO DEPTO DE CONTABILIDADE E FINANÇAS","Realizando ajustes após emissão de parecer jurídico."]
["20/2014",1032,"004905/2014","Aquisição de lâmpada xenon de 300w para CLV-U20","HOSPITAL VETERINÁRIO","SEÇÃO DE CONTROLE","Já houve empenho (2014NE802422) e foi entregue no Almoxarifado em 15/12/14."]
["21/2014",1101,"006016/2014","Aquisição de cartuchos hp, toners e tintas (grupo 30.17A)","HOSPITAL VETERINÁRIO","DMSA","Buscando informações."]
["23/2014",1943,"010220/2014","Aquisição de lâmina para microscopia e etc","HOSPITAL VETERINÁRIO","SEÇÃO DE CONTROLE","Já houve empenho (2014NE802464), mas o prazo de entrega está vencido desde 04/01/15.\nJá houve empenho (2014NE802472) e foi entregue no Almoxarifado em 30/12/14."]
["01/2014",491,"002701/2014","Aquisição de café, açúcar, coador e adoçante","HOSPITAL VETERINÁRIO","CLOG","Pregão nº 88/2014 finalizado em 03/11/14. Já houve empenho (2014NE802417, 2015NE800302) e pagamento (2015OB800319). O processo está disponível na Seção de Sistema de Registro de Preços para solicitar empenhos."]
["08/2014",1034,"004907/2014","Aquisição de caminhonete para trabalho rural com motor a diesel","HOSPITAL VETERINÁRIO","ALMOXARIFADO","Já houve empenho (2014NE801998, 2014NE801999, 2014NE802192), pagamentos (2015OB800232 , 2015OB800413 e 2015DF800135, 2015DF800207) e foi entregue no Almoxarifado em 19/12/14."]
["06/2014",492,"002706/2014","Aquisição de artigos de higiene e conservação","HOSPITAL VETERINÁRIO","SPP","Verificando a possibilidade de atendimento juntamente com a demanda de 2015."]
["05/2014",1643,"008024/2014","Aquisição de cartuchos","HOSPITAL VETERINÁRIO","ARQUIVO","Arquivado porque o material está sendo atendido pelo processo 003666/2014."]
["05/2014",501,"003188/2014","Aquisição de medicamentos de uso veterinário","HOSPITAL VETERINÁRIO","SEÇÃO DE CONTROLE","Pregão nº 142/2014 finalizado em 29/12/14. O processo está disponível na Seção de Sistema de Registro de Preços para solicitar empenhos. "]
["03/2014",490,"002699/2014","Aquisição de material de expediente","HOSPITAL VETERINÁRIO","DIREÇÃO DMSA","Verificando a possibilidade de atendimento juntamente com a demanda de 2015."]
["04/2014",489,"002704/2014","Aquisição de material de expediente (papel A4, carta, ofício, etc)","HOSPITAL VETERINÁRIO","CPACS","Consolidar Pesquisas de Preços"]
["02/2014",500,"003182/2014","Aquisição de medicamentos de uso humano","HOSPITAL VETERINÁRIO","SPP","Pesquisa de preço."]
["07/2014",932,"005204/2014","Aquisição de artigos cirúrgicos e de enfermaria (somente para o Hospital Veterinário (grupo 30.36)","HOSPITAL VETERINÁRIO","SPP","Pesquisa de preço."]
["09/2014",1031,"004882/2014","Aquisição de trailer para transporte de animais","HOSPITAL VETERINÁRIO","DIVISÃO DE ADMINISTRAÇÃO FINANCEIRA","Pregão nº 09/2015 (antigo nº 130/2014) com provável abertura em 02/03/15."]
["09/2014",1775,"008694/2014","Aquisição de materiais químicos","INSTITUTO DE VETERINÁRIA","SEÇÃO DE CONTROLE","Já houve empenho (2014NE802488) e foi entregue no Almoxarifado em 22/12/14."]
["S/Nº","S/Nº","010568/2014","Aquisição de lâmina para microscopia - fosca, lapidada, 26x70mm, caixa com 50 unidades e outros","HOSPITAL VETERINÁRIO","SEÇÃO DE CONTROLE","Já houve empenhos (2014NE802481 e 2014NE802487), mas o prazo de entrega está vencido e um ofício de cobrança foi emitido à empresa em 23/01/15.\nJá houve empenho (2014NE802482), mas o prazo de entrega está vencido desde 05/01/15.\nJá houve empenho (2014NE802484) e foi entregue no Almoxarifado em 06/01/15.\nJá houve empenho (2014NE802486) e foi entregue no Almoxarifado em 30/12/14."]

{"sheet":"TD 280100","index":83,"n_rows":11,"n_cols":7,"rows_kept":11,"cut":false,"hidden":false,"merged":[[1,2,2,6]]}
[]
[null,null,{"$f":"IFERROR(VLOOKUP(B3,'Banco de dados'!$A$994:$B$1311,2,0),\"\")","v":"DEPARTAMENTO DE EPIDEMIOLOGIA E SAÚDE PÚBLICA"}]
["Centro de Custo",280100]
[]
["Reqmat","Nº DMSA","Nº do processo","Objeto","Setor requisitante","Localização atual","Situação atual"]
["44/2014",199,"002701/2014","Aquisição de café, açúcar, coador e adoçante","DEPARTAMENTO DE EPIDEMIOLOGIA E SAÚDE PÚBLICA","CLOG","Pregão nº 88/2014 finalizado em 03/11/14. Já houve empenho (2014NE802417, 2015NE800302) e pagamento (2015OB800319). O processo está disponível na Seção de Sistema de Registro de Preços para solicitar empenhos."]
["45/2014",198,"002704/2014","Aquisição de material de expediente (papel A4, carta, ofício, etc)","DEPARTAMENTO DE EPIDEMIOLOGIA E SAÚDE PÚBLICA","CPACS","Consolidar Pesquisas de Preços"]
["46/2014",200,"002707/2014","Aquisição de artigos de copa e cozinha","DEPARTAMENTO DE EPIDEMIOLOGIA E SAÚDE PÚBLICA","SPP","Verificando a possibilidade de atendimento juntamente com a demanda de 2015."]
["47/2014",201,"002706/2014","Aquisição de artigos de higiene e conservação","DEPARTAMENTO DE EPIDEMIOLOGIA E SAÚDE PÚBLICA","SPP","Verificando a possibilidade de atendimento juntamente com a demanda de 2015."]
["72/2014","S/Nº","006046/2014","Aquisição de itens do grupo 30.11 - Material químico (demais setores)","DEPARTAMENTO DE EPIDEMIOLOGIA E SAÚDE PÚBLICA","CADMIN","Buscando informações."]
["73/2014",934,"005807/2014","Aquisição de itens do grupo 30.36 - Artigos cirúrgicos e de enfermaria","DEPARTAMENTO DE EPIDEMIOLOGIA E SAÚDE PÚBLICA","PREGÃO","Aguardando manifestação de interesse (IRP) de outros órgãos para realizar o pregão. Pregão nº 12/2015."]

{"sheet":"TD 280200","index":84,"n_rows":11,"n_cols":7,"rows_kept":11,"cut":false,"hidden":false,"merged":[[1,2,2,6]]}
[]
[null,null,{"$f":"IFERROR(VLOOKUP(B3,'Banco de dados'!$A$994:$B$1311,2,0),\"\")","v":"DEPARTAMENTO DE MEDICINA E CIRURGIA VETERINÁRIA"}]
["Centro de Custo",280200]
[]
["Reqmat","Nº DMSA","Nº do processo","Objeto","Setor requisitante","Localização atual","Situação atual"]
["01/2014",195,"002701/2014","Aquisição de café, açúcar, coador e adoçante","DEPARTAMENTO DE MEDICINA E CIRURGIA VETERINÁRIA","CLOG","Pregão nº 88/2014 finalizado em 03/11/14. Já houve empenho (2014NE802417, 2015NE800302) e pagamento (2015OB800319). O processo está disponível na Seção de Sistema de Registro de Preços para solicitar empenhos."]
["06/2014",196,"002703/2014","Aquisição de material de artes gráficas e desenho","DEPARTAMENTO DE MEDICINA E CIRURGIA VETERINÁRIA","SSRP","Será atendido junto com a Demanda de 2015 - equipe do projeto"]
["05/2014",334,"002704/2014","Aquisição de material de expediente (papel A4, carta, ofício, etc)","DEPARTAMENTO DE MEDICINA E CIRURGIA VETERINÁRIA","CPACS","Consolidar Pesquisas de Preços"]
["03/2014",193,"002706/2014","Aquisição de artigos de higiene e conservação","DEPARTAMENTO DE MEDICINA E CIRURGIA VETERINÁRIA","SPP","Verificando a possibilidade de atendimento juntamente com a demanda de 2015."]
["04/2014",192,"002700/2014","Aquisição de gás liquefeito de petróleo","DEPARTAMENTO DE MEDICINA E CIRURGIA VETERINÁRIA","DIREÇÃO DMSA","Pregão nº 138/2014 finalizado em 14/11/14. O processo está disponível na Seção de Sistema de Registro de Preços para solicitar empenhos."]
["02/2014",194,"002699/2014","Aquisição de material de expediente","DEPARTAMENTO DE MEDICINA E CIRURGIA VETERINÁRIA","DIREÇÃO DMSA","Verificando a possibilidade de atendimento juntamente com a demanda de 2015."]

{"sheet":"TD 280300","index":85,"n_rows":12,"n_cols":7,"rows_kept":12,"cut":false,"hidden":false,"merged":[[1,2,2,6]]}
[]
[null,null,{"$f":"IFERROR(VLOOKUP(B3,'Banco de dados'!$A$994:$B$1311,2,0),\"\")","v":"DEPTO DE MICROBIOLOGIA E IMUNOLOGIA VETERINÁRIA"}]
["Centro de Custo",280300]
[]
["Reqmat","Nº DMSA","Nº do processo","Objeto","Setor requisitante","Localização atual","Situação atual"]
["01/2014",105,"002700/2014","Aquisição de gás liquefeito de petróleo","DEPTO DE MICROBIOLOGIA E IMUNOLOGIA VETERINÁRIA","DIREÇÃO DMSA","Pregão nº 138/2014 finalizado em 14/11/14. O processo está disponível na Seção de Sistema de Registro de Preços para solicitar empenhos."]
["06/2014",262,"006018/2014","Aquisição de equipamentos para laboratório (grupo 52.08)","DEPARTAMENTO DE MICROBIOLOGIA E IMUNOLOGIA VETERINÁRIA","DIREÇÃO DMSA","Buscando informações."]
["05/2014",185,"006018/2014","Aquisição de equipamentos para laboratório (grupo 52.08)","DEPARTAMENTO DE MICROBIOLOGIA E IMUNOLOGIA VETERINÁRIA","DIREÇÃO DMSA","Buscando informações."]
["03/2014",102,"002706/2014","Aquisição de artigos de higiene e conservação","DEPTO DE MICROBIOLOGIA E IMUNOLOGIA VETERINÁRIA","SPP","Verificando a possibilidade de atendimento juntamente com a demanda de 2015."]
["04/2014",101,"002704/2014","Aquisição de material de expediente (papel A4, carta, ofício, etc)","DEPARTAMENTO DE MICROBIOLOGIA","CPACS","Consolidar Pesquisas de Preços"]
["02/2014",103,"002699/2014","Aquisição de material de expediente","DEPTO DE MICROBIOLOGIA E IMUNOLOGIA VETERINÁRIA","DIREÇÃO DMSA","Verificando a possibilidade de atendimento juntamente com a demanda de 2015."]
["09/2014",959,"005735/2014","Aquisição de equipamentos industriais - banho Maria, moinho, máquina de costura, fogão, liquidificador e seladora (grupo 52.28)","DEPTO DE MICROBIOLOGIA E IMUNOLOGIA VETERINÁRIA","ASSESSORIA TECNICA/DMSA","Pesquisa de preço."]

{"sheet":"TD 280400","index":86,"n_rows":12,"n_cols":7,"rows_kept":12,"cut":false,"hidden":false,"merged":[[1,2,2,6]]}
[]
[null,null,{"$f":"IFERROR(VLOOKUP(B3,'Banco de dados'!$A$994:$B$1311,2,0),\"\")","v":"DEPARTAMENTO DE PARASITOLOGIA ANIMAL"}]
["Centro de Custo",280400]
[]
["Reqmat","Nº DMSA","Nº do processo","Objeto","Setor requisitante","Localização atual","Situação atual"]
["01/2014",368,"002701/2014","Aquisição de café, açúcar, coador e adoçante","DEPARTAMENTO DE PARASITOLOGIA ANIMAL","CLOG","Pregão nº 88/2014 finalizado em 03/11/14. Já houve empenho (2014NE802417, 2015NE800302) e pagamento (2015OB800319). O processo está disponível na Seção de Sistema de Registro de Preços para solicitar empenhos."]
["06/2014",1117,"006016/2014","Aquisição de cartuchos hp, toners e tintas (grupo 30.17A)","DEPARTAMENTO DE PARASITOLOGIA ANIMAL","DMSA","Buscando informações."]
["05/2014",990,"005807/2014","Aquisição de itens do grupo 30.36 - Artigos cirúrgicos e de enfermaria","DEPARTAMENTO DE PARASITOLOGIA ANIMAL","PREGÃO","Aguardando manifestação de interesse (IRP) de outros órgãos para realizar o pregão. Pregão nº 12/2015."]
["03/2014",366,"002706/2014","Aquisição de artigos de higiene e conservação","DEPARTAMENTO DE PARASITOLOGIA ANIMAL","SPP","Verificando a possibilidade de atendimento juntamente com a demanda de 2015."]
["04/2014","S/Nº","006046/2014","Aquisição de itens do grupo 30.11 - Material químico (demais setores)","DEPARTAMENTO DE PARASITOLOGIA ANIMAL","CADMIN","Buscando informações."]
["02/2014",62,"004379/2014","Aquisição de rack 8u","DEPARTAMENTO DE PARASITOLOGIA ANIMAL","SEÇÃO DE CONTROLE","Já houve empenho (2014NE802005) e foi entregue no Almoxarifado em 05/11/14."]
["02/2014",367,"002707/2014","Aquisição de artigos de copa e cozinha","DEPARTAMENTO DE PARASITOLOGIA ANIMAL","SPP","Verificando a possibilidade de atendimento juntamente com a demanda de 2015."]

{"sheet":"TD 290000","index":87,"n_rows":30,"n_cols":7,"rows_kept":30,"cut":false,"hidden":false,"merged":[[1,2,2,6]]}
[]
[null,null,{"$f":"IFERROR(VLOOKUP(B3,'Banco de dados'!$A$994:$B$1311,2,0),\"\")","v":"INSTITUTO DE ZOOTECNIA"}]
["Centro de Custo",290000]
[]
["Reqmat","Nº DMSA","Nº do processo","Objeto","Setor requisitante","Localização atual","Situação atual"]
["14/2014",326,"002700/2014","Aquisição de gás liquefeito de petróleo","INSTITUTO DE ZOOTECNIA","DIREÇÃO DMSA","Pregão nº 138/2014 finalizado em 14/11/14. O processo está disponível na Seção de Sistema de Registro de Preços para solicitar empenhos."]
["15/2014",327,"002701/2014","Aquisição de café, açúcar, coador e adoçante","INSTITUTO DE ZOOTECNIA","CLOG","Pregão nº 88/2014 finalizado em 03/11/14. Já houve empenho (2014NE802417, 2015NE800302) e pagamento (2015OB800319). O processo está disponível na Seção de Sistema de Registro de Preços para solicitar empenhos."]
["16/2014",328,"002701/2014","Aquisição de café, açúcar, coador e adoçante","INSTITUTO DE ZOOTECNIA","CLOG","Pregão nº 88/2014 finalizado em 03/11/14. Já houve empenho (2014NE802417, 2015NE800302) e pagamento (2015OB800319). O processo está disponível na Seção de Sistema de Registro de Preços para solicitar empenhos."]
["17/2014",329,"002704/2014","Aquisição de material de expediente (papel A4, carta, ofício, etc)","DNAP","CPACS","Consolidar Pesquisas de Preços"]
["18/2014",330,"002706/2014","Aquisição de artigos de higiene e conservação","DNAP","SPP","Verificando a possibilidade de atendimento juntamente com a demanda de 2015."]
["19/2014",331,"002699/2014","Aquisição de material de expediente","INSTITUTO DE ZOOTECNIA","DIREÇÃO DMSA","Verificando a possibilidade de atendimento juntamente com a demanda de 2015."]
["21/2014",332,"002707/2014","Aquisição de artigos de copa e cozinha","INSTITUTO DE ZOOTECNIA","SPP","Verificando a possibilidade de atendimento juntamente com a demanda de 2015."]
["22/2014",163,"002699/2014","Aquisição de material de expediente","INSTITUTO DE ZOOTECNIA","DIREÇÃO DMSA","Verificando a possibilidade de atendimento juntamente com a demanda de 2015."]
["23/2014",162,"002706/2014","Aquisição de artigos de higiene e conservação","DEPARTAMENTO DE REPRODUÇÃO E AVALIAÇÃO ANIMAL - DRAA","SPP","Verificando a possibilidade de atendimento juntamente com a demanda de 2015."]
["24/2014",159,"002704/2014","Aquisição de material de expediente (papel A4, carta, ofício, etc)","DEPARTAMENTO DE REPRODUÇÃO E AVALIAÇÃO ANIMAL - DRAA","CPACS","Consolidar Pesquisas de Preços"]
["25/2014",158,"002707/2014","Aquisição de artigos de copa e cozinha","INSTITUTO DE ZOOTECNIA","SPP","Verificando a possibilidade de atendimento juntamente com a demanda de 2015."]
["26/2014","S/Nº","002705/2014","Aquisição de medicamentos de uso veterinário","INSTITUTO DE ZOOTECNIA","SPP","Realizando ajustes após emissão de parecer jurídico."]
["01/2014",164,"002700/2014","Aquisição de gás liquefeito de petróleo","INSTITUTO DE ZOOTECNIA","DIREÇÃO DMSA","Pregão nº 138/2014 finalizado em 14/11/14. O processo está disponível na Seção de Sistema de Registro de Preços para solicitar empenhos."]
["01/2014","S/Nº","005472/2014","Confecção e instalação de seis grades de ferro nas janelas do Laboratório do DRRA/IZ","INSTITUTO DE ZOOTECNIA","DIREÇÃO DMSA","Buscando informações."]
["08/2014",171,"002706/2014","Aquisição de artigos de higiene e conservação","GABINETE DA REITORIA","SPP","Verificando a possibilidade de atendimento juntamente com a demanda de 2015."]
["06/2014",169,"002699/2014","Aquisição de material de expediente","INSTITUTO DE ZOOTECNIA","DIREÇÃO DMSA","Verificando a possibilidade de atendimento juntamente com a demanda de 2015."]
["05/2014",168,"002706/2014","Aquisição de artigos de higiene e conservação","DIRETORIA DO IZ","SPP","Verificando a possibilidade de atendimento juntamente com a demanda de 2015."]
["03/2014",166,"002701/2014","Aquisição de café, açúcar, coador e adoçante","INSTITUTO DE ZOOTECNIA","CLOG","Pregão nº 88/2014 finalizado em 03/11/14. Já houve empenho (2014NE802417, 2015NE800302) e pagamento (2015OB800319). O processo está disponível na Seção de Sistema de Registro de Preços para solicitar empenhos."]
["04/2014",167,"002704/2014","Aquisição de material de expediente (papel A4, carta, ofício, etc)","DIRETORIA DO IZ","CPACS","Consolidar Pesquisas de Preços"]
["02/2014",165,"002701/2014","Aquisição de café, açúcar, coador e adoçante","INSTITUTO DE ZOOTECNIA","CLOG","Pregão nº 88/2014 finalizado em 03/11/14. Já houve empenho (2014NE802417, 2015NE800302) e pagamento (2015OB800319). O processo está disponível na Seção de Sistema de Registro de Preços para solicitar empenhos."]
["07/2014",170,"002707/2014","Aquisição de artigos de copa e cozinha","INSTITUTO DE ZOOTECNIA","SPP","Verificando a possibilidade de atendimento juntamente com a demanda de 2015."]
["30/2014",1764,"009584/2014","Aquisição de materiais de alguns itens do grupo 30.31 - Insumos agrícolas (adubo químico e fertilizante)","DIREÇÃO DO INSTITUTO DE ZOOTECNIA","DIREÇÃO DMSA","Buscando informações."]
["31/2014",1423,"003666/2014","Aquisição de cartuchos de tinta","DIRETORIA","SPP","Pesquisa de preço."]
["S/Nº","S/Nº","007182/2014","Aquisição de 12 automóveis","INSTITUTO DE ZOOTECNIA","SEC. ADM. DO DECANATO DE ASSUNTOS FINANCEIROS","Já houve empenho (2014NE801671), pagamentos (2015OB800136 e 2015DF800023) e foi entregue no Almoxarifado em 15/12/14."]
["49/2014",1777,"009587/2014","Reforma de portas, janelas e confecção de balcão de mdf para DPA/IZ","INSTITUTO DE ZOOTECNIA","SCD","Análise e posterior encaminhamento à PROAF para autorização da despesa"]

{"sheet":"TD 300000","index":88,"n_rows":23,"n_cols":7,"rows_kept":23,"cut":false,"hidden":false,"merged":[[1,2,2,6]]}
[]
[null,null,{"$f":"IFERROR(VLOOKUP(B3,'Banco de dados'!$A$994:$B$1311,2,0),\"\")","v":"CAMPUS DA UFRRJ EM NOVA IGUAÇU"}]
["Centro de Custo",300000]
[]
["Reqmat","Nº DMSA","Nº do processo","Objeto","Setor requisitante","Localização atual","Situação atual"]
["13/2014",1420,"006694/2014","Pagamento de inscrição da servidora Andréia da Silva no XVII Seminário nacional de bibliotecas universitárias","BIBLIOTECA","ARQUIVO","Desarquivado pela CODEP para realizar o relatório anual de cursos  do Governo Federal e em breve será novamente arquivado.\nHouve empenho (2014NE802128) e anulação do empenho (2014NE802523)."]
["20/2014",1758,"009344/2014","Manutenção corretiva em equipamento de desativar/reativar modelo da 927, de sistema de segurança","BIBLIOTECA DO INSTITUTO MULTIDISCIPLINAR","DIVISÃO DE ADMINISTRAÇÃO FINANCEIRA","Aguardando a empresa enviar as documentações atualizadas."]
["01/2014",1360,"006466/2014","Contratação de empresa especializada para proceder a lavagem de 8 (oito) reservatórios d'água","SUPERINTENDÊNCIA DO CAMPUS NOVA IGUAÇU","SCD","Foram solicitadas visita ténica e propostas às empresas, mas apenas duas fizeram a vistoria, mesmo tendo marcado duas datas. Somente uma enviou a proposta, porém está com o INSS vencido. Estamos tentando obter a outra proposta ou a regularização da situação no SICAF."]
["01/2014",175,"002699/2014","Aquisição de material de expediente","CAMPUS DA UFRRJ EM NOVA IGUAÇU","DIREÇÃO DMSA","Verificando a possibilidade de atendimento juntamente com a demanda de 2015."]
["01/2014",176,"002707/2014","Aquisição de artigos de copa e cozinha","CAMPUS DA UFRRJ EM NOVA IGUAÇU","SPP","Verificando a possibilidade de atendimento juntamente com a demanda de 2015."]
["01/2014",1072,"005055/2014","Aquisição de rádio comunicador etc","INSTITUTO DE ZOOTECNIA","ARQUIVO","Arquivado porque o material foi atendido através do processo 008200/2013."]
["06/2014",415,"005867/2014","Aquisição de aparelhos e utensílios domésticos (grupo 52.12)","SUPERINTENDÊNCIA DO CAMPUS","SPP","Realizando ajustes após emissão de parecer jurídico."]
["03/2014",172,"002701/2014","Aquisição de café, açúcar, coador e adoçante","CAMPUS DA UFRRJ EM NOVA IGUAÇU","CLOG","Pregão nº 88/2014 finalizado em 03/11/14. Já houve empenho (2014NE802417, 2015NE800302) e pagamento (2015OB800319). O processo está disponível na Seção de Sistema de Registro de Preços para solicitar empenhos."]
["04/2014",174,"002706/2014","Aquisição de artigos de higiene e conservação","SUPERINTENDÊNCIA DO CAMPUS","SPP","Verificando a possibilidade de atendimento juntamente com a demanda de 2015."]
["02/2014",173,"002704/2014","Aquisição de material de expediente (papel A4, carta, ofício, etc)","SUPERINTÊNDENCIA DO CAMPUS NOVA IGUAÇU","CPACS","Consolidar Pesquisas de Preços"]
["07/2014",416,"002707/2014","Aquisição de artigos de copa e cozinha","CAMPUS DA UFRRJ EM NOVA IGUAÇU","SPP","Verificando a possibilidade de atendimento juntamente com a demanda de 2015."]
["07/2014",416,"006022/2014","Aquisição de equipamentos eletro-eletrônicos (grupo 52.33)","SUPERINTENDÊNCIA DO CAMPUS","SPP","Pesquisa de preço."]
["89/2014","S/Nº","005054/2014","Contratação de serviço de coffee break para duas atividades de extensão: encerramento do curso etc","INSTITUTO MULTIDISCIPLINAR DE NOVA IGUAÇU","DIREÇÃO DO IM","Buscando informações."]
["09/2014",1775,"008694/2014","Aquisição de materiais químicos","CAMPUS DA UFRRJ EM NOVA IGUAÇU","SEÇÃO DE CONTROLE","Já houve empenho (2014NE802490) e foi entregue no Almoxarifado em 22/12/14."]
["30/2014",1987,"010608/2014","Aquisição de itens do grupo 30.22 - Artigos para higiene e conservação","CAMPUS DA UFRRJ EM NOVA IGUAÇU","CLOG","Já houve empenho (2014NE802495), mas o prazo de entrega está vencido desde 04/01/15."]
["S/Nº","S/Nº","007182/2014","Aquisição de 12 automóveis","CAMPUS DA UFRRJ EM NOVA IGUAÇU","SEC. ADM. DO DECANATO DE ASSUNTOS FINANCEIROS","Já houve empenho (2014NE801671), pagamentos (2015OB800136 e 2015DF800023) e foi entregue no Almoxarifado em 15/12/14."]
["18/2013","S/Nº","000352/2014","Aquisição de rede para cabelo cor preta e outros","CAMPUS DA UFRRJ EM NOVA IGUAÇU","RESTAURANTE UNIVERSITÁRIO DO CAMPUS DE NOVA IGUAÇU","Pregão nº 62/2014 finalizado em 10/09/14. O processo está disponível no Restaurante Universitário do IM para solicitar empenhos."]
["19/2013","S/Nº","000353/2014","Aquisição de álcool etílico 70, frascos de 500 ml e outros","CAMPUS DA UFRRJ EM NOVA IGUAÇU","PROAES","Pregão nº 51/2014 finalizado em 05/06/14. O processo está disponível no Restaurante Universitário do IM para solicitar empenhos."]

{"sheet":"TD 300001","index":89,"n_rows":13,"n_cols":7,"rows_kept":13,"cut":false,"hidden":false,"merged":[[1,2,2,6]]}
[]
[null,null,{"$f":"IFERROR(VLOOKUP(B3,'Banco de dados'!$A$994:$B$1311,2,0),\"\")","v":"RESTAURANTE UNIVERSITÁRIO - NOVA IGUAÇU"}]
["Centro de Custo",300001]
[]
["Reqmat","Nº DMSA","Nº do processo","Objeto","Setor requisitante","Localização atual","Situação atual"]
["01/2014",51,"002085/2014","Contratação de empresa para serviços de dedetização, desratização e descupinização","RESTAURANTE UNIVERSITÁRIO - NOVA IGUAÇU","INSTITUTO MULTIDISCIPLINAR DE NOVA IGUAÇU","Pregão nº 69/2014 finalizado em 08/09/14. O processo está disponível no Restaurante Universitário do Campus de Nova Iguaçu para solicitar empenhos."]
["08/2014",448,"002658/2014","Aquisição de carnes","RESTAURANTE UNIVERSITÁRIO - NOVA IGUAÇU","SSRP","Pregão nº 82/2014 finalizado em 21/11/14. Já houve empenho (2015NE800248, 2015NE800249, 2015NE800250, 2015NE800251, 2015NE800252, 2015NE800253). O processo está disponível no Restaurante Universitário do Instituto Multidisciplinar para solicitar empenhos."]
["05/2014",112,"002704/2014","Aquisição de material de expediente (papel A4, carta, ofício, etc)","RESTAURANTE UNIVERSITÁRIO - NOVA IGUAÇU","CPACS","Consolidar Pesquisas de Preços"]
["03/2014",111,"002706/2014","Aquisição de artigos de higiene e conservação","RESTAURANTE UNIVERSITÁRIO - NOVA IGUAÇU","SPP","Verificando a possibilidade de atendimento juntamente com a demanda de 2015."]
["04/2014",113,"002699/2014","Aquisição de material de expediente","RESTAURANTE UNIVERSITÁRIO - NOVA IGUAÇU","DIREÇÃO DMSA","Verificando a possibilidade de atendimento juntamente com a demanda de 2015."]
["02/2014",110,"002087/2014","Aquisição de gêneros alimentícios - amendoim, arroz, café (grupo 30.07)","RESTAURANTE UNIVERSITÁRIO - NOVA IGUAÇU","RESTAURANTE UNIVERSITÁRIO DO CAMPUS DE NOVA IGUAÇU","Pregão nº 104/2014 finalizado em 09/10/14. O processo está disponível no Restaurante Universitário do Campus de Nova Iguaçu para solicitar empenhos."]
["07/2014",161,"002392/2014","Aquisição de gêneros alimentícios - Queijo minas frescal (grupo 30.07)","RESTAURANTE UNIVERSITÁRIO - NOVA IGUAÇU","RESTAURANTE UNIVERSITÁRIO DO CAMPUS DE NOVA IGUAÇU","Pregão nº 73/2014 finalizado em 16/09/14. O processo está disponível no Restaurante Universitário do Instituto Multidisciplinar para solicitar empenhos."]
["09/2014",449,"002657/2014","Aquisição de frutas, legumes e verduras","RESTAURANTE UNIVERSITÁRIO - NOVA IGUAÇU","RESTAURANTE UNIVERSITÁRIO DO CAMPUS DE NOVA IGUAÇU","Pregão nº 89/2014 finalizado em 30/07/14. O processo está disponível no Restaurante Universitário do Instituto Multidisciplinar para solicitar empenhos."]

{"sheet":"TD 400000","index":90,"n_rows":21,"n_cols":7,"rows_kept":21,"cut":false,"hidden":false,"merged":[[1,2,2,6]]}
[]
[null,null,{"$f":"IFERROR(VLOOKUP(B3,'Banco de dados'!$A$994:$B$1311,2,0),\"\")","v":"CAMPUS DA UFRRJ EM TRÊS RIOS"}]
["Centro de Custo",400000]
[]
["Reqmat","Nº DMSA","Nº do processo","Objeto","Setor requisitante","Localização atual","Situação atual"]
["14/2014","S/Nº","011070/2014","Licitação para espaço destinado à reprografia ","CAMPUS DA UFRRJ EM TRÊS RIOS","DRA. IVANI","Aguardando autorização da despesa."]
["25/2014",1085,"005968/2014","Aquisição de mobiliário em geral (grupo 52.42)","CAMPUS DA UFRRJ EM TRES RIOS","DIREÇÃO DMSA","Verificando a possibilidade de atendimento juntamente com a demanda de 2015."]
["26/2014",1084,"006016/2014","Aquisição de cartuchos hp, toners e tintas (grupo 30.17A)","CAMPUS DA UFRRJ EM TRÊS RIOS","DMSA","Buscando informações."]
["01/2014",483,"002704/2014","Aquisição de material de expediente (papel A4, carta, ofício, etc)","CAMPUS DA UFRRJ EM TRÊS RIOS","CPACS","Consolidar Pesquisas de Preços"]
["01/2014","S/Nº","008556/2014","Reforma e adequação do Auditório do ITR","CAMPUS DA UFRRJ EM TRÊS RIOS","COORD. DE PROJETOS DE ENGENHARIA E ARQUITETURA","Buscando informações."]
["01/2014","S/Nº","004063/2014","Contratação de serviços para manutenção de veículos com reposição de peças e gerenciamento de serviços","CAMPUS DA UFRRJ EM TRÊS RIOS","DEPARTAMENTO DE CONTABILIDADE E FINANÇAS","(vazio)"]
["06/2014","S/Nº","002701/2014","Aquisição de café, açúcar, coador e adoçante","CAMPUS DA UFRRJ EM TRÊS RIOS","CLOG","Pregão nº 88/2014 finalizado em 03/11/14. Já houve empenho (2014NE802417, 2015NE800302) e pagamento (2015OB800319). O processo está disponível na Seção de Sistema de Registro de Preços para solicitar empenhos."]
["05/2014",487,"002706/2014","Aquisição de artigos de higiene e conservação","DIREÇÃO, TRANSPORTE, PROTOCOLO/PROGRAD/DEST, BIBLIOTECA, DP, NPJ E INFORMÁTICA","SPP","Verificando a possibilidade de atendimento juntamente com a demanda de 2015."]
["03/2014",485,"002703/2014","Aquisição de material de artes gráficas e desenho","CAMPUS DA UFRRJ EM TRÊS RIOS","SSRP","Será atendido junto com a Demanda de 2015 - equipe do projeto"]
["03/2014",1925,"010106/2014","Contratação de empresa especializada na prestação de serviços continuados de vigilância e segurança armada","CAMPUS DA UFRRJ EM TRÊS RIOS","DRA. JAQUELINE","Emissão de parecer Jurídico"]
["04/2014",486,"002707/2014","Aquisição de artigos de copa e cozinha","CAMPUS DA UFRRJ EM TRÊS RIOS","SPP","Verificando a possibilidade de atendimento juntamente com a demanda de 2015."]
["04/2014",1952,"010294/2014","Aquisição de poltrona de auditório, encosto médio e com posicionamento em 3 posições e outros (carona)","CAMPUS DA UFRRJ EM TRÊS RIOS","SEC.  ADM. DO DECANATO DE ASSUNTOS FINANCEIROS","Já houve empenho (2014NE802271, 2014NE802272, 2014NE802273) , encaminhado para o almoxarifado para envio da Nota de empenho."]
["04/2014",1928,"010107/2014","Contratação de empresa especializada na prestação de serviços continuados de asseio e conservação, com fornecimento","CAMPUS DA UFRRJ EM TRÊS RIOS","SPP","Pesquisa de preço."]
["02/2014",484,"002699/2014","Aquisição de material de expediente","CAMPUS DA UFRRJ EM TRÊS RIOS","DIREÇÃO DMSA","Verificando a possibilidade de atendimento juntamente com a demanda de 2015."]
["02/2014","S/Nº","005729/2014","Aquisição de licenciamento de uso de software arcgls for desktop concurrent e outros","CAMPUS DA UFRRJ EM TRÊS RIOS","COINFO","Buscando informações."]
["S/Nº","S/Nº","007182/2014","Aquisição de 12 automóveis","CAMPUS DA UFRRJ EM TRÊS RIOS","SEC. ADM. DO DECANATO DE ASSUNTOS FINANCEIROS","Já houve empenho (2014NE801671), pagamentos (2015OB800136 e 2015DF800023) e foi entregue no Almoxarifado em 15/12/14."]

{"sheet":"TD 500030","index":91,"n_rows":15,"n_cols":7,"rows_kept":15,"cut":false,"hidden":false,"merged":[[1,2,2,6]]}
[]
[null,null,{"$f":"IFERROR(VLOOKUP(B3,'Banco de dados'!$A$994:$B$1311,2,0),\"\")","v":"PROGRAMA INGLÊS SEM FRONTEIRAS"}]
["Centro de Custo",500030]
[]
["Reqmat","Nº DMSA","Nº do processo","Objeto","Setor requisitante","Localização atual","Situação atual"]
["11/2014",1725,"008393/2014","Aquisição de memória portátil, microcomputador, etc","PROGRAMA INGLÊS SEM FRONTEIRAS","ARQUIVO","Buscando informações."]
["13/2014",1906,"010455/2014","Aquisição de mesa, mesa de reunião ovalada - medindo: 2400 x 1100 x 740mm, cadeiras e outros (carona)","PROGRAMA INGLÊS SEM FRONTEIRAS","DIVISÃO DE ADMINISTRAÇÃO FINANCEIRA","Já houve empenho (2014NE802293), anulação parcial do empenho (2014NE802390) e a data prevista de entrega é até 15/03/15.\nJá houve empenho (2014NE802296) e a data prevista de entrega é até 15/03/15.\nJá houve empenho (2014NE802301) e a data prevista de entrega é até 15/03/15.\nA SSRP está verificando se existem caronas para atendimento das longarinas e posterior tomada de decisão entre a Direção do DMSA e PROAEST. (anexado ao 9790/2014)"]
["08/2014",1730,"008306/2014","Aquisição de seis rádios radio transceptores","INGLÊS SEM FRONTEIRAS","CLOG","Já houve empenho (2014NE802333) e a data prevista de entrega é até 31/12/14. "]
["08/2014","S/Nº","010531/2014","Aquisição de seis rádios transceptores (carona)","COORDENAÇÃO DO INGLÊS SEM FRONTEIRAS","SEÇÃO DE CONTROLE","Já houve empenho (2014NE802274) e a data prevista de entrega é até 02/03/15."]
["05/2014",1721,"008327/2014","Serviço com fornecimento de divisórias","INGLÊS SEM FRONTEIRAS","DRA. JAQUELINE","Aguardando solicitação de nova dotação orçamentária junto à PROAF."]
["05/2014",1963,"010456/2014","Aquisição de vinte divisórias em madeira compensada resinada espessura 6mm, estruturada em madeira de lei 3x3","PROGRAMA INGLÊS SEM FRONTEIRAS","ANEXADO    23083.009790/2014-25","Já houve empenho (2014NE802293), anulação parcial do empenho (2014NE802390) e a data prevista de entrega é até 15/03/15.\nJá houve empenho (2014NE802296) e a data prevista de entrega é até 15/03/15.\nJá houve empenho (2014NE802301) e a data prevista de entrega é até 15/03/15.\nA SSRP está verificando se existem caronas para atendimento das longarinas e posterior tomada de decisão entre a Direção do DMSA e PROAEST. (anexado no 009790/2014)"]
["04/2014",1965,"010486/2014","Aquisição de memória portátil e outros","PROGRAMA INGLÊS SEM FRONTEIRAS","CLOG","Já houve empenho (2014NE802321) e foi entregue no Almoxarifado em 13/01/15."]
["07/2014",1731,"008025/2014","Aquisição de livros","PROGRAMA INGLÊS SEM FRONTEIRAS","ANEXADO    23083.007599/2014-50","Atualizando a Pesquisa de Preços e atendendo recomendações do Parecer da PROGER (anexado ao 007599/2014)."]
["S/Nº","S/Nº","004584/2014","Aquisição de material de expediente","PROGRAMA INGLÊS SEM FRONTEIRAS","SSRP","Já houve empenho (2014NE802315), pagamento (2015OB800230) e foi entregue no Almoxarifado em 02/12/14.\nJá houve empenho (2014NE802312) e foi entregue no Almoxarifado em 15/01/15.\nJá houve empenho (2014NE802314) e foi entregue no Almoxarifado em 14/01/15."]
["S/Nº","S/Nº","004583/2014","Aquisição de móveis e equipamentos de uso geral","PROGRAMA INGLÊS SEM FRONTEIRAS","CLOG","Já houve empenho (2014NE802283), mas o prazo de entrega está vencido e um ofício de cobrança foi emitido à empresa em 05/03/15."]

{"sheet":"TD 500404","index":92,"n_rows":6,"n_cols":7,"rows_kept":6,"cut":false,"hidden":false,"merged":[[1,2,2,6]]}
[]
[null,null,{"$f":"IFERROR(VLOOKUP(B3,'Banco de dados'!$A$994:$B$1311,2,0),\"\")","v":"PRONATEC - COLÉGIO TÉCNICO"}]
["Centro de Custo",500404]
[]
["Reqmat","Nº DMSA","Nº do processo","Objeto","Setor requisitante","Localização atual","Situação atual"]
["08/2013",890,"010043/2013","Aquisição de adaptador para uma tomada padrão antigo e etc","PRONATEC - COLÉGIO TÉCNICO","DIREÇÃO DMSA","Os pedidos desse processo foram inseridos no 002078/2013 do DMSA e está verificando a possibilidade de atendimento juntamente com a demanda de 2015."]

{"sheet":"TD 600000","index":93,"n_rows":18,"n_cols":7,"rows_kept":18,"cut":false,"hidden":false,"merged":[[1,2,2,6]]}
[]
[null,null,{"$f":"IFERROR(VLOOKUP(B3,'Banco de dados'!$A$994:$B$1311,2,0),\"\")","v":"INSTITUTO DE CIÊNCIAS SOCIAIS APLICADAS"}]
["Centro de Custo",600000]
[]
["Reqmat","Nº DMSA","Nº do processo","Objeto","Setor requisitante","Localização atual","Situação atual"]
["01/2014",443,"002700/2014","Aquisição de gás liquefeito de petróleo","INSTITUTO DE CIÊNCIAS SOCIAIS APLICADAS","DIREÇÃO DMSA","Pregão nº 138/2014 finalizado em 14/11/14. O processo está disponível na Seção de Sistema de Registro de Preços para solicitar empenhos."]
["08/2014",441,"002706/2014","Aquisição de artigos de higiene e conservação","DIREÇÃO","SPP","Verificando a possibilidade de atendimento juntamente com a demanda de 2015."]
["05/2014",446,"002704/2014","Aquisição de material de expediente (papel A4, carta, ofício, etc)","DIREÇÃO","CPACS","Consolidar Pesquisas de Preços"]
["03/2014",293,"005919/2014","Pagamento de inscrição da Profª. Katia Cilene Tabai no XXIV Congresso Brasileiro de Ciência e Tecnologia de Alimentos","ICSA - DEDH","SAPG","Já houve empenho (2014NE801400) e pagamento (2015OB800581)."]
["03/2014",442,"002707/2014","Aquisição de artigos de copa e cozinha","INSTITUTO DE CIÊNCIAS SOCIAIS APLICADAS","SPP","Verificando a possibilidade de atendimento juntamente com a demanda de 2015."]
["04/2014",445,"002699/2014","Aquisição de material de expediente","INSTITUTO DE CIÊNCIAS SOCIAIS APLICADAS","DIREÇÃO DMSA","Verificando a possibilidade de atendimento juntamente com a demanda de 2015."]
["02/2014",1294,"006000/2014","Pagamento de inscrição da Profª. Katia Cilene Tabai no XXIII Congresso Brasileiro de Nutrição","ICSA - DEDH","SETOR DE COBRANÇA","Já houve empenho (2014NE801382), mas o pagamento ainda não foi efetuado."]
["02/2014",444,"002701/2014","Aquisição de café, açúcar, coador e adoçante","INSTITUTO DE CIÊNCIAS SOCIAIS APLICADAS","CLOG","Pregão nº 88/2014 finalizado em 03/11/14. Já houve empenho (2014NE802417, 2015NE800302) e pagamento (2015OB800319). O processo está disponível na Seção de Sistema de Registro de Preços para solicitar empenhos."]
["108/2014",1553,"007938/2014","Pagamento de inscrição para a Servidora Maria Viviana no XII Encontro Nacional da Associação de Estudos Regionais e Urbanos","DEPARTAMENTO DE CIÊNCIAS ECONÔMICAS","DEPARTAMENTO DE CIÊNCIAS ECONÔMICAS","Já houve empenho (2014NE801895), mas o pagamento ainda não foi efetuado."]
["107/2014",1554,"007937/2014","Pagamento de inscrição para o servidor Joilson no XII Encontro Nacional da Associação Brasileira de Estudos Regionais e Urbanos","DEPARTAMENTO DE CIÊNCIAS ECONÔMICAS","DEPARTAMENTO DE CIÊNCIAS ECONÔMICAS","Já houve empenho (2014NE801893), mas o pagamento ainda não foi efetuado."]
["S/Nº","S/Nº","007182/2014","Aquisição de 12 automóveis","INSTITUTO DE CIÊNCIAS SOCIAIS APLICADAS","SEC. ADM. DO DECANATO DE ASSUNTOS FINANCEIROS","Já houve empenho (2014NE801671), pagamentos (2015OB800136 e 2015DF800023) e foi entregue no Almoxarifado em 15/12/14."]
["S/Nº","S/Nº","002827/2014","Aquisição de cartuchos","INSTITUTO DE CIÊNCIAS SOCIAIS APLICADAS","SAPG","Já houve empenho (2014NE800771), pagamento (2014OB808377) e foi entregue no Almoxarifado em 15/07/14."]
["199/2014",2142,"011339/2014","Pagamento de inscrição da servidora Lenice Freiman de Oliveira ","DIRETORIA DO INSTITUTO DE CIÊNCIAS SOCIAIS","DEPARTAMENTO DE ECONOMIA DOMESTICA E HOTELARIA","Análise e posterior encaminhamento à PROAF para autorização da despesa"]

{"sheet":"TD por assunto","index":94,"n_rows":792,"n_cols":9,"rows_kept":792,"cut":false,"hidden":false,"merged":[[1,2,1,8]]}
[]
[null,null,"TODOS OS PROCESSOS POR ASSUNTO"]
[]
["Objeto","(Vários itens)","           Click aqui e digite o assunto a ser pesquisado"]
[]
["Reqmat","Nº DMSA","Nº do processo","Objeto ","Centro de Custo","Unidade","Setor requisitante","Localização atual","Situação atual"]
["10/2013",1307,"006018/2014","Aquisição de equipamentos para laboratório (grupo 52.08)",100000,"REITORIA","DEQUIM - ICE - FÍSICO-QUÍMICA","DIREÇÃO DMSA","Buscando informações."]
["10/2014",926,"006021/2014","Aquisição de equipamentos agrícolas (grupo 52.40)",130000,"PRÓ-REITORIA DE ASSUNTOS ESTUDANTIS","PRÓ-REITORIA DE ASSUNTOS ESTUDANTIS","ASTEC","Pregão 34/2015 - Elaboração da minuta de edital."]
["10/2014",191,"002706/2014","Aquisição de artigos de higiene e conservação",160010,"EDITORA UNIVERSIDADE RURAL","EDITORA UNIVERSIDADE RURAL","SPP","Verificando a possibilidade de atendimento juntamente com a demanda de 2015."]
["10/2014",1467,"007152/2014","Aquisição de veículos de transporte não especializado tipo Pick-up",240000,"INSTITUTO DE CIÊNCIAS HUMANAS E SOCIAIS","DIREÇÃO","ANEXADO    23083.004907/2014-84 ","Já houve empenho (2014NE801998, 2014NE801999, 2014NE802192), pagamentos (2015OB800232 , 2015OB800413 e 2015DF800135, 2015DF800207) e foi entregue no Almoxarifado em 19/12/14. (anexado ao 004907/2014)."]
["10/2014",1040,"004921/2014","Aquisição de mesa cirúrgica para grandes animais (equinos)",280010,"HOSPITAL VETERINÁRIO","HOSPITAL VETERINÁRIO","SPP","O órgão não autorizou a solicitação de carona."]
["10/2014",1014,"005324/2014","Instalação de data show multimídia",270000,"INSTITUTO DE TECNOLOGIA","INSTITUTO DE TECNOLOGIA","ASTEC","Elaboração da minuta de edital."]
["10/2014",969,"005807/2014","Aquisição de itens do grupo 30.36 - Artigos cirúrgicos e de enfermaria",220100,"DEPARTAMENTO DE BIOLOGIA ANIMAL","IB - DEPARTAMENTO DE BIOLOGIA ANIMAL","PREGÃO","Aguardando manifestação de interesse (IRP) de outros órgãos para realizar o pregão. Pregão nº 12/2015."]
["10/2014",1739,"008289/2014","Contratação de pessoa jurídica para a prestação de serviço de montagem e desmontagem de uma estrutura de palco e serviços de sonorização",10310,"CAPACITAÇÃO DE SERVIDORES - RECURSOS ESPECÍFICOS","COORDENAÇÃO DE DESENVOLVIMENTO DE PESSOAS","ARQUIVO","Arquivado porque  houve empenho (2014NE802043) e pagamento (2014OB808200 e 2014OB808201)."]
["10/2014",1277,"005684/2014","Aquisição de servidor de cálculo intel supermicro com switch hub 16 - Pró-equipamentos/Capes",160001,"PRÓ - EQUIPAMENTOS","PROPPG","SCD","Realizando ajustes após emissão de parecer jurídico."]
["10/2014",1838,"009268/2014","Aquisição de bebedouros de água",210000,"INSTITUTO DE AGRONOMIA","DIRETORIA","ARQUIVO","Já houve empenho (2014NE802258 e 2014NE802449) e a data prevista de entrega é até 14/01/15. "]
["10/2014",1357,"006418/2014","Contratação de serviços para revisão geral de bomba e bicos injetores e substituição dos filtros",260000,"INSTITUTO DE FLORESTAS","INSTITUTO DE FLORESTAS","ARQUIVO","Arquivado após entendimento firmado entre a Direção do DMSA e a Pró Reitoria de Assuntos Financeiros, cujos processos de conserto de veículos deverão ser atendidos pelo contrato de manutenção de automóveis (processo 011591/2013), cuja gestão compete à Prefeitura Universitária. "]
["10/2014","Nº DMSA","002702/2014","Aquisição de medicamentos de uso humano",220300,"DEPARTAMENTO DE CIÊNCIAS FISIOLÓGICAS","DEPARTAMENTO DE CIÊNCIAS FISIOLÓGICAS","ASTEC","Pregão n° 28/2015. houve manifestação de interesse no pregão. Elaborando Edital com as informações e quantitativo dos Órgãos participantes"]
["101/2014",575,"002699/2014","Aquisição de material de expediente",110300,"DEPARTAMENTO DE PESSOAL","DEPARTAMENTO DE PESSOAL","DIREÇÃO DMSA","Verificando a possibilidade de atendimento juntamente com a demanda de 2015."]
["102/2014",56,"002701/2014","Aquisição de café, açúcar, coador e adoçante",110300,"DEPARTAMENTO DE PESSOAL","DEPARTAMENTO DE PESSOAL","CLOG","Pregão nº 88/2014 finalizado em 03/11/14. Já houve empenho (2014NE802417, 2015NE800302) e pagamento (2015OB800319). O processo está disponível na Seção de Sistema de Registro de Preços para solicitar empenhos."]
["103/2014",58,"002704/2014","Aquisição de material de expediente (papel A4, carta, ofício, etc)",110300,"DEPARTAMENTO DE PESSOAL","SECRETARIA ADMINISTRATIVA","CPACS","Consolidar Pesquisas de Preços"]
["104/2014",55,"002706/2014","Aquisição de artigos de higiene e conservação",110300,"DEPARTAMENTO DE PESSOAL","SECRETARIA DO DEPARTAMENTO DE PESSOAL","SPP","Verificando a possibilidade de atendimento juntamente com a demanda de 2015."]
["11/2014",939,"006022/2014","Aquisição de equipamentos eletro-eletrônicos (grupo 52.33)",170000,"CAIC","CAIC","SPP","Pesquisa de preço."]
["11/2014",854,"004588/2014","Conserto de sistema de circuito fechado de segurança do Instituto de Florestas",260000,"INSTITUTO DE FLORESTAS","DIREÇÃO","DIVISÃO DE ADMINISTRAÇÃO FINANCEIRA","Pregão nº 108/2014 finalizado em 23/10/14. Já houve empenho (2014NE802108) e o serviço está sendo prestado."]
["11/2014",1046,"004957/2014","Kit artroscopia veterinária",280010,"HOSPITAL VETERINÁRIO","HOSPITAL VETERINÁRIO","SEC. ADM. DO DEPTO DE CONTABILIDADE E FINANÇAS","Realizando ajustes após emissão de parecer jurídico."]
["11/2014",970,"005725/2014","Aquisição de lâmpadas (grupo 30.29)",220100,"DEPARTAMENTO DE BIOLOGIA ANIMAL","ÁREA DE HISTOLOGIA E EMBRIOLOGIA","CLOG","Já houve empenhos (2014NE801699 e 2014NE801698) e  foram entregues no Almoxarifado em 04/11/14 e 05/11/14."]
["11/2014",1504,"007806/2014","Pagamento de inscrição da servidora Ana Maria Araújo da Silva no curso de retenções de tributos pelos órgãos e entidades",10310,"CAPACITAÇÃO DE SERVIDORES - RECURSOS ESPECÍFICOS","DEPARTEAMENTO DE CONTABILIDADE E FINANÇAS/PROAF","ARQUIVO","Desarquivado pela CODEP para realizar o relatório anual de cursos  do Governo Federal e em breve será novamente arquivado.\nArquivado porque  houve empenho (2014NE801738) e pagamento (2014GR800106)."]
["11/2014",1186,"006354/2014","Aquisição de itens do grupo 52.42 (cavalete e tela de proteção)",150600,"PROEXT - APOIO À PRÁTICAS TRADICIONAIS NO USO DE PLANTAS MEDICINAIS","PROJETO PROEXT-MEC 2014 \"MÃOS QUE CRIAM - PROJETO DE CAPACITAÇÃO PARA PROMOÇÃO SOCIAL\"","SEÇÃO DE CONTROLE","Já houve empenho (2014NE802003) e  foi entregue no Almoxarifado em 12/11/14."]
["11/2014",187,"002699/2014","Aquisição de material de expediente",160010,"EDITORA UNIVERSIDADE RURAL","EDITORA UNIVERSIDADE RURAL","DIREÇÃO DMSA","Verificando a possibilidade de atendimento juntamente com a demanda de 2015."]
["11/2014",1768,"008580/2014","Pagamento de inscrição das servidoras Mônica Carneiro de Moraes Inácio  e Regina Maria Van Tol no curso sobre formação e aperfeiçoamento de líderes no serviço público",110000,"PRÓ-REITORIA DE ASSUNTOS ADMINISTRATIVOS","COORDENAÇÃO DE DESENVOLVIMENTO DE PESSOAS","ARQUIVO","Já houve empenho (2014NE802435), mas o pagamento ainda não foi efetuado."]
["11/2014",1281,"006504/2014","Aquisição de cromatógrafo",160001,"PRÓ - EQUIPAMENTOS","PROPPG","SEÇÃO DE CONTROLE","Já houve empenho (2014NE802205) e a data prevista de entrega é até 23/12/14. "]
["11/2014","S/Nº","002959/2014","Serviços de reparos dos veículos Fiat Linea placa HIG 4846 e ônibus Comil Campione placa KXY 3416",100300,"PREFEITURA UNIVERSITÁRIA","PREFEITURA UNIVERSITÁRIA","ARQUIVO","Arquivado após entendimento firmado entre a Direção do DMSA e a Pró Reitoria de Assuntos Financeiros, cujos processos de conserto de veículos deverão ser atendidos pelo contrato de manutenção de automóveis (processo 011591/2013), cuja gestão compete à Prefeitura Universitária. "]
["11/2014",1725,"008393/2014","Aquisição de memória portátil, microcomputador, etc",500030,"PROGRAMA INGLÊS SEM FRONTEIRAS","PROGRAMA INGLÊS SEM FRONTEIRAS","ARQUIVO","Buscando informações."]
["11/2014",208,"002433/2014","Serviço de limpeza, manutenção e revisão de retroprojetores e placa de aquecimento",220000,"INSTITUTO DE BIOLOGIA","INSTITUTO DE BIOLOGIA ","DIREÇÃO DMSA","Buscando informações."]
["12/2014",1053,"004998/2014","Aquisição de material permanente/adesão a ata",100100,"BIBLIOTECA CENTRAL","BIBLIOTECA CENTRAL","CLOG","Já houve empenho (2014NE801897), mas o prazo de entrega está vencido desde 15/01/15.\nJá houve empenho (2014NE801853), anulação parcial do empenho (2014NE801896), mas o prazo de entrega está vencido desde 04/01/15."]
["12/2014",1111,"005968/2014","Aquisição de mobiliário em geral (grupo 52.42)",170000,"CAIC","CAIC","DIREÇÃO DMSA","Verificando a possibilidade de atendimento juntamente com a demanda de 2015."]
["12/2014",189,"002704/2014","Aquisição de material de expediente (papel A4, carta, ofício, etc)",160010,"EDITORA UNIVERSIDADE RURAL","EDITORA UNIVERSIDADE RURAL","CPACS","Consolidar Pesquisas de Preços"]
["12/2014",1335,"006280/2014","Aquisição de microscópio de fluorescencia BX43-L-FL-URA-I 00",160001,"PRÓ - EQUIPAMENTOS","PROPPG","CLOG","Realizando ajustes após emissão de parecer jurídico."]
["12/2014",1332,"006283/2014","Aquisição de contador automático de células Moxi ZTM",160001,"PRÓ - EQUIPAMENTOS","PROPPG","PRO-REITORIA DE PESQUISA E POS-GRADUAÇÃO","Realizando ajustes após emissão de parecer jurídico."]
["12/2014",1039,"004920/2014","Aquisição de sistema de vídeo endoscópio veterinário (grupo 52.08)",280010,"HOSPITAL VETERINÁRIO","HOSPITAL VETERINÁRIO","SPP","Em 22/09/14 o processo chegou à SSRP, com despacho da Profª. Nidia informando que a aquisição deverá ocorrer em 2015."]
["12/2014",1507,"007799/2014","Aquisição de estabilizador de 1000 VA características de entrada: tensão nominal 115v/220v",260000,"INSTITUTO DE FLORESTAS","INSTITUTO DE FLORESTAS","DIREÇÃO DMSA","Verificando a possibilidade de atendimento juntamente com a demanda de 2015."]
["12/2014",1872,"009678/2014","Aquisição de dois capacetes de piloto de motocicleta",100000,"REITORIA","ALMOXARIFADO","SCD","Abriu cotação mas o capacete cotado foi inferior ao solicitado e com valor acima do estimado."]
["12/2014",851,"002959/2014","Serviços de reparos dos veículos Fiat Linea placa HIG 4846 e ônibus Comil Campione placa KXY 3416",100300,"PREFEITURA UNIVERSITÁRIA","PREFEITURA UNIVERSITÁRIA","ARQUIVO","Arquivado após entendimento firmado entre a Direção do DMSA e a Pró Reitoria de Assuntos Financeiros, cujos processos de conserto de veículos deverão ser atendidos pelo contrato de manutenção de automóveis (processo 011591/2013), cuja gestão compete à Prefeitura Universitária. "]
["12/2014",1006,"004596/2014","Fornecimento e instalação de 250 metros de cabo óptico, etc no CTUR",180000,"CTUR","CTUR","ARQUIVO","Já houve empenho (2014NE800992) e pagamento (2014OB805920)"]
["127/2014",1043,"005968/2014","Aquisição de mobiliário em geral (grupo 52.42)",150000,"PRÓ-REITORIA DE EXTENSÃO","DEPARTAMENTO DE LOGÍSTICA E INFRAESTRUTURA","DIREÇÃO DMSA","Verificando a possibilidade de atendimento juntamente com a demanda de 2015."]
["13/2014",1054,"006008/2014","Aquisição de material hidráulico (grupo 30.24)",180000,"CTUR","CTUR","ASTEC","Elaboração da minuta de edital."]
["13/2014",1054,"005968/2014","Aquisição de mobiliário em geral (grupo 52.42)",130000,"PRÓ-REITORIA DE ASSUNTOS ESTUDANTIS","SECRETARIA","DIREÇÃO DMSA","Verificando a possibilidade de atendimento juntamente com a demanda de 2015."]
["13/2014",1318,"006084/2014","Aquisição de mobiliário em geral (grupo 52.42) - Mesa de refeitório para 6 pessoas (carona)",130000,"PRÓ-REITORIA DE ASSUNTOS ESTUDANTIS","PRÓ-REITORIA DE ASSUNTOS ESTUDANTIS","DIREÇÃO DMSA","Buscando informações."]
["13/2014",180,"002706/2014","Aquisição de artigos de higiene e conservação",220300,"DEPARTAMENTO DE CIÊNCIAS FISIOLÓGICAS","DEPARTAMENTO DE CIÊNCIAS FISIOLÓGICAS","SPP","Verificando a possibilidade de atendimento juntamente com a demanda de 2015."]
["13/2014",1047,"004957/2014","Tronco de concentração para equinos",280010,"HOSPITAL VETERINÁRIO","HOSPITAL VETERINÁRIO","SEC. ADM. DO DEPTO DE CONTABILIDADE E FINANÇAS","Realizando ajustes após emissão de parecer jurídico."]
["13/2014",1420,"006694/2014","Pagamento de inscrição da servidora Andréia da Silva no XVII Seminário nacional de bibliotecas universitárias",300000,"CAMPUS DA UFRRJ EM NOVA IGUAÇU","BIBLIOTECA","ARQUIVO","Desarquivado pela CODEP para realizar o relatório anual de cursos  do Governo Federal e em breve será novamente arquivado.\nHouve empenho (2014NE802128) e anulação do empenho (2014NE802523)."]
["13/2014",450,"002701/2014","Aquisição de café, açúcar, coador e adoçante",150000,"PRÓ-REITORIA DE EXTENSÃO","PRÓ-REITORIA DE EXTENSÃO","CLOG","Pregão nº 88/2014 finalizado em 03/11/14. Já houve empenho (2014NE802417, 2015NE800302) e pagamento (2015OB800319). O processo está disponível na Seção de Sistema de Registro de Preços para solicitar empenhos."]
["13/2014",1906,"009790/2014","Aquisição de mesas de reunião ovalada",130000,"PRÓ-REITORIA DE ASSUNTOS ESTUDANTIS","PRÓ-REITORIA DE ASSUNTOS ESTUDANTIS","SPP","Já houve empenho (2014NE802293), anulação parcial do empenho (2014NE802390) e a data prevista de entrega é até 15/03/15.\nJá houve empenho (2014NE802296) e a data prevista de entrega é até 15/03/15.\nJá houve empenho (2014NE802301) e a data prevista de entrega é até 15/03/15.\nA SSRP está verificando se existem caronas para atendimento das longarinas e posterior tomada de decisão entre a Direção do DMSA e PROAEST."]
["13/2014",1906,"010455/2014","Aquisição de mesa, mesa de reunião ovalada - medindo: 2400 x 1100 x 740mm, cadeiras e outros (carona)",130000,"PRÓ-REITORIA DE ASSUNTOS ESTUDANTIS","PRÓ-REITORIA DE ASSUNTOS ESTUDANTIS","DIVISÃO DE ADMINISTRAÇÃO FINANCEIRA","As mesas foram atendidas através do processo 009790/2014. Já houve empenho (2014NE802293), anulação parcial do empenho (2014NE802390) e a data prevista de entrega é até 15/03/15.\nJá houve empenho (2014NE802296) e a data prevista de entrega é até 15/03/15.\nAs cadeiras não foram empenhadas porque a empresa apresentou irregularidades no SICAF.\nEnquadramento"]
["13/2014",1906,"010455/2014","Aquisição de mesa, mesa de reunião ovalada - medindo: 2400 x 1100 x 740mm, cadeiras e outros (carona)",500030,"PROGRAMA INGLÊS SEM FRONTEIRAS","PROGRAMA INGLÊS SEM FRONTEIRAS","DIVISÃO DE ADMINISTRAÇÃO FINANCEIRA","Já houve empenho (2014NE802293), anulação parcial do empenho (2014NE802390) e a data prevista de entrega é até 15/03/15.\nJá houve empenho (2014NE802296) e a data prevista de entrega é até 15/03/15.\nJá houve empenho (2014NE802301) e a data prevista de entrega é até 15/03/15.\nA SSRP está verificando se existem caronas para atendimento das longarinas e posterior tomada de decisão entre a Direção do DMSA e PROAEST. (anexado ao 9790/2014)"]
["13/2014","S/Nº","004420/2014","Contratação de serviço de balanceamento, alinhamento e cambagem da viatura Nissan, Frontier, placa KPG 9045 e outros",100300,"PREFEITURA UNIVERSITÁRIA","PREFEITURA UNIVERSITÁRIA","ARQUIVO","Arquivado porque  houve empenho (2014NE801401) e pagamento (2014OB808293)."]
["13/2014","S/Nº","011372/2014","Abertura de processo de concessão de espaço - Reprografia no Pavilhão Central",120000,"PRÓ-REITORIA DE ASSUNTOS FINANCEIROS","SETOR DE PONTOS COMERCIAIS","DR. PAULINO","Emissão de parecer Jurídico"]
["13/2014","S/Nº","005201/2014","Contratação de serviço para conserto e reparo da autoclave de tratamento de madeira do IF",260000,"INSTITUTO DE FLORESTAS","INSTITUTO DE FLORESTAS","INSTITUTO DE FLORESTAS","Buscando informações."]
["14/2014",1053,"006045/2014","Aquisição de material de construção (grupo 30.24A)",180000,"CTUR","CTUR","PREGÃO","Pregão 30/2015 agendado para abertura 27/03/2015."]
["14/2014",1081,"006016/2014","Aquisição de cartuchos hp, toners e tintas (grupo 30.17A)",130000,"PRÓ-REITORIA DE ASSUNTOS ESTUDANTIS","SECRETARIA","DMSA","Buscando informações."]
["14/2014",451,"002704/2014","Aquisição de material de expediente (papel A4, carta, ofício, etc)",150000,"PRÓ-REITORIA DE EXTENSÃO","DEPARTAMENTO DE ARTE E CULTURA","CPACS","Consolidar Pesquisas de Preços"]
["14/2014",1048,"004957/2014","Bomba de infusão linear peristáltica de uso veterinário",280010,"HOSPITAL VETERINÁRIO","HOSPITAL VETERINÁRIO","SEC. ADM. DO DEPTO DE CONTABILIDADE E FINANÇAS","Realizando ajustes após emissão de parecer jurídico."]
["14/2014",326,"002700/2014","Aquisição de gás liquefeito de petróleo",290000,"INSTITUTO DE ZOOTECNIA","INSTITUTO DE ZOOTECNIA","DIREÇÃO DMSA","Pregão nº 138/2014 finalizado em 14/11/14. O processo está disponível na Seção de Sistema de Registro de Preços para solicitar empenhos."]
["14/2014",188,"002703/2014","Aquisição de material de artes gráficas e desenho",160010,"EDITORA UNIVERSIDADE RURAL","EDITORA UNIVERSIDADE RURAL","SSRP","Será atendido junto com a Demanda de 2015 - equipe do projeto"]
["14/2014",1280,"006505/2014","Aquisição de ultra freezer -80ºc",160001,"PRÓ - EQUIPAMENTOS","PROPPG","CLOG","Realizando ajustes após emissão de parecer jurídico."]
["14/2014","S/Nº","003913/2014","Serviço de gerenciamento para fornecimento de óleos",100300,"PREFEITURA UNIVERSITÁRIA","DIVISÃO DE SERVIÇOS GERAIS","SPP","Pesquisa de preço."]
["14/2014","S/Nº","011070/2014","Licitação para espaço destinado à reprografia ",400000,"CAMPUS DA UFRRJ EM TRÊS RIOS","CAMPUS DA UFRRJ EM TRÊS RIOS","DRA. IVANI","Aguardando autorização da despesa."]
["15/2014",1287,"006008/2014","Aquisição de material hidráulico (grupo 30.24)",130000,"PRÓ-REITORIA DE ASSUNTOS ESTUDANTIS","SETOR DE RESIDÊNCIA ESTUDANTIL","ASTEC","Elaboração da minuta de edital."]
["15/2014",1146,"005219/2014","Pagamento de inscrição dos servidores Luan Gonçalves e Sandro Luis no XXIII Curso sobre contratação de bens e serviços de TI ",120200,"DEPARTAMENTO DE MATERIAL E SERVIÇOS AUXILIARES","ASSESSORIA TÉCNICA DO DMSA","ARQUIVO","Desarquivado pela CODEP para realizar o relatório anual de cursos  do Governo Federal e em breve será novamente arquivado.\nArquivado porque  houve empenho (2014NE801508) e pagamento (2014OB807625 e 2014DR800065)."]
["15/2014",1331,"006284/2014","Aquisição de microscópio trinolucar",160001,"PRÓ - EQUIPAMENTOS","PROPPG","CLOG","Já houve empenho (2014NE802219), mas faltam informações sobre a entrega."]
["15/2014",327,"002701/2014","Aquisição de café, açúcar, coador e adoçante",290000,"INSTITUTO DE ZOOTECNIA","INSTITUTO DE ZOOTECNIA","CLOG","Pregão nº 88/2014 finalizado em 03/11/14. Já houve empenho (2014NE802417, 2015NE800302) e pagamento (2015OB800319). O processo está disponível na Seção de Sistema de Registro de Preços para solicitar empenhos."]
["15/2014","S/Nº","008047/2014","Confecção de calçada, reforma de escada e colocação de revestimento em área final do Pavilhao de Aulas",270000,"INSTITUTO DE TECNOLOGIA","INSTITUTO DE TECNOLOGIA","ARQUIVO","O processo foi encaminhado da Secretaria Administrativa do Instituto de Tecnologia à SAPG em 29/01/15 (carga no Sistema Protocolo), mas ainda não chegou in loco."]
["15/2014",452,"002707/2014","Aquisição de artigos de copa e cozinha",150000,"PRÓ-REITORIA DE EXTENSÃO","PRÓ-REITORIA DE EXTENSÃO","SPP","Verificando a possibilidade de atendimento juntamente com a demanda de 2015."]
["15/2014",190,"002707/2014","Aquisição de artigos de copa e cozinha",160010,"EDITORA UNIVERSIDADE RURAL","EDITORA UNIVERSIDADE RURAL","SPP","Verificando a possibilidade de atendimento juntamente com a demanda de 2015."]
["16/2014",430,"002700/2014","Aquisição de gás liquefeito de petróleo",220000,"INSTITUTO DE BIOLOGIA","INSTITUTO DE BIOLOGIA","DIREÇÃO DMSA","Pregão nº 138/2014 finalizado em 14/11/14. O processo está disponível na Seção de Sistema de Registro de Preços para solicitar empenhos."]
["16/2014",1255,"005968/2014","Aquisição de mobiliário em geral (grupo 52.42)",180000,"CTUR","CTUR","DIREÇÃO DMSA","Verificando a possibilidade de atendimento juntamente com a demanda de 2015."]
["16/2014",453,"002706/2014","Aquisição de artigos de higiene e conservação",150000,"PRÓ-REITORIA DE EXTENSÃO","DEPARTAMENTO DE ARTE E CULTURA","SPP","Verificando a possibilidade de atendimento juntamente com a demanda de 2015."]
["16/2014",1051,"004957/2014","Serra óssea oscilatória à bateria",280010,"HOSPITAL VETERINÁRIO","HOSPITAL VETERINÁRIO","SEC. ADM. DO DEPTO DE CONTABILIDADE E FINANÇAS","Realizando ajustes após emissão de parecer jurídico."]
["16/2014",1334,"006281/2014","Aquisição de scanner Copibbik Cobalt - Pró-equipamento",160001,"PRÓ - EQUIPAMENTOS","PROPPG","DIVISÃO DE ADMINISTRAÇÃO FINANCEIRA","Já houve empenho (2014NE802212), mas faltam informações sobre a entrega."]
["16/2014",328,"002701/2014","Aquisição de café, açúcar, coador e adoçante",290000,"INSTITUTO DE ZOOTECNIA","INSTITUTO DE ZOOTECNIA","CLOG","Pregão nº 88/2014 finalizado em 03/11/14. Já houve empenho (2014NE802417, 2015NE800302) e pagamento (2015OB800319). O processo está disponível na Seção de Sistema de Registro de Preços para solicitar empenhos."]
["16/2014",1523,"008048/2014","Contratação de serviço de pessoa jurídica para recuperação emergencial de rede de esgoto",270000,"INSTITUTO DE TECNOLOGIA","INSTITUTO DE TECNOLOGIA","ARQUIVO","Está sendo atendido pelo 010408/2014 e provavelmente em breve será encaminhado para empenho."]
["16/2014",1476,"007506/2014","Pagamento de inscriçãoo no XVIII Seminário Nacional de Bibliotecas Universitárias Belo Horizonte-MG das servidoras Letícia Schettini, Eliane Maricá Soares e Silvia Alves de Andrade",10310,"CAPACITAÇÃO DE SERVIDORES - RECURSOS ESPECÍFICOS","REITORIA/BIBLIOTECA","SAPG","Já houve empenho (2014NE802101), mas o pagamento ainda não foi efetuado."]
["16/2014","S/Nº","011373/2014","Abertura de processo de concessão de espaço - Reprografia no ICE/PQ",120000,"PRÓ-REITORIA DE ASSUNTOS FINANCEIROS","SETOR DE PONTOS COMERCIAIS","DR. PAULINO","Emissão de parecer Jurídico"]
["16/2014",1912,"009792/2014","Serviços de confecção com fornecimento de 14.000 cintas elásticas para unir processos",160000,"PRÓ-REITORIA DE PESQUISA E PÓS GRADUAÇÃO","PRÓ-REITORIA DE PESQUISA E PÓS GRADUAÇÃO","DRA. IVANIR","Elaboração da minuta de edital."]
["17/2014",329,"002704/2014","Aquisição de material de expediente (papel A4, carta, ofício, etc)",290000,"INSTITUTO DE ZOOTECNIA","DNAP","CPACS","Consolidar Pesquisas de Preços"]
["17/2014",1049,"004957/2014","Conjunto de canil em aço inoxidável 304",280010,"HOSPITAL VETERINÁRIO","HOSPITAL VETERINÁRIO","SEC. ADM. DO DEPTO DE CONTABILIDADE E FINANÇAS","Realizando ajustes após emissão de parecer jurídico."]
["17/2014",1333,"006282/2014","Aquisição de criostato para cortes em congelados",160001,"PRÓ - EQUIPAMENTOS","PROPPG","CLOG","Buscando informações."]
["17/2014",1456,"007599/2014","Aquisição de título: Estudo do lazer",180000,"CTUR","CTUR","SPP","Atualizando a Pesquisa de Preços e atendendo recomendações do Parecer da PROGER"]
["17/2014",257,"002701/2014","Aquisição de café, açúcar, coador e adoçante",220000,"INSTITUTO DE BIOLOGIA","INSTITUTO DE BIOLOGIA","CLOG","Pregão nº 88/2014 finalizado em 03/11/14. Já houve empenho (2014NE802417, 2015NE800302) e pagamento (2015OB800319). O processo está disponível na Seção de Sistema de Registro de Preços para solicitar empenhos."]
["17/2014",454,"002699/2014","Aquisição de material de expediente",150000,"PRÓ-REITORIA DE EXTENSÃO","PRÓ-REITORIA DE EXTENSÃO","DIREÇÃO DMSA","Verificando a possibilidade de atendimento juntamente com a demanda de 2015."]
["17/2014",1477,"007506/2014","Pagamento de inscriçãoo no XVIII Seminário Nacional de Bibliotecas Universitárias Belo Horizonte-MG das servidoras Letícia Schettini, Eliane Maricá Soares e Silvia Alves de Andrade",10310,"CAPACITAÇÃO DE SERVIDORES - RECURSOS ESPECÍFICOS","REITORIA/BIBLIOTECA","SAPG","Já houve empenho (2014NE802101), mas o pagamento ainda não foi efetuado."]
["17/2014","S/Nº","011374/2014","Abertura de processo de concessão de espaço - Reprografia IV",120000,"PRÓ-REITORIA DE ASSUNTOS FINANCEIROS","SETOR DE PONTOS COMERCIAIS","DRA. IVANI","Emissão de parecer Jurídico"]
["17/2014","S/Nº","008026/2014","Recuperação de área no Pavilhão de Aulas do IT para almoxarifado de produtos limpeza e instalação de tanques de lavagem",270000,"INSTITUTO DE TECNOLOGIA","INSTITUTO DE TECNOLOGIA","INSTITUTO DE TECNOLOGIA","Buscando informações."]
["17/2014",1749,"009677/2014","Aquisição de aparelho auditivo programado",130000,"PRÓ-REITORIA DE ASSUNTOS ESTUDANTIS","PRÓ-REITORIA DE ASSUNTOS ESTUDANTIS","SPP","Pesquisa de preço."]
["18/2014",330,"002706/2014","Aquisição de artigos de higiene e conservação",290000,"INSTITUTO DE ZOOTECNIA","DNAP","SPP","Verificando a possibilidade de atendimento juntamente com a demanda de 2015."]
["18/2014",1033,"004906/2014","Aquisição de videogastroscópio pediátrico ultra-fino Olympus (grupo 52.08)",280010,"HOSPITAL VETERINÁRIO","HOSPITAL VETERINÁRIO","CLOG","Aguardando autorização da PROAF para empenho."]
["18/2014",1407,"007038/2014","Aquisição de tanque para fabricação de queijo",180000,"CTUR","CTUR","ASSESSORIA TECNICA/DMSA","Elaboração da minuta de edital."]
["18/2014",1279,"006506/2014","Aquisição de sistema Bio-plex MagPix Sistema Bio-plex MagPix",160001,"PRÓ - EQUIPAMENTOS","PROPPG","CLOG","Já houve empenho (2014NE802216), mas faltam informações sobre a entrega."]
["18/2014",1638,"008027/2014","Recuperação de tetos em gesso nos laboratórios do DAU",270000,"INSTITUTO DE TECNOLOGIA","DEPARTAMENTO DE ARQUITETURA E URBANISMO","DIVISÃO DE ADMINISTRAÇÃO FINANCEIRA","Emissão da Nota de empenho"]
["18/2014",1470,"007545/2014","Pagamento de inscrição do curso XI Semana de Administração Orçamentária Financeira e de Contratações Públicas dos servidores Marcio Bastos e Luan Lima",120200,"DEPARTAMENTO DE MATERIAL E SERVIÇOS AUXILIARES","DEPARTAMENTO DE MATERIAL E SERVIÇOS AUXILIARES","SCD","Buscando informações."]
["18/2014",1786,"009040/2014","Aquisição de duas cadeiras de rodas",130100,"RESTAURANTE UNIVERSITÁRIO - CAMPUS SEROPÉDICA","PROAES","ARQUIVO","Já houve empenho (2014NE802489) e pagamento (2015OB800810)"]
["18/2014","S/Nº","011375/2014","Abertura de processo de concessão de espaço - Reprografia no Instituto de Educação",120000,"PRÓ-REITORIA DE ASSUNTOS FINANCEIROS","SETOR DE PONTOS COMERCIAIS","DRA. IVANI","Emissão de parecer Jurídico"]
["18/2014","S/Nº","004157/2014","Aquisição de cadeira escritório, material revestimento assento e encosto tecido 100 poliester e outros",270000,"INSTITUTO DE TECNOLOGIA","INSTITUTO DE TECNOLOGIA","DIREÇÃO DMSA","Buscando informações."]
["18/2014",274,"002699/2014","Aquisição de material de expediente",220000,"INSTITUTO DE BIOLOGIA","INSTITUTO DE BIOLOGIA","DIREÇÃO DMSA","Verificando a possibilidade de atendimento juntamente com a demanda de 2015."]
["18/2014",1427,"007161/2014","Aquisição de tanque elétrico para fabricação de queijo de 50l e etc",180000,"CTUR","CTUR","ARQUIVO","Aguardando a ata assinada pelo órgão gerenciador da IRP."]
["19/2014",259,"002706/2014","Aquisição de artigos de higiene e conservação",220000,"INSTITUTO DE BIOLOGIA","DEPARTAMENTO DE GENÉTICA","SPP","Verificando a possibilidade de atendimento juntamente com a demanda de 2015."]
["19/2014",1050,"004957/2014","Central de análise de holter com licença de uso de software central",280010,"HOSPITAL VETERINÁRIO","HOSPITAL VETERINÁRIO","SEC. ADM. DO DEPTO DE CONTABILIDADE E FINANÇAS","Realizando ajustes após emissão de parecer jurídico."]
["19/2014",1278,"005685/2014","Aquisição de estação de lavagem Bioplex",160001,"PRÓ - EQUIPAMENTOS","PROPPG","CLOG","Já houve empenho (2014NE802215) e foi entregue no Almoxarifado em 02/03/15."]
["19/2014",331,"002699/2014","Aquisição de material de expediente",290000,"INSTITUTO DE ZOOTECNIA","INSTITUTO DE ZOOTECNIA","DIREÇÃO DMSA","Verificando a possibilidade de atendimento juntamente com a demanda de 2015."]
["19/2014",455,"002703/2014","Aquisição de material de artes gráficas e desenho",150000,"PRÓ-REITORIA DE EXTENSÃO","PRÓ-REITORIA DE EXTENSÃO","SSRP","Será atendido junto com a Demanda de 2015 - equipe do projeto"]
["19/2014",1904,"010411/2014","Cordão para crachá personalizado",130100,"RESTAURANTE UNIVERSITÁRIO - CAMPUS SEROPÉDICA","PRÓ-REITORIA DE ASSUNTOS ESTUDANTIS","ARQUIVO","Já houve empenho (2014NE802544), mas o prazo de entrega está vencido e a SSRP está realizando a devida cobrança."]
["19/2014","S/Nº","011376/2014","Abertura de processo de concessão de espaço - Venda de livros no Instituto de Educação",120000,"PRÓ-REITORIA DE ASSUNTOS FINANCEIROS","SETOR DE PONTOS COMERCIAIS","DRA. JAQUELINE","Elaboração da minuta de edital."]
["19/2014","S/Nº","001017/2014","Aquisicao de sabonete líquido, aspecto fisico líquido perfumado, aplicação saboneteira para sabonetes líquidos etc",120200,"DEPARTAMENTO DE MATERIAL E SERVIÇOS AUXILIARES","DEPARTAMENTO DE MATERIAL E SERVIÇOS AUXILIARES","ARQUIVO","Arquivado porque o processo 000665/2012 foi concluído e contempla esse item."]
["19/2014",1949,"010408/2014","Recuperação na rede de esgoto do pavilhão de aulas do IT",270000,"INSTITUTO DE TECNOLOGIA","INSTITUTO DE TECNOLOGIA","DIVISÃO DE CONTABILIDADE","Houve empenho (2015NE800197) e está elaborando a minuta de contrato."]
["19/2014",1002,"005202/2014","Contratação de serviço de recuperação da suspensão diantera com subst. das balanças dianteiras, veiculo placa: LLC 588",100300,"PREFEITURA UNIVERSITÁRIA","PREFEITURA UNIVERSITÁRIA","ARQUIVO","Arquivado após entendimento firmado entre a Direção do DMSA e a Pró Reitoria de Assuntos Financeiros, cujos processos de conserto de veículos deverão ser atendidos pelo contrato de manutenção de automóveis (processo 011591/2013), cuja gestão compete à Prefeitura Universitária. "]
["20/2013","S/Nº","006016/2014","Aquisição de cartuchos hp, toners e tintas (grupo 30.17A)",100200,"IMPRENSA UNIVERSITÁRIA","IMPRENSA UNIVERSITÁRIA","DMSA","Buscando informações."]
["20/2013","S/Nº","000121/2014","Contratação de um serviço de assinatura de jornal, diário de grande circulação com abrangência nacional",100000,"REITORIA","REITORIA","ARQUIVO","Arquivado porque houve empenho (2014NE801533) e pagamentos (2014OB807181 e 2014DF801855)."]
["20/2014",114,"006018/2014","Aquisição de equipamentos para laboratório (grupo 52.08)",280000,"INSTITUTO DE VETERINÁRIA","DIRETORIA","DIREÇÃO DMSA","Buscando informações."]
["20/2014",1041,"006045/2014","Aquisição de material de construção (grupo 30.24A)",100300,"PREFEITURA UNIVERSITÁRIA","DIVISÃO DE SERVIÇOS GERAIS","PREGÃO","Pregão 30/2015 agendado para abertura 27/03/2015."]
["20/2014",1862,"009286/2014","Pagamento de inscriçãoo no V SIMGEO Simpósio Brasileiro de Ciências Geodésicas e Tecnologias da Geoinformação",270000,"INSTITUTO DE TECNOLOGIA","DEPARTAMENTO DE ENGENHARIA","ARQUIVO","Desarquivado pela CODEP para realizar o relatório anual de cursos  do Governo Federal e em breve será novamente arquivado.\nArquivado porque  houve empenho (2014NE802153) e pagamento (2014OB808998)."]
["20/2014",986,"005730/2014","Manutenção mensal de guilhotina automática",100200,"IMPRENSA UNIVERSITÁRIA","DIRETORIA","DRA. IVANI","Emissão de parecer Jurídico"]
["20/2014",1032,"004905/2014","Aquisição de lâmpada xenon de 300w para CLV-U20",280010,"HOSPITAL VETERINÁRIO","HOSPITAL VETERINÁRIO","SEÇÃO DE CONTROLE","Já houve empenho (2014NE802422) e foi entregue no Almoxarifado em 15/12/14."]
["20/2014",1905,"010410/2014","Confecção de canecas redondas, com capacidade para 400ml",130100,"RESTAURANTE UNIVERSITÁRIO - CAMPUS SEROPÉDICA","PRÓ-REITORIA DE ASSUNTOS ESTUDANTIS","SEÇÃO DE CONTROLE","Já houve empenho (2014NE802367) e a data prevista de entrega é até 26/12/14. "]
["20/2014",1851,"009340/2014","Conserto e manutenção preventiva do espectrômetro",10000,"RESERVA TÉCNICA","IT-DEPARTAMENTO DE ENGENHARIA QUÍMICA - DEQ","ARQUIVO","Já houve empenho (2014NE802534), mas o pagamento ainda não foi efetuado."]
["20/2014","S/Nº","001018/2014","Papel higiênico, material celulose virgem, comprimento 30m, largura 10cm, tipo picotado etc",120200,"DEPARTAMENTO DE MATERIAL E SERVIÇOS AUXILIARES","DEPARTAMENTO DE MATERIAL E SERVIÇOS AUXILIARES","ARQUIVO","Arquivado porque o pregão referente a aquisição de papel higiênico foi homologado em 10/02/2014, sendo assim já existe uma ata de registro de preços vigente para futuras aquisições. Além disso, o valor do papel higiênico em nossa ata é mais vantajoso para Administração Pública."]
["20/2014",260,"002707/2014","Aquisição de artigos de copa e cozinha",220000,"INSTITUTO DE BIOLOGIA","INSTITUTO DE BIOLOGIA","SPP","Verificando a possibilidade de atendimento juntamente com a demanda de 2015."]
["20/2014",1758,"009344/2014","Manutenção corretiva em equipamento de desativar/reativar modelo da 927, de sistema de segurança",300000,"CAMPUS DA UFRRJ EM NOVA IGUAÇU","BIBLIOTECA DO INSTITUTO MULTIDISCIPLINAR","DIVISÃO DE ADMINISTRAÇÃO FINANCEIRA","Aguardando a empresa enviar as documentações atualizadas."]
["20/2014",924,"003931/2014","Serviço de confecção de 50.000 capas de processos personalizadas com brasão da república",110200,"SEÇÃO DE ARQUIVO E PROTOCOLO GERAL","SEÇÃO DE ARQUIVO E PROTOCOLO GERAL","ARQUIVO","Já houve empenho (2014NE801255) e pagamento (2014OB805933)"]
["21/2014",1042,"006008/2014","Aquisição de material hidráulico (grupo 30.24)",100300,"PREFEITURA UNIVERSITÁRIA","DIVISÃO DE SERVIÇOS GERAIS","ASTEC","Elaboração da minuta de edital."]
["21/2014",1060,"006016/2014","Aquisição de cartuchos hp, toners e tintas (grupo 30.17A)",220300,"DEPARTAMENTO DE CIÊNCIAS FISIOLÓGICAS","DEPARTAMENTO DE CIÊNCIAS FISIOLÓGICAS","DMSA","Buscando informações."]
["21/2014",1101,"006016/2014","Aquisição de cartuchos hp, toners e tintas (grupo 30.17A)",280010,"HOSPITAL VETERINÁRIO","HOSPITAL VETERINÁRIO","DMSA","Buscando informações."]
["21/2014",1480,"007505/2014","Aquisição de equipamentos agrícolas - tanque, plantadeiras, podão, pulverizador, arado, carreta, etc (grupo 52.40)",180000,"CTUR","CTUR","SPP","Pesquisa de preço."]
["21/2014",841,"000122/2014","Contratação de um serviço de TV por assinatura que contenha os canais ligados à educação e informação",100000,"REITORIA","ASSESSORIA DE INFORMAÇÃO E COMUNICAÇÃO","DIREÇÃO DMSA","Não houve interessados em participar da dispensa de licitação e as devidas providências estão sendo adotadas."]
["21/2014",1863,"009285/2014","Pagamento de inscrição da profª. Alessandra Carreiro no V Simpósio Brasileiro de Ciências Geodésicas",100000,"REITORIA","INSTITUTO DE TECNOLOGIA","ARQUIVO","Desarquivado pela CODEP para realizar o relatório anual de cursos  do Governo Federal e em breve será novamente arquivado.\nArquivado porque  houve empenho (2014NE802155) e pagamento (2014OB808997)."]
["21/2014","S/Nº","001019/2014","Aquisição de toalha de papel, tipo folha 3 dobras, comprimento 23cm, largura 22cm,cor branca etc",120200,"DEPARTAMENTO DE MATERIAL E SERVIÇOS AUXILIARES","DEPARTAMENTO DE MATERIAL E SERVIÇOS AUXILIARES","ARQUIVO","Arquivado porque o processo 000665/2012 foi concluído e contempla esse item."]
["21/2014",332,"002707/2014","Aquisição de artigos de copa e cozinha",290000,"INSTITUTO DE ZOOTECNIA","INSTITUTO DE ZOOTECNIA","SPP","Verificando a possibilidade de atendimento juntamente com a demanda de 2015."]
["21/2014",1903,"009774/2014","Aquisição de caldeirão a vapor, para cozinha industrial",130100,"RESTAURANTE UNIVERSITÁRIO - CAMPUS SEROPÉDICA","RESTAURANTE UNIVERSITÁRIO - CAMPUS SEROPÉDICA","CLOG","Já houve empenho (2014NE802458), mas o prazo de entrega está vencido e um ofício de cobrança foi emitido à empresa em 21/01/15."]
["21/2014",923,"003930/2014","Conserto de seis relógios-datador-numerador",110200,"SEÇÃO DE ARQUIVO E PROTOCOLO GERAL","SEÇÃO DE ARQUIVO E PROTOCOLO GERAL","ARQUIVO","Já houve empenho (2014NE801176) e pagamento (2014OB807422)."]
["22/2014",1063,"005203/2014","Contratação de serviços para tratamento preventivo e curativo de descupinização",220300,"DEPARTAMENTO DE CIÊNCIAS FISIOLÓGICAS","DEPARTAMENTO DE CIÊNCIAS FISIOLÓGICAS","DEPARTAMENTO DE CIENCIAS FISIOLOGICAS","Realizando alteração de pregoeiro em virtude de férias e em breve o pregão será agendado."]
["22/2014",95,"002701/2014","Aquisição de café, açúcar, coador e adoçante",210100,"DEPARTAMENTO DE FITOTECNIA","DEPARTAMENTO DE FITOTECNIA","CLOG","Pregão nº 88/2014 finalizado em 03/11/14. Já houve empenho (2014NE802417, 2015NE800302) e pagamento (2015OB800319). O processo está disponível na Seção de Sistema de Registro de Preços para solicitar empenhos."]
["22/2014",72,"002701/2014","Aquisição de café, açúcar, coador e adoçante",280000,"INSTITUTO DE VETERINÁRIA","INSTITUTO DE VETERINÁRIA","CLOG","Pregão nº 88/2014 finalizado em 03/11/14. Já houve empenho (2014NE802417, 2015NE800302) e pagamento (2015OB800319). O processo está disponível na Seção de Sistema de Registro de Preços para solicitar empenhos."]
["22/2014",163,"002699/2014","Aquisição de material de expediente",290000,"INSTITUTO DE ZOOTECNIA","INSTITUTO DE ZOOTECNIA","DIREÇÃO DMSA","Verificando a possibilidade de atendimento juntamente com a demanda de 2015."]
["22/2014",1948,"010243/2014","Contratação de empresa para prestação de serviço no ramo de alimentação",130100,"RESTAURANTE UNIVERSITÁRIO - CAMPUS SEROPÉDICA","PRÓ-REITORIA DE ASSUNTOS ESTUDANTIS","COORDENAÇÃO DE CONTRATOS E IMPORTAÇÃO","Analisando esclarecimentos sobre os cargos solicitados na contratação em questão (despachos envolvendo DP, DMSA e PROAEST)."]
["22/2014",1262,"005540/2014","Contratação de serviços para conserto da impressora laser colorida a3 marca Lexmark - c910n",150200,"IMPRENSA UNIVERSITÁRIA","IMPRENSA UNIVERSITÁRIA","DIREÇÃO DMSA","Reqmat 22 e 26 não serão atendidos pois os valors dos consertos ultrapassam seus respectivos valores de mercado.\nAnálise e posterior encaminhamento À PROAF para autorização da despesa"]
["22/2014",925,"003929/2014","Aquisição de unidade de fita com carratel metálica para relógio-numerador-datador",110200,"SEÇÃO DE ARQUIVO E PROTOCOLO GERAL","SEÇÃO DE ARQUIVO E PROTOCOLO GERAL","ARQUIVO","Já houve empenho (2014NE800941) e pagamento (2014OB804518)"]
["23/2014",73,"002706/2014","Aquisição de artigos de higiene e conservação",280000,"INSTITUTO DE VETERINÁRIA","SECRETARIA DA DIRETORIA","SPP","Verificando a possibilidade de atendimento juntamente com a demanda de 2015."]
["23/2014",162,"002706/2014","Aquisição de artigos de higiene e conservação",290000,"INSTITUTO DE ZOOTECNIA","DEPARTAMENTO DE REPRODUÇÃO E AVALIAÇÃO ANIMAL - DRAA","SPP","Verificando a possibilidade de atendimento juntamente com a demanda de 2015."]
["23/2014",96,"002699/2014","Aquisição de material de expediente",210100,"DEPARTAMENTO DE FITOTECNIA","DEPARTAMENTO DE FITOTECNIA","DIREÇÃO DMSA","Verificando a possibilidade de atendimento juntamente com a demanda de 2015."]
["23/2014","S/Nº","006543/2014","Aquisição dos itens do grupo 30.90 - Material de propriedade intelectual - Software sound forge pro 11 e outros",240000,"INSTITUTO DE CIÊNCIAS HUMANAS E SOCIAIS","INSTITUTO DE CIÊNCIAS HUMANAS E SOCIAIS","COINFO","Buscando informações."]
["23/2014",1943,"010220/2014","Aquisição de lâmina para microscopia e etc",280010,"HOSPITAL VETERINÁRIO","HOSPITAL VETERINÁRIO","SEÇÃO DE CONTROLE","Já houve empenho (2014NE802464), mas o prazo de entrega está vencido desde 04/01/15.\nJá houve empenho (2014NE802472) e foi entregue no Almoxarifado em 30/12/14."]
["23/2014",1263,"005540/2014","Contratação de serviços para conserto da impressora (Plotter) HP DesignJEt",100200,"IMPRENSA UNIVERSITÁRIA","DIRETORIA DO DEPARTAMENTO","DIREÇÃO DMSA","Reqmat 22 e 26 não serão atendidos pois os valors dos consertos ultrapassam seus respectivos valores de mercado.\nAnálise e posterior encaminhamento À PROAF para autorização da despesa"]
["24/2014",97,"002704/2014","Aquisição de material de expediente (papel A4, carta, ofício, etc)",210100,"DEPARTAMENTO DE FITOTECNIA","DEPARTAMENTO DE FITOTECNIA","CPACS","Consolidar Pesquisas de Preços"]
["24/2014",74,"002704/2014","Aquisição de material de expediente (papel A4, carta, ofício, etc)",280000,"INSTITUTO DE VETERINÁRIA","SECRETARIA DA DIRETORIA","CPACS","Consolidar Pesquisas de Preços"]
["24/2014",159,"002704/2014","Aquisição de material de expediente (papel A4, carta, ofício, etc)",290000,"INSTITUTO DE ZOOTECNIA","DEPARTAMENTO DE REPRODUÇÃO E AVALIAÇÃO ANIMAL - DRAA","CPACS","Consolidar Pesquisas de Preços"]
["24/2014",1175,"006087/2014","Aquisição de material químico (grupo 30.11)",220300,"DEPARTAMENTO DE CIÊNCIAS FISIOLÓGICAS","DEPARTAMENTO DE CIÊNCIAS FISIOLÓGICAS","SPP","Pesquisa de preço."]
["24/2014",1426,"007531/2014","Aquisição de micro trator (grupo 52.52)",180000,"CTUR","CTUR","ARQUIVO","Foi atendido pelo 008123/2011, houve empenho (2014NE802609) e foi encaminhado ao CTUR para ciência."]
["24/2014","S/Nº","005124/2014","Contratação de serviço especializado para manutenção de elevador",100300,"PREFEITURA UNIVERSITÁRIA","PREFEITURA UNIVERSITÁRIA","DCF","(vazio)"]
["24/2014",1776,"001368/2014","Pagamento de inscrição no curso: Contratação direta - dispensa, inexigibilidade e SRP (Denis dos Reis Carvalho)",120200,"DEPARTAMENTO DE MATERIAL E SERVIÇOS AUXILIARES","SEÇÃO DE COMPRAS DIRETAS","ARQUIVO","O curso foi cancelado e o outro curso solicitado não chegou a ser empenhado por não ter sido feito em tempo hábil. Empenho cancelado 2014IN00008"]
["25/2014",1085,"005968/2014","Aquisição de mobiliário em geral (grupo 52.42)",400000,"CAMPUS DA UFRRJ EM TRÊS RIOS","CAMPUS DA UFRRJ EM TRES RIOS","DIREÇÃO DMSA","Verificando a possibilidade de atendimento juntamente com a demanda de 2015."]
["25/2014",98,"002706/2014","Aquisição de artigos de higiene e conservação",210100,"DEPARTAMENTO DE FITOTECNIA","DEPARTAMENTO DE FITOTECNIA","SPP","Verificando a possibilidade de atendimento juntamente com a demanda de 2015."]
["25/2014",1478,"007548/2014","Aquisição de material hidráulico - tubo ultra JE, luva de correr (grupo 30.24)",180000,"CTUR","CTUR","SIRERR","(vazio)"]
["25/2014",1176,"005807/2014","Aquisição de itens do grupo 30.36 - Artigos cirúrgicos e de enfermaria",220300,"DEPARTAMENTO DE CIÊNCIAS FISIOLÓGICAS","DEPARTAMENTO DE CIÊNCIAS FISIOLÓGICAS","PREGÃO","Aguardando manifestação de interesse (IRP) de outros órgãos para realizar o pregão. Pregão nº 12/2015."]
["25/2014",75,"002699/2014","Aquisição de material de expediente",280000,"INSTITUTO DE VETERINÁRIA","INSTITUTO DE VETERINÁRIA","DIREÇÃO DMSA","Verificando a possibilidade de atendimento juntamente com a demanda de 2015."]
["25/2014","S/Nº","006081/2014","Aquisição de duas baterias de 12v e 150 amperes para grupo gerador do P1",100300,"PREFEITURA UNIVERSITÁRIA","PREFEITURA UNIVERSITÁRIA","SEÇÃO DE CONTROLE","Já houve empenho (2014NE802286), pagamento (2014OB809805) e foi entregue no Almoxarifado em 09/12/14."]
["25/2014",158,"002707/2014","Aquisição de artigos de copa e cozinha",290000,"INSTITUTO DE ZOOTECNIA","INSTITUTO DE ZOOTECNIA","SPP","Verificando a possibilidade de atendimento juntamente com a demanda de 2015."]
["25/2014",1861,"009289/2014","Assinatura anual banco de preços, sistema inteligente de pesquisas baseado em resultados de licitações adjudicadas e homologadas",120200,"DEPARTAMENTO DE MATERIAL E SERVIÇOS AUXILIARES","DEPARTAMENTO DE MATERIAL E SERVIÇOS AUXILIARES","DIREÇÃO DMSA","O empenho foi emitido (2014NE802195) e a empresa já está prestando os serviços."]
["26/2014",1084,"006016/2014","Aquisição de cartuchos hp, toners e tintas (grupo 30.17A)",400000,"CAMPUS DA UFRRJ EM TRÊS RIOS","CAMPUS DA UFRRJ EM TRÊS RIOS","DMSA","Buscando informações."]
["26/2014",323,"002701/2014","Aquisição de café, açúcar, coador e adoçante",110000,"PRÓ-REITORIA DE ASSUNTOS ADMINISTRATIVOS","PRÓ-REITORIA DE ASSUNTOS ADMINISTRATIVOS","CLOG","Pregão nº 88/2014 finalizado em 03/11/14. Já houve empenho (2014NE802417, 2015NE800302) e pagamento (2015OB800319). O processo está disponível na Seção de Sistema de Registro de Preços para solicitar empenhos."]
["26/2014","S/Nº","002705/2014","Aquisição de medicamentos de uso veterinário",290000,"INSTITUTO DE ZOOTECNIA","INSTITUTO DE ZOOTECNIA","SPP","Realizando ajustes após emissão de parecer jurídico."]
["26/2014","S/Nº","001368/2014","Pagamento de inscrição no curso: Contratação direta - dispensa, inexigibilidade e SRP (Denis dos Reis Carvalho)",120200,"DEPARTAMENTO DE MATERIAL E SERVIÇOS AUXILIARES","SEÇÃO DE COMPRAS DIRETAS","ARQUIVO","Buscando informações."]
["26/2014",99,"002707/2014","Aquisição de artigos de copa e cozinha",210100,"DEPARTAMENTO DE FITOTECNIA","DEPARTAMENTO DE FITOTECNIA","SPP","Verificando a possibilidade de atendimento juntamente com a demanda de 2015."]
["26/2014",76,"002707/2014","Aquisição de artigos de copa e cozinha",280000,"INSTITUTO DE VETERINÁRIA","INSTITUTO DE VETERINÁRIA","SPP","Verificando a possibilidade de atendimento juntamente com a demanda de 2015."]
["26/2014",1288,"005540/2014","Contratação de serviços para conserto da impressora RISO HC 5500R multifuncional",100200,"IMPRENSA UNIVERSITÁRIA","DIRETORIA DO DEPARTAMENTO","DIREÇÃO DMSA","Reqmat 22 e 26 não serão atendidos pois os valors dos consertos ultrapassam seus respectivos valores de mercado.\nAnálise e posterior encaminhamento À PROAF para autorização da despesa"]
["27/2014",1379,"006501/2014","Aquisição de cesto aéreo de cabine dupla para adaptação em um caminhão Munck",100300,"PREFEITURA UNIVERSITÁRIA","DIVISÃO DE SERVIÇOS GERAIS","SPP","Elaboração da minuta de edital."]
["27/2014",1744,"008327/2014","Serviço com fornecimento de divisórias",220300,"DEPARTAMENTO DE CIÊNCIAS FISIOLÓGICAS","DEPARTAMENTO DE CIÊNCIAS FISIOLÓGICAS","DRA. JAQUELINE","Aguardando solicitação de nova dotação orçamentária junto à PROAF."]
["27/2014",1881,"009331/2014","Aquisição de papel A4",120200,"DEPARTAMENTO DE MATERIAL E SERVIÇOS AUXILIARES","DEPARTAMENTO DE MATERIAL E SERVIÇOS AUXILIARES","CLOG","Já houve empenhos (2014NE802285, 2014NE802289, 2014NE802485, 2014NE802284, 2014NE802287, 2014NE802483, 2014NE802528 e 2014NE802590) e a data prevista de entrega é até 16/01/15.\n\nJá houve empenhos (2014NE802173, 2014NE802175, 2014NE802176, 2014NE802177, 2014NE802188, 2014NE802189, 2014NE802190 e 2014NE802191) e foram entregues no Almoxarifado em 04/12/14.\n\nJá houve empenhos (2014NE802174 e 2014NE802193) e foram entregues no Almoxarifado em 10/12/14."]
["27/2014",322,"002699/2014","Aquisição de material de expediente",110000,"PRÓ-REITORIA DE ASSUNTOS ADMINISTRATIVOS","PRÓ-REITORIA DE ASSUNTOS ADMINISTRATIVOS","DIREÇÃO DMSA","Verificando a possibilidade de atendimento juntamente com a demanda de 2015."]
["27/2014",1429,"007163/2014","Aquisição de veículo (zero) 0 km, de fabricação nacional, modelo sedan, ano e mod. de fabricação 2014 ou superior (carona)",180000,"CTUR","CTUR","ARQUIVO","Não houve tempo hábil para realizar a carona, pois a empresa enviou a negativa no último dia de empenho."]
["28/2014",321,"002704/2014","Aquisição de material de expediente (papel A4, carta, ofício, etc)",110000,"PRÓ-REITORIA DE ASSUNTOS ADMINISTRATIVOS","DIVISÃO DE CONCURSOS","CPACS","Consolidar Pesquisas de Preços"]
["28/2014",1956,"010332/2014","Aquisição de copos plásticos",120200,"DEPARTAMENTO DE MATERIAL E SERVIÇOS AUXILIARES","DIRETORIA","SEÇÃO DE CONTROLE","Já houve empenho (2014NE802304) e a data prevista de entrega é até 27/12/14. Já houve empenho (2014NE802305) e a entrega foi efetuada no Almoxarifado em 18/12/14."]
["28/2014",1428,"007163/2014","Aquisição de veículo (zero) 0 km, de fabricação nacional, modelo sedan, ano e mod. de fabricação 2014 ou superior (carona)",180000,"CTUR","CTUR","ARQUIVO","Não houve tempo hábil para realizar a carona, pois a empresa enviou a negativa no último dia de empenho."]
["28/2014",1490,"003666/2014","Aquisição de cartuchos de tinta",100300,"PREFEITURA UNIVERSITÁRIA","SECRETARIA","SPP","Pesquisa de preço."]
["29/2014",320,"002706/2014","Aquisição de artigos de higiene e conservação",110000,"PRÓ-REITORIA DE ASSUNTOS ADMINISTRATIVOS","DIVISÃO DE CONCURSOS","SPP","Verificando a possibilidade de atendimento juntamente com a demanda de 2015."]
["32/2014",1342,"006361/2014","Aquisição de suprimentos para impressoras (grupo 30.17)",100200,"IMPRENSA UNIVERSITÁRIA","IMPRENSA UNIVERSITÁRIA","SCD","Realizando ajustes após emissão de parecer jurídico."]
["32/2014",136,"002701/2014","Aquisição de café, açúcar, coador e adoçante",100090,"PRAÇA DE DESPORTOS","PRAÇA DE DESPORTOS","CLOG","Pregão nº 88/2014 finalizado em 03/11/14. Já houve empenho (2014NE802417, 2015NE800302) e pagamento (2015OB800319). O processo está disponível na Seção de Sistema de Registro de Preços para solicitar empenhos."]
["33/2014",135,"002704/2014","Aquisição de material de expediente (papel A4, carta, ofício, etc)",100090,"PRAÇA DE DESPORTOS","DEPARTAMENTO DE ESPORTES E LAZER","CPACS","Consolidar Pesquisas de Preços"]
["33/2014",1344,"006364/2014","Aquisição de papel 40 Kg",100200,"IMPRENSA UNIVERSITÁRIA","IMPRENSA UNIVERSITÁRIA","IMPRENSA UNIVERSITÁRIA","A aquisição foi realizada através do processo 000614/2012 e o processo 006364/2014 será arquivado. "]
["33/2014",1794,"009045/2014","Aquisição de madeira construção",100300,"PREFEITURA UNIVERSITÁRIA","DIVISÃO DE SERVIÇOS GERAIS","DIREÇÃO DMSA","Buscando informações."]
["34/2014",134,"002707/2014","Aquisição de artigos de copa e cozinha",100090,"PRAÇA DE DESPORTOS","PRAÇA DE DESPORTOS","SPP","Verificando a possibilidade de atendimento juntamente com a demanda de 2015."]
["34/2014",1734,"009342/2014","Solicitação de contratação de serviço especializado em processamento de material bibliográfico",180000,"CTUR","CTUR","DIREÇÃO DMSA","Buscando informações."]
["35/2014",1317,"006016/2014","Aquisição de cartuchos hp, toners e tintas (grupo 30.17A)",110000,"PRÓ-REITORIA DE ASSUNTOS ADMINISTRATIVOS","PROAD - SAPG","DMSA","Buscando informações."]
["35/2014",133,"002706/2014","Aquisição de artigos de higiene e conservação",100090,"PRAÇA DE DESPORTOS","DEPARTAMENTO DE ESPORTES E LAZER","SPP","Verificando a possibilidade de atendimento juntamente com a demanda de 2015."]
["35/2014","S/Nº","004540/2014","Licitação de um trailer móvel para oferecer lanches no Instituto de Florestas",120000,"PRÓ-REITORIA DE ASSUNTOS FINANCEIROS","SETOR DE CANTINAS","SETOR CONTROLE CANTINA PONTO COM. E ESPAÇO DE DIVULGAÇÃO","Emissão de parecer técnico."]
["36/2014",1891,"010419/2014","Aquisição de liquidificador industrial",180000,"CTUR","CTUR","CLOG","Já houve empenho (2014NE802294) e pagamento (2014OB809802)"]
["36/2014",132,"002703/2014","Aquisição de material de artes gráficas e desenho",100090,"PRAÇA DE DESPORTOS","PRAÇA DE DESPORTOS","SSRP","Será atendido junto com a Demanda de 2015 - equipe do projeto"]
["36/2014","S/Nº","004541/2014","Licitação de um trailer móvel para oferecer serviços de lanches no Instituto Multidisciplinar",120000,"PRÓ-REITORIA DE ASSUNTOS FINANCEIROS","SETOR DE CANTINAS","COMISSÃO DE LICITAÇÃO","Elaboração da minuta de edital."]
["37/2014",1438,"007162/2014","Manutenção de equipamentos da Imprensa Universitária (guilhotina, furador, grampeador, etc)",100200,"IMPRENSA UNIVERSITÁRIA","DIRETORIA","IMPRENSA UNIVERSITÁRIA","O requerente solicitou o processo para realizar ajustes no reqmat (os pedidos serão refeitos em 2015)."]
["37/2014",131,"002699/2014","Aquisição de material de expediente",100090,"PRAÇA DE DESPORTOS","PRAÇA DE DESPORTOS","DIREÇÃO DMSA","Verificando a possibilidade de atendimento juntamente com a demanda de 2015."]
["37/2014",1890,"010418/2014","Aquisição de equipamentos industriais",180000,"CTUR","CTUR","CLOG","Já houve empenho (2014NE802451) e a data prevista de entrega é até 12/01/15. "]
["37/2014",943,"004449/2014","Aquisição de poste duplo t em concreto armado etc",100300,"PREFEITURA UNIVERSITÁRIA","PREFEITURA UNIVERSITÁRIA"," SEC. ADM. DO DEPTO DE CONTABILIDADE E FINANÇAS","Pregão nº 21/2015 (antigo nº 158/2014) finalizado em 26/01/15. Está aguardando o envio das atas assinadas."]
["38/2014",1889,"009467/2014","Aquisição de equipamentos industriais",180000,"CTUR","CTUR","CLOG","Já houve empenho (2014NE802450) e a data prevista de entrega é até 12/01/15. "]
["38/2014",1413,"006008/2014","Aquisição de material hidráulico (grupo 30.24)",100090,"PRAÇA DE DESPORTOS","DEPARTAMENTO DE ESPORTE E LAZER","ASTEC","Elaboração da minuta de edital."]
["39/2014",1414,"006045/2014","Aquisição de material de construção (grupo 30.24A)",100090,"PRAÇA DE DESPORTOS","DEPARTAMENTO DE ESPORTE E LAZER","PREGÃO","Pregão 30/2015 agendado para abertura 27/03/2015."]
["39/2014",1458,"007549/2014","Aquisição de cadeiras ergométricas",260000,"INSTITUTO DE FLORESTAS","INSTITUTO DE FLORESTAS","CLOG","Já houve empenho (2014NE802194) e a data prevista de entrega é até 23/12/14."]
["39/2014","S/Nº","004550/2014","Licitação de um trailer móvel - Deverá oferecer o serviço de lanches no Pavilhão de Aulas Teóricas Campus Seropédica",120000,"PRÓ-REITORIA DE ASSUNTOS FINANCEIROS","SETOR DE PONTOS COMERCIAIS","SETOR CONTROLE CANTINA PONTO COM. E ESPACO DE DIVULGACAO","Emissão de parecer técnico."]
["39/2014",1840,"009343/2014","Adequação da planta de frutas do DTA",270400,"DEPARTAMENTO DE TECNOLOGIA DE ALIMENTOS","DEPARTAMENTO DFE TECNOLOGIA DE ALIMENTOS","DIREÇÃO DMSA","Buscando informações."]
["40/2014",1028,"005968/2014","Aquisição de mobiliário em geral (grupo 52.42)",100090,"PRAÇA DE DESPORTOS","DEPARTAMENTO DE ESPORTE E LAZER","DIREÇÃO DMSA","Verificando a possibilidade de atendimento juntamente com a demanda de 2015."]
["40/2014","S/Nº","005618/2014","Aquisição de caixa de arquivo em papelão reforçado padrão medindo 13,5 x 24,5 x 36 cm tamanho ofício e outros",110000,"PRÓ-REITORIA DE ASSUNTOS ADMINISTRATIVOS","SEÇÃO DE ARQUIVO E PROTOCOLO GERAL","ARQUIVO","Arquivado porque  houve empenho (2014NE801694) e pagamento (2014OB809024).\nArquivado porque  houve empenho (2014NE801695) e pagamento (2014OB808455)."]
["40/2014","S/Nº","006538/2014","Aquisição de armário, em aço carbono, tipo vestiário, com 12 portas, pitões para cadeado e ventilação, etc",100090,"PRAÇA DE DESPORTOS","PRAÇA DE DESPORTOS","ARQUIVO","Buscando informações."]
["40/2014",1459,"008202/2014","Aquisição de toners e cartuchos",260000,"INSTITUTO DE FLORESTAS","INSTITUTO DE FLORESTAS","CLOG","Buscando informações."]
["40/2014",1459,"003666/2014","Aquisição de cartuchos de tinta",260000,"INSTITUTO DE FLORESTAS","DIRETORIA","SPP","Pesquisa de preço."]
["44/2014",199,"002701/2014","Aquisição de café, açúcar, coador e adoçante",280100,"DEPARTAMENTO DE EPIDEMIOLOGIA E SAÚDE PÚBLICA","DEPARTAMENTO DE EPIDEMIOLOGIA E SAÚDE PÚBLICA","CLOG","Pregão nº 88/2014 finalizado em 03/11/14. Já houve empenho (2014NE802417, 2015NE800302) e pagamento (2015OB800319). O processo está disponível na Seção de Sistema de Registro de Preços para solicitar empenhos."]
["44/2014",1515,"007801/2014","Aquisição de nobreak 2KVA",260000,"INSTITUTO DE FLORESTAS","INSTITUTO DE FLORESTAS","INSTITUTO DE FLORESTAS","Verificando a possibilidade de atendimento através do processo 003598/2013 (pregão nº 112/2014)."]
["45/2014",198,"002704/2014","Aquisição de material de expediente (papel A4, carta, ofício, etc)",280100,"DEPARTAMENTO DE EPIDEMIOLOGIA E SAÚDE PÚBLICA","DEPARTAMENTO DE EPIDEMIOLOGIA E SAÚDE PÚBLICA","CPACS","Consolidar Pesquisas de Preços"]
["45/2014",1514,"007800/2014","Aquisição de nobreak",260000,"INSTITUTO DE FLORESTAS","INSTITUTO DE FLORESTAS","INSTITUTO DE FLORESTAS","Verificando a possibilidade de atendimento através do processo 003598/2013 (pregão nº 112/2014)."]
["45/2014",1520,"007820/2014","Aquisição de grampeador rapid 90",110200,"SEÇÃO DE ARQUIVO E PROTOCOLO GERAL","SECAO DE ARQUIVO E PROTOCOLO GERAL","SEÇÃO DE CONTROLE","Já houve empenho (2014NE802275) e a data prevista de entrega é até 01/01/15. "]
["45/2014",1909,"009792/2014","Serviços de confecção com fornecimento de 14.000 cintas elásticas para unir processos",110000,"PRÓ-REITORIA DE ASSUNTOS ADMINISTRATIVOS","PROAD/PROTOCOLO","DRA. IVANIR","Elaboração da minuta de edital."]
["46/2014",1629,"008000/2014","Aquisição de furadeira elétrica de 2 furos",110200,"SEÇÃO DE ARQUIVO E PROTOCOLO GERAL","SECAO DE ARQUIVO E PROTOCOLO GERAL","CLOG","(vazio)"]
["46/2014",200,"002707/2014","Aquisição de artigos de copa e cozinha",280100,"DEPARTAMENTO DE EPIDEMIOLOGIA E SAÚDE PÚBLICA","DEPARTAMENTO DE EPIDEMIOLOGIA E SAÚDE PÚBLICA","SPP","Verificando a possibilidade de atendimento juntamente com a demanda de 2015."]
["47/2014",201,"002706/2014","Aquisição de artigos de higiene e conservação",280100,"DEPARTAMENTO DE EPIDEMIOLOGIA E SAÚDE PÚBLICA","DEPARTAMENTO DE EPIDEMIOLOGIA E SAÚDE PÚBLICA","SPP","Verificando a possibilidade de atendimento juntamente com a demanda de 2015."]
["47/2014",1630,"008002/2014","Aquisição de impressora matricial Okidata",110200,"SEÇÃO DE ARQUIVO E PROTOCOLO GERAL","SECAO DE ARQUIVO E PROTOCOLO GERAL","NÚCLEO DE GOVERNANÇA DA TEC. DA INF. E COMUNICAÇÃO","Buscando informações."]
["47/2014","S/Nº","002096/2014","Alerta sobre preços praticados em pregões eletrônicos na UFRRJ",220000,"INSTITUTO DE BIOLOGIA","INSTITUTO DE BIOLOGIA","ARQUIVO","Arquivado após entendimento firmado entre a Pró-reitora de Assuntos Financeiros e a Direção do Instituto de Biologia sobre o cancelamento dos itens com preços praticados acima da média de mercado e devidos esclarecimentos dos técnicos do DMSA."]
["47/2014",1748,"009851/2014","Contratação de serviços (conserto/manutenção) de micrótomo microm hm450, RM 235609; Manutenção preventiva",260000,"INSTITUTO DE FLORESTAS","INSTITUTO DE FLORESTAS","SCD","Verificando a situação da carta de exclusividade, que não está válida."]
["50/2014",1440,"007185/2014","Pagamento de inscrição do servidor José Carlos no Congresso de Secretárops - CONSUB",240000,"INSTITUTO DE CIÊNCIAS HUMANAS E SOCIAIS","DEPARTAMENTO DE FILOSOFIA","ARQUIVO","Desarquivado pela CODEP para realizar o relatório anual de cursos  do Governo Federal e em breve será novamente arquivado.\nJá houve empenho (2014NE801510), mas o pagamento ainda não foi efetuado."]
["50/2014",232,"002699/2014","Aquisição de material de expediente",150000,"PRÓ-REITORIA DE EXTENSÃO","PRÓ-REITORIA DE EXTENSÃO","DIREÇÃO DMSA","Verificando a possibilidade de atendimento juntamente com a demanda de 2015."]
["50/2014",1720,"008155/2014","Aquisição de colchete de aço metálico nº 7 ace caixa com 72 unidades e outros",110200,"SEÇÃO DE ARQUIVO E PROTOCOLO GERAL","SEÇÃO DE ARQUIVO E PROTOCOLO GERAL","ALMOXARIFADO","Já houve empenho (2014NE802303), pagamento (2014OB809816) e foi entregue no Almoxarifado em 10/12/14."]
["50/2014",1961,"010485/2014","Aquisição de dois veículos pickpus",180000,"CTUR","CTUR","DMSA","Buscando informações."]
["52/2014",236,"002701/2014","Aquisição de café, açúcar, coador e adoçante",150000,"PRÓ-REITORIA DE EXTENSÃO","PRÓ-REITORIA DE EXTENSÃO","CLOG","Pregão nº 88/2014 finalizado em 03/11/14. Já houve empenho (2014NE802417, 2015NE800302) e pagamento (2015OB800319). O processo está disponível na Seção de Sistema de Registro de Preços para solicitar empenhos."]
["53/2014",1043,"006016/2014","Aquisição de cartuchos hp, toners e tintas (grupo 30.17A)",280000,"INSTITUTO DE VETERINÁRIA","DIRETORIA","DMSA","Buscando informações."]
["53/2014",233,"002704/2014","Aquisição de material de expediente (papel A4, carta, ofício, etc)",150000,"PRÓ-REITORIA DE EXTENSÃO","DEPARTAMENTO DE LOGÍSTICA E INFRAESTRUTURA","CPACS","Consolidar Pesquisas de Preços"]
["54/2014",1148,"006008/2014","Aquisição de material hidráulico (grupo 30.24)",280000,"INSTITUTO DE VETERINÁRIA","DIRETORIA","ASTEC","Elaboração da minuta de edital."]
["54/2014",231,"002707/2014","Aquisição de artigos de copa e cozinha",150000,"PRÓ-REITORIA DE EXTENSÃO","PRÓ-REITORIA DE EXTENSÃO","SPP","Verificando a possibilidade de atendimento juntamente com a demanda de 2015."]
["55/2014",234,"002706/2014","Aquisição de artigos de higiene e conservação",150000,"PRÓ-REITORIA DE EXTENSÃO","PRÓ-REITORIA DE EXTENSÃO","SPP","Verificando a possibilidade de atendimento juntamente com a demanda de 2015."]
["56/2014",139,"006056/2014","Aquisição de material de artes gráficas, desenho e expediente (grupos 30.16 e 30.16B)",160114,"PROAP - CIÊNCIAS VETERINÁRIAS","CURSO DE PÓS-GRADUAÇÃO EM CIÊNCIAS VETERINÁRIAS","SSRP","Verificando a possibilidade de atendimento juntamente com a demanda de 2015."]
["61/2014",115,"003178/2014","Aquisição de medicamentos de uso humano",100070,"POSTO MÉDICO","POSTO MÉDICO","ANEXADO    23083.002702/2014-64","Elaboração da minuta de edital (anexado ao 002702/2014)."]
["63/2014",129,"002701/2014","Aquisição de café, açúcar, coador e adoçante",230300,"DEPARTAMENTO DE QUÍMICA","DEPARTAMENTO DE QUÍMICA","CLOG","Pregão nº 88/2014 finalizado em 03/11/14. Já houve empenho (2014NE802417, 2015NE800302) e pagamento (2015OB800319). O processo está disponível na Seção de Sistema de Registro de Preços para solicitar empenhos."]
["65/2014",297,"002701/2014","Aquisição de café, açúcar, coador e adoçante",100000,"REITORIA","REITORIA","CLOG","Pregão nº 88/2014 finalizado em 03/11/14. Já houve empenho (2014NE802417, 2015NE800302) e pagamento (2015OB800319). O processo está disponível na Seção de Sistema de Registro de Preços para solicitar empenhos."]
["65/2014","S/Nº","001761/2014","Aquisição de béquer, material vidro, graduação graduado capacidade 50, formato forma baixa, adicional com orla e bico e outros",230000,"INSTITUTO DE CIÊNCIAS EXATAS","INSTITUTO DE CIÊNCIAS EXATAS","DIREÇÃO DMSA","Buscando informações."]
["66/2014",457,"005867/2014","Aquisição de aparelhos e utensílios domésticos (grupo 52.12)",150000,"PRÓ-REITORIA DE EXTENSÃO","DEPARTAMENTO DE LOGÍSTICA E INFRAESTRUTURA","SPP","Realizando ajustes após emissão de parecer jurídico."]
["66/2014",295,"002706/2014","Aquisição de artigos de higiene e conservação",100000,"REITORIA","SECRETARIA DA REITORIA","SPP","Verificando a possibilidade de atendimento juntamente com a demanda de 2015."]
["66/2014",128,"002706/2014","Aquisição de artigos de higiene e conservação",230300,"DEPARTAMENTO DE QUÍMICA","DEPARTAMENTO DE QUÍMICA","SPP","Verificando a possibilidade de atendimento juntamente com a demanda de 2015."]
["67/2014",294,"002704/2014","Aquisição de material de expediente (papel A4, carta, ofício, etc)",100000,"REITORIA","SECRETARIA DA REITORIA","CPACS","Consolidar Pesquisas de Preços"]
["67/2014",127,"002707/2014","Aquisição de artigos de copa e cozinha",230000,"INSTITUTO DE CIÊNCIAS EXATAS","INSTITUTO DE CIÊNCIAS EXATAS","SPP","Verificando a possibilidade de atendimento juntamente com a demanda de 2015."]
["68/2014",16,"002702/2014","Aquisição de medicamentos de uso humano",230300,"DEPARTAMENTO DE QUÍMICA","DEPARTAMENTO DE QUÍMICA","ASTEC","Pregão n° 28/2015. houve manifestação de interesse no pregão. Elaborando Edital com as informações e quantitativo dos Órgãos participantes"]
["68/2014",389,"002699/2014","Aquisição de material de expediente",100000,"REITORIA","REITORIA","DIREÇÃO DMSA","Verificando a possibilidade de atendimento juntamente com a demanda de 2015."]
["69/2014",293,"002707/2014","Aquisição de artigos de copa e cozinha",100000,"REITORIA","REITORIA","SPP","Verificando a possibilidade de atendimento juntamente com a demanda de 2015."]
["69/2014",409,"002700/2014","Aquisição de gás liquefeito de petróleo",100070,"POSTO MÉDICO","POSTO MÉDICO","DIREÇÃO DMSA","Pregão nº 138/2014 finalizado em 14/11/14. O processo está disponível na Seção de Sistema de Registro de Preços para solicitar empenhos."]
["69/2014",409,"003153/2014","Aquisição de gás medicinal",100070,"POSTO MÉDICO","POSTO MÉDICO","SEC. ADM. DO DEPTO DE CONTABILIDADE E FINANÇAS","Pregão nº 13/2015 (antigo nº 99/2014) finalizado em 22/01/15. Está na SSRP para realizar as cópias das atas e em breve um gestor será designado."]
["69/2014",125,"002699/2014","Aquisição de material de expediente",230300,"DEPARTAMENTO DE QUÍMICA","DEPARTAMENTO DE QUÍMICA","DIREÇÃO DMSA","Verificando a possibilidade de atendimento juntamente com a demanda de 2015."]
["69/2014",995,"004586/2014","Contratação de serviços de guardiania de piscinas para atuação do Parque Aquático",150000,"PRÓ-REITORIA DE EXTENSÃO","PRAÇA DE DESPORTOS","SPP","Pesquisa de preço."]
["70/2014",398,"002701/2014","Aquisição de café, açúcar, coador e adoçante",100070,"POSTO MÉDICO","POSTO MÉDICO","CLOG","Pregão nº 88/2014 finalizado em 03/11/14. Já houve empenho (2014NE802417, 2015NE800302) e pagamento (2015OB800319). O processo está disponível na Seção de Sistema de Registro de Preços para solicitar empenhos."]
["70/2014","S/Nº","002701/2014","Aquisição de café, açúcar, coador e adoçante",160010,"EDITORA UNIVERSIDADE RURAL","EDITORA UNIVERSIDADE RURAL","CLOG","Pregão nº 88/2014 finalizado em 03/11/14. Já houve empenho (2014NE802417, 2015NE800302) e pagamento (2015OB800319). O processo está disponível na Seção de Sistema de Registro de Preços para solicitar empenhos."]
["70/2014",1462,"003666/2014","Aquisição de cartuchos de tinta",220500,"DEPARTAMENTO DE GENÉTICA","DEPARTAMENTO DE GENÉTICA","SPP","Pesquisa de preço."]
["71/2014",124,"002704/2014","Aquisição de material de expediente (papel A4, carta, ofício, etc)",230300,"DEPARTAMENTO DE QUÍMICA","DEPARTAMENTO DE QUÍMICA","CPACS","Consolidar Pesquisas de Preços"]
["71/2014",399,"002699/2014","Aquisição de material de expediente",100070,"POSTO MÉDICO","POSTO MÉDICO","DIREÇÃO DMSA","Verificando a possibilidade de atendimento juntamente com a demanda de 2015."]
["72/2014",400,"002704/2014","Aquisição de material de expediente (papel A4, carta, ofício, etc)",100070,"POSTO MÉDICO","DIVISÃO DE SAÚDE","CPACS","Consolidar Pesquisas de Preços"]
["72/2014","S/Nº","006046/2014","Aquisição de itens do grupo 30.11 - Material químico (demais setores)",280100,"DEPARTAMENTO DE EPIDEMIOLOGIA E SAÚDE PÚBLICA","DEPARTAMENTO DE EPIDEMIOLOGIA E SAÚDE PÚBLICA","CADMIN","Buscando informações."]
["73/2014",934,"005807/2014","Aquisição de itens do grupo 30.36 - Artigos cirúrgicos e de enfermaria",280100,"DEPARTAMENTO DE EPIDEMIOLOGIA E SAÚDE PÚBLICA","DEPARTAMENTO DE EPIDEMIOLOGIA E SAÚDE PÚBLICA","PREGÃO","Aguardando manifestação de interesse (IRP) de outros órgãos para realizar o pregão. Pregão nº 12/2015."]
["73/2014",401,"002707/2014","Aquisição de artigos de copa e cozinha",100070,"POSTO MÉDICO","POSTO MÉDICO","SPP","Verificando a possibilidade de atendimento juntamente com a demanda de 2015."]
["74/2014",402,"002706/2014","Aquisição de artigos de higiene e conservação",100070,"POSTO MÉDICO","DIVISÃO DE SAÚDE","SPP","Verificando a possibilidade de atendimento juntamente com a demanda de 2015."]
["74/2014",279,"002699/2014","Aquisição de material de expediente",140132,"MEDICINA VETERINÁRIA","MEDICINA VETERINÁRIA","DIREÇÃO DMSA","Verificando a possibilidade de atendimento juntamente com a demanda de 2015."]
["74/2014",1803,"009585/2014","Instalação e fornecimento porta de madeira almofadada de madeira maciça, etc. no térreo do prédio principal do IV",280000,"INSTITUTO DE VETERINÁRIA","INSTITUTO DE VETERINÁRIA","DIREÇÃO DMSA","Buscando informações."]
["75/2014",280,"002704/2014","Aquisição de material de expediente (papel A4, carta, ofício, etc)",140132,"MEDICINA VETERINÁRIA","MEDICINA VETERINÁRIA","CPACS","Consolidar Pesquisas de Preços"]
["75/2014","S/Nº","004448/2014","Aquisição de 15 baterias de rádio de comunicação portátil da marca Motorola",100060,"DIVISÃO DE GUARDA E VIGILÂNCIA","DIVISÃO DE GUARDA E VIGILÂNCIA","ARQUIVO","Buscando informações."]
["75/2014",1804,"009586/2014","Restauração com substituição de peças de janelas de esquadria de madeira ,etc",280000,"INSTITUTO DE VETERINÁRIA","INSTITUTO DE VETERINÁRIA","SPP","Pesquisa de preço."]
["79/2014",404,"005867/2014","Aquisição de aparelhos e utensílios domésticos (grupo 52.12)",100070,"POSTO MÉDICO","DIVISÃO DE SAÚDE","SPP","Realizando ajustes após emissão de parecer jurídico."]
["79/2014",411,"006018/2014","Aquisição de equipamentos para laboratório (grupo 52.08)",230300,"DEPARTAMENTO DE QUÍMICA","DEPARTAMENTO DE QUÍMICA","DIREÇÃO DMSA","Buscando informações."]
["79/2014",1778,"009588/2014","Conserto de carteiras montadas em longarinas de 03 lugares",280000,"INSTITUTO DE VETERINÁRIA","INSTITUTO DE VETERINÁRIA","SPP","Pesquisa de preço."]
["80/2014",413,"006022/2014","Aquisição de equipamentos eletro-eletrônicos (grupo 52.33)",230300,"DEPARTAMENTO DE QUÍMICA","DEPARTAMENTO DE QUÍMICA","SPP","Pesquisa de preço."]
["80/2014",405,"004521/2014","Aquisição de eletrocardiógrafo ECG, digital de 12 canais",100070,"POSTO MÉDICO","DIVISÃO DE SAÚDE","ARQUIVO","Arquivado porque já houve a compra do equipamento."]
["80/2014","S/Nº","008931/2014","Licitação para obra de reforma do prédio da cantina do IV",120000,"PRÓ-REITORIA DE ASSUNTOS FINANCEIROS","PRÓ-REITORIA DE ASSUNTOS FINANCEIROS","PREFEITURA UNIVERSITÁRIA","Houve empenho (2015NE800190) e está em fase de assinatura do contrato para início da prestação dos serviços."]
["80/2014",1375,"003666/2014","Aquisição de cartuchos de tinta",230300,"DEPARTAMENTO DE QUÍMICA","DEPARTAMENTO DE QUÍMICA","SPP","Pesquisa de preço."]
["81/2014",407,"006022/2014","Aquisição de equipamentos eletro-eletrônicos (grupo 52.33)",100070,"POSTO MÉDICO","DIVISÃO DE SAÚDE","SPP","Pesquisa de preço."]
["81/2014",410,"005867/2014","Aquisição de aparelhos e utensílios domésticos (grupo 52.12)",230300,"DEPARTAMENTO DE QUÍMICA","DEPARTAMENTO DE QUÍMICA","SPP","Realizando ajustes após emissão de parecer jurídico."]
["81/2014","S/Nº","008932/2014","Licitação para obra de reforma da cantina do Pavilhão Central",120000,"PRÓ-REITORIA DE ASSUNTOS FINANCEIROS","SETOR DE PONTOS COMERCIAIS","SEC. ADM. DO DEPTO DE CONTABILIDADE E FINANÇAS","Elaboração da minuta de edital."]
["82/2014",459,"005867/2014","Aquisição de aparelhos e utensílios domésticos (grupo 52.12)",100000,"REITORIA","SECRETARIA DOS ÓRGÃOS COLEGIADOS","SPP","Realizando ajustes após emissão de parecer jurídico."]
["84/2014",461,"006022/2014","Aquisição de equipamentos eletro-eletrônicos (grupo 52.33)",100000,"REITORIA","SECRETARIA DOS ÓRGÃOS COLEGIADOS","SPP","Pesquisa de preço."]
["(vazio)","(vazio)","(vazio)",null,"(vazio)",null,"(vazio)","(vazio)","(vazio)"]
["145/2014",1419,"006679/2014","Pagamento de inscrição das servidoras Kate Hellen e Ana Carolina no 8º Congresso de Secretários das Universidades Brasileiras",150000,"PRÓ-REITORIA DE EXTENSÃO","PRÓ-REITORIA DE EXTENSÃO","ARQUIVO","Desarquivado pela CODEP para realizar o relatório anual de cursos  do Governo Federal e em breve será novamente arquivado.\nArquivado porque  houve empenho (2014NE801506) e pagamento (2014GR800127)."]
["01/2014",78,"006056/2014","Aquisição de material de artes gráficas, desenho e expediente (grupos 30.16 e 30.16B)",160112,"PROAP - ZOOTECNIA","PROGRAMA DE PÓS-GRADUAÇÃO EM ZOOTECNIA","SSRP","Verificando a possibilidade de atendimento juntamente com a demanda de 2015."]
["01/2014",139,"006056/2014","Aquisição de material de artes gráficas, desenho e expediente (grupos 30.16 e 30.16B)",160117,"PROAP - MULTICÊNTRICO EM CIÊNCIAS FISIOLÓGICAS","INSTITUTO DE BIOLOGIA","SSRP","Verificando a possibilidade de atendimento juntamente com a demanda de 2015."]
["01/2014",305,"006020/2014","Aquisição de gerador de energia (grupo 52.39)",220300,"DEPARTAMENTO DE CIÊNCIAS FISIOLÓGICAS","DEPARTAMENTO DE CIÊNCIAS FISIOLÓGICAS","DEPARTAMENTO DE CIÊNCIAS FISIOLÓGICAS","Buscando informações."]
["01/2014",324,"006056/2014","Aquisição de material de artes gráficas, desenho e expediente (grupos 30.16 e 30.16B)",160119,"PROAP - PSICOLOGIA","PROGRAMA DE PÓS-GRADUAÇÃO EM PSICOLOGIA","SSRP","Verificando a possibilidade de atendimento juntamente com a demanda de 2015."]
["01/2014",909,"005867/2014","Aquisição de aparelhos e utensílios domésticos (grupo 52.12)",140113,"DIREITO","COORDENAÇÃO DE DIREITO - ICHS","SPP","Realizando ajustes após emissão de parecer jurídico."]
["01/2014",917,"006022/2014","Aquisição de equipamentos eletro-eletrônicos (grupo 52.33)",150000,"PRÓ-REITORIA DE EXTENSÃO","DEPARTAMENTO DE LOGÍSTICA E INFRAESTRUTURA","SPP","Pesquisa de preço."]
["01/2014",949,"005867/2014","Aquisição de aparelhos e utensílios domésticos (grupo 52.12)",120100,"DEPARTAMENTO DE CONTABILIDADE E FINANÇAS","DEPARTAMENTO DE CONTABILIDADE E FINANÇAS","SPP","Realizando ajustes após emissão de parecer jurídico."]
["01/2014",1062,"006045/2014","Aquisição de material de construção (grupo 30.24A)",130000,"PRÓ-REITORIA DE ASSUNTOS ESTUDANTIS","SETOR DE RESIDÊNCIA ESTUDANTIL","PREGÃO","Pregão 30/2015 agendado para abertura 27/03/2015."]
["01/2014",1118,"006016/2014","Aquisição de cartuchos hp, toners e tintas (grupo 30.17A)",230100,"DEPARTAMENTO DE FÍSICA","ICE - DEFÍS","DMSA","Buscando informações."]
["01/2014",362,"002704/2014","Aquisição de material de expediente (papel A4, carta, ofício, etc)",100200,"IMPRENSA UNIVERSITÁRIA","IMPRENSA UNIVERSITÁRIA","CPACS","Consolidar Pesquisas de Preços"]
["01/2014",261,"002704/2014","Aquisição de material de expediente (papel A4, carta, ofício, etc)",100600,"COORDENADORIA DE PLANEJAMENTO","COORDENADORIA DE PLANEJAMENTO","CPACS","Consolidar Pesquisas de Preços"]
["01/2014",483,"002704/2014","Aquisição de material de expediente (papel A4, carta, ofício, etc)",400000,"CAMPUS DA UFRRJ EM TRÊS RIOS","CAMPUS DA UFRRJ EM TRÊS RIOS","CPACS","Consolidar Pesquisas de Preços"]
["01/2014",150,"002706/2014","Aquisição de artigos de higiene e conservação",250000,"INSTITUTO DE EDUCAÇÃO","DIREÇÃO","SPP","Verificando a possibilidade de atendimento juntamente com a demanda de 2015."]
["01/2014",34,"001799/2014","Aquisição de material de limpeza para o Restaurante Universitário",130100,"RESTAURANTE UNIVERSITÁRIO - CAMPUS SEROPÉDICA","RESTAURANTE UNIVERSITÁRIO - CAMPUS SEROPÉDICA","ASTEC","Pregão nº 11/2015 (antigo nº 115/2014) com provável abertura em 10/02/15."]
["01/2014",962,"006591/2014","Aquisição de KIT Nefa (ácidos graxos não estereficados)",160107,"PROAP - MEDICINA VETERINÁRIA","PROGRAMA DE PÓS-GRADUAÇÃO EM MEDICINA VETERINÁRIA","CLOG","Realizando ajustes após emissão de parecer jurídico."]
["01/2014",962,"006590/2014","Aquisição do grupo 30.11 - Material químico (solventes, ácidos, etc)",160107,"PROAP - MEDICINA VETERINÁRIA","PROAP - MEDICINA VETERINÁRIA","DIREÇÃO DMSA","A Direção está verificando a possibilidade de atendimento juntamente com a demanda de 2015."]
["01/2014",1073,"005136/2014","Conserto da ordenhadeira mecânica",100500,"COORDENADORIA DE DESENVOLVIMENTO DA PRODUÇÃO","COORDENADORIA DE PRODUÇÃO ANIMAL","COORDENADORIA ESPECIAL DE PRODUÇÃO INTEGRADA ENSINO, PESQUISA E  EXTENSÃO","Buscando informações."]
["01/2014",868,"006333/2014","Aquisição de cartuchos HP (grupo 30.17)",250020,"LICENCIATURA EM EDUCAÇÃO DO CAMPO - PROCAMPO","CURSO DE LICENCIATURA EM EDUCAÇÃO DO CAMPO","INSTITUTO DE EDUCAÇÃO","Já houve empenho (2014NE802494) e  foi entregue no Almoxarifado em 16/12/14."]
["01/2014",1064,"006333/2014","Aquisição de cartuchos HP (grupo 30.17)",160106,"PROAP - FITOTECNIA","PROGRAMA DE PÓS-GRADUAÇÃO EM FITOTECNIA","INSTITUTO DE EDUCAÇÃO","Já houve empenho (2014NE802494) e  foi entregue no Almoxarifado em 16/12/14."]
["01/2014",1360,"006466/2014","Contratação de empresa especializada para proceder a lavagem de 8 (oito) reservatórios d'água",300000,"CAMPUS DA UFRRJ EM NOVA IGUAÇU","SUPERINTENDÊNCIA DO CAMPUS NOVA IGUAÇU","SCD","Foram solicitadas visita ténica e propostas às empresas, mas apenas duas fizeram a vistoria, mesmo tendo marcado duas datas. Somente uma enviou a proposta, porém está com o INSS vencido. Estamos tentando obter a outra proposta ou a regularização da situação no SICAF."]
["01/2014",1487,"007553/2014","Aquisição de materiais de consumo para o Restaurante Universitário",130100,"RESTAURANTE UNIVERSITÁRIO - CAMPUS SEROPÉDICA","RESTAURANTE UNIVERSITÁRIO - CAMPUS SEROPÉDICA","PROAES","Já houve empenho (2014NE802129), mas o prazo de entrega está vencido e um ofício de cobrança foi emitido à empresa em 08/12/14."]
["01/2014",1485,"007549/2014","Aquisição de cadeiras ergométricas",120000,"PRÓ-REITORIA DE ASSUNTOS FINANCEIROS","SECRETARIA DA PRÓ-REITORIA DE ASSUNTOS FINANCEIROS","CLOG","Já houve empenho (2014NE802194) e a data prevista de entrega é até 23/12/14."]
["01/2014",1274,"005786/2014","Aquisição de frascos de PET, válvulas, frascos de vidro (embalagens para produção de xaropes, doces e geléias)",150600,"PROEXT - APOIO À PRÁTICAS TRADICIONAIS NO USO DE PLANTAS MEDICINAIS","Projeto PROEXT-MEC 2014 \"APOIO ÀS PRÁTICAS TRADICIONAIS...\"","SPP","Elaboração da minuta de edital."]
["01/2014",35,"001161/2014","Serviço de editoração eletrônica e impressão dos volumes 22",100000,"REITORIA","DIRETORIA DO INSTITUTO DE FLORESTA","SPP","Pregão nº 58/2014 finalizado em 25/09/14. O processo está disponível no Instituto de Florestas para solicitar empenhos."]
["01/2014",100,"001811/2014","Contratação de empresa brasileira de comunicação EBC, para publicação de atos administrativos realizados pelo DMSA",120200,"DEPARTAMENTO DE MATERIAL E SERVIÇOS AUXILIARES","COORDENAÇÃO DE PLANEJAMENTO E ACOMPANHAMENTO DE COMPRAS","SPP","O empenho foi emitido (2014NE800993) e a empresa está prestando o serviço."]
["01/2014",1644,"008025/2014","Aquisição de livros",140530,"DOCÊNCIA NA EDUCAÇÃO INFANTIL","DOCÊNCIA NA EDUCAÇÃO INFANTIL","ANEXADO    23083.007599/2014-49","Atualizando a Pesquisa de Preços e atendendo recomendações do Parecer da PROGER (anexado ao 007599/2014)."]
["01/2014",266,"002892/2014","Aquisição de 14 mil garrafões de 20 litros de água mineral",100000,"REITORIA","ALMOXARIFADO CENTRAL","DIVISÃO DE ADMINISTRAÇÃO FINANCEIRA","Pregão nº 92/2014 finalizado em 25/11/14. Já houve empenho (2014NE802501, 2015NE800192, 2015NE800193, 2015NE800194, 2015NE800195, 2015NE800196) e pagamento (2015OB801330). "]
["01/2014",308,"003855/2014","Contratação de pessoa jurídica para prestação de serviços de postos de motorista",100300,"PREFEITURA UNIVERSITÁRIA","DIVISÃO DE SERVIÇOS GERAIS","DIREÇÃO DMSA","O processo será encaminhado ao requerente para adequação do pedido à Instrução Normativa nº 02/2008."]
["01/2014",284,"002700/2014","Aquisição de gás liquefeito de petróleo",260200,"DEPARTAMENTO DE PRODUTOS FLORESTAIS","DEPARTAMENTO DE PRODUTOS FLORESTAIS","DIREÇÃO DMSA","Pregão nº 138/2014 finalizado em 14/11/14. O processo está disponível na Seção de Sistema de Registro de Preços para solicitar empenhos."]
["01/2014",284,"003179/2014","Aquisição de gás medicinal",260200,"DEPARTAMENTO DE PRODUTOS FLORESTAIS","DEPARTAMENTO DE PRODUTOS FLORESTAIS","ANEXADO    23083.003153/2014-45","Pregão nº 13/2015 (antigo nº 99/2014) finalizado em 22/01/15. Está na SSRP para realizar as cópias das atas e em breve um gestor será designado (anexado ao 003153/2014)."]
["01/2014",387,"002700/2014","Aquisição de gás liquefeito de petróleo",170000,"CAIC","CAIC","DIREÇÃO DMSA","Pregão nº 138/2014 finalizado em 14/11/14. O processo está disponível na Seção de Sistema de Registro de Preços para solicitar empenhos."]
["01/2014",216,"002700/2014","Aquisição de gás liquefeito de petróleo",270400,"DEPARTAMENTO DE TECNOLOGIA DE ALIMENTOS","DEPARTAMENTO DE TECNOLOGIA DE ALIMENTOS","DIREÇÃO DMSA","Pregão nº 138/2014 finalizado em 14/11/14. O processo está disponível na Seção de Sistema de Registro de Preços para solicitar empenhos."]
["01/2014",105,"002700/2014","Aquisição de gás liquefeito de petróleo",280300,"DEPTO DE MICROBIOLOGIA E IMUNOLOGIA VETERINÁRIA","DEPTO DE MICROBIOLOGIA E IMUNOLOGIA VETERINÁRIA","DIREÇÃO DMSA","Pregão nº 138/2014 finalizado em 14/11/14. O processo está disponível na Seção de Sistema de Registro de Preços para solicitar empenhos."]
["01/2014",164,"002700/2014","Aquisição de gás liquefeito de petróleo",290000,"INSTITUTO DE ZOOTECNIA","INSTITUTO DE ZOOTECNIA","DIREÇÃO DMSA","Pregão nº 138/2014 finalizado em 14/11/14. O processo está disponível na Seção de Sistema de Registro de Preços para solicitar empenhos."]
["01/2014",443,"002700/2014","Aquisição de gás liquefeito de petróleo",600000,"INSTITUTO DE CIÊNCIAS SOCIAIS APLICADAS","INSTITUTO DE CIÊNCIAS SOCIAIS APLICADAS","DIREÇÃO DMSA","Pregão nº 138/2014 finalizado em 14/11/14. O processo está disponível na Seção de Sistema de Registro de Preços para solicitar empenhos."]
["01/2014",375,"002701/2014","Aquisição de café, açúcar, coador e adoçante",100100,"BIBLIOTECA CENTRAL","BIBLIOTECA CENTRAL","CLOG","Pregão nº 88/2014 finalizado em 03/11/14. Já houve empenho (2014NE802417, 2015NE800302) e pagamento (2015OB800319). O processo está disponível na Seção de Sistema de Registro de Preços para solicitar empenhos."]
["01/2014",347,"002701/2014","Aquisição de café, açúcar, coador e adoçante",100300,"PREFEITURA UNIVERSITÁRIA","PREFEITURA","CLOG","Pregão nº 88/2014 finalizado em 03/11/14. Já houve empenho (2014NE802417, 2015NE800302) e pagamento (2015OB800319). O processo está disponível na Seção de Sistema de Registro de Preços para solicitar empenhos."]
["01/2014",251,"002701/2014","Aquisição de café, açúcar, coador e adoçante",120400,"LAVANDERIA","LAVANDERIA","CLOG","Pregão nº 88/2014 finalizado em 03/11/14. Já houve empenho (2014NE802417, 2015NE800302) e pagamento (2015OB800319). O processo está disponível na Seção de Sistema de Registro de Preços para solicitar empenhos."]
["01/2014",352,"002701/2014","Aquisição de café, açúcar, coador e adoçante",130000,"PRÓ-REITORIA DE ASSUNTOS ESTUDANTIS","PRÓ-REITORIA DE ASSUNTOS ESTUDANTIS","CLOG","Pregão nº 88/2014 finalizado em 03/11/14. Já houve empenho (2014NE802417, 2015NE800302) e pagamento (2015OB800319). O processo está disponível na Seção de Sistema de Registro de Preços para solicitar empenhos."]
["01/2014",302,"002701/2014","Aquisição de café, açúcar, coador e adoçante",210000,"INSTITUTO DE AGRONOMIA","INSTITUTO DE AGRONOMIA","CLOG","Pregão nº 88/2014 finalizado em 03/11/14. Já houve empenho (2014NE802417, 2015NE800302) e pagamento (2015OB800319). O processo está disponível na Seção de Sistema de Registro de Preços para solicitar empenhos."]
["01/2014",333,"002701/2014","Aquisição de café, açúcar, coador e adoçante",210200,"DEPARTAMENTO DE GEOCIÊNCIAS","DEPARTAMENTO DE GEOCIÊNCIAS","CLOG","Pregão nº 88/2014 finalizado em 03/11/14. Já houve empenho (2014NE802417, 2015NE800302) e pagamento (2015OB800319). O processo está disponível na Seção de Sistema de Registro de Preços para solicitar empenhos."]
["01/2014",275,"002701/2014","Aquisição de café, açúcar, coador e adoçante",220000,"INSTITUTO DE BIOLOGIA","INSTITUTO DE BIOLOGIA","CLOG","Pregão nº 88/2014 finalizado em 03/11/14. Já houve empenho (2014NE802417, 2015NE800302) e pagamento (2015OB800319). O processo está disponível na Seção de Sistema de Registro de Preços para solicitar empenhos."]
["01/2014",183,"002701/2014","Aquisição de café, açúcar, coador e adoçante",230100,"DEPARTAMENTO DE FÍSICA","DEPARTAMENTO DE FÍSICA","CLOG","Pregão nº 88/2014 finalizado em 03/11/14. Já houve empenho (2014NE802417, 2015NE800302) e pagamento (2015OB800319). O processo está disponível na Seção de Sistema de Registro de Preços para solicitar empenhos."]
["01/2014",491,"002701/2014","Aquisição de café, açúcar, coador e adoçante",280010,"HOSPITAL VETERINÁRIO","HOSPITAL VETERINÁRIO","CLOG","Pregão nº 88/2014 finalizado em 03/11/14. Já houve empenho (2014NE802417, 2015NE800302) e pagamento (2015OB800319). O processo está disponível na Seção de Sistema de Registro de Preços para solicitar empenhos."]
["01/2014",195,"002701/2014","Aquisição de café, açúcar, coador e adoçante",280200,"DEPARTAMENTO DE MEDICINA E CIRURGIA VETERINÁRIA","DEPARTAMENTO DE MEDICINA E CIRURGIA VETERINÁRIA","CLOG","Pregão nº 88/2014 finalizado em 03/11/14. Já houve empenho (2014NE802417, 2015NE800302) e pagamento (2015OB800319). O processo está disponível na Seção de Sistema de Registro de Preços para solicitar empenhos."]
["01/2014",368,"002701/2014","Aquisição de café, açúcar, coador e adoçante",280400,"DEPARTAMENTO DE PARASITOLOGIA ANIMAL","DEPARTAMENTO DE PARASITOLOGIA ANIMAL","CLOG","Pregão nº 88/2014 finalizado em 03/11/14. Já houve empenho (2014NE802417, 2015NE800302) e pagamento (2015OB800319). O processo está disponível na Seção de Sistema de Registro de Preços para solicitar empenhos."]
["01/2014",228,"002699/2014","Aquisição de material de expediente",140000,"PRÓ-REITORIA DE ENSINO E GRADUAÇÃO","PRÓ-REITORIA DE ENSINO E GRADUAÇÃO","DIREÇÃO DMSA","Verificando a possibilidade de atendimento juntamente com a demanda de 2015."]
["01/2014",278,"002699/2014","Aquisição de material de expediente",140134,"PSICOLOGIA","PSICOLOGIA","DIREÇÃO DMSA","Verificando a possibilidade de atendimento juntamente com a demanda de 2015."]
["01/2014",120,"002699/2014","Aquisição de material de expediente",220100,"DEPARTAMENTO DE BIOLOGIA ANIMAL","DEPARTAMENTO DE BIOLOGIA ANIMAL","DIREÇÃO DMSA","Verificando a possibilidade de atendimento juntamente com a demanda de 2015."]
["01/2014",71,"002699/2014","Aquisição de material de expediente",220410,"LABORATÓRIO OFICIAL DE DIAGNÓSTICO FITOSSANITÁRIO","LABORATÓRIO OFICIAL DE DIAGNÓSTICO FITOSSANITÁRIO","DIREÇÃO DMSA","Verificando a possibilidade de atendimento juntamente com a demanda de 2015."]
["01/2014",319,"002699/2014","Aquisição de material de expediente",250020,"LICENCIATURA EM EDUCAÇÃO DO CAMPO - PROCAMPO","LICENCIATURA EM EDUCAÇÃO DO CAMPO - PROCAMPO","DIREÇÃO DMSA","Verificando a possibilidade de atendimento juntamente com a demanda de 2015."]
["01/2014",314,"002699/2014","Aquisição de material de expediente",260000,"INSTITUTO DE FLORESTAS","INSTITUTO DE FLORESTAS","DIREÇÃO DMSA","Verificando a possibilidade de atendimento juntamente com a demanda de 2015."]
["01/2014",175,"002699/2014","Aquisição de material de expediente",300000,"CAMPUS DA UFRRJ EM NOVA IGUAÇU","CAMPUS DA UFRRJ EM NOVA IGUAÇU","DIREÇÃO DMSA","Verificando a possibilidade de atendimento juntamente com a demanda de 2015."]
["01/2014",51,"002085/2014","Contratação de empresa para serviços de dedetização, desratização e descupinização",300001,"RESTAURANTE UNIVERSITÁRIO - NOVA IGUAÇU","RESTAURANTE UNIVERSITÁRIO - NOVA IGUAÇU","INSTITUTO MULTIDISCIPLINAR DE NOVA IGUAÇU","Pregão nº 69/2014 finalizado em 08/09/14. O processo está disponível no Restaurante Universitário do Campus de Nova Iguaçu para solicitar empenhos."]
["01/2014",61,"004380/2014","Aquisição de capela de exaustão",280000,"INSTITUTO DE VETERINÁRIA","DEPARTAMENTO DE PARASITOLOGIA ANIMAL","ARQUIVO","Já houve empenho (2014NE801379) e foi entregue no Almoxarifado em 17/09/14."]
["01/2014",1741,"008307/2014","Serviço de editoração e impressão de livros",140510,"CONSELHO ESCOLAR","CURSO DE EXTENSÃO CONSELHO ESCOLAR","SEC. ADM. DO DEPTO DE CONTABILIDADE E FINANÇAS","Realizando ajustes após emissão de parecer jurídico."]
["01/2014",1742,"008307/2014","Serviço de editoração e impressão de livros",140510,"CONSELHO ESCOLAR","CURSO DE EXTENSÃO CONSELHOS MUNICIPAIS DE EDUCAÇÃO","SEC. ADM. DO DEPTO DE CONTABILIDADE E FINANÇAS","Realizando ajustes após emissão de parecer jurídico."]
["01/2014","S/Nº","002701/2014","Aquisição de café, açúcar, coador e adoçante",240000,"INSTITUTO DE CIÊNCIAS HUMANAS E SOCIAIS","INSTITUTO DE CIÊNCIAS HUMANAS E SOCIAIS","CLOG","Pregão nº 88/2014 finalizado em 03/11/14. Já houve empenho (2014NE802417, 2015NE800302) e pagamento (2015OB800319). O processo está disponível na Seção de Sistema de Registro de Preços para solicitar empenhos."]
["01/2014","S/Nº","000313/2014","Contratação de empresa terceirizada para prestação de serviços de vigilância e segurança armada nas dependências do Campus Campos dos Goytacazes",190000,"CAMPUS DR. LEONEL MIRANDA","SERVIÇOS GERAIS - CAMPUS CAMPOS DOS GOYTACAZES","DIVISÃO DE ADMINISTRAÇÃO FINANCEIRA","Pregão nº 83/2014 finalizado em 04/12/14. Já houve empenho (2014NE802540, ) e pagamento (2015OB801274)"]
["01/2014","S/Nº","000373/2014","Aquisição de vacina contra leptospirose bovina, ovina, caprina e suína frasco de 50ml e outros",100500,"COORDENADORIA DE DESENVOLVIMENTO DA PRODUÇÃO","COORDENADORIA DE DESENVOLVIMENTO DA PRODUÇÃO","CLOG","Já houve empenho (2014NE800636), pagamentos (2014OB804756 e 2014DF801439) e foi entregue no Almoxarifado em 02/06/14."]
["01/2014","S/Nº","008556/2014","Reforma e adequação do Auditório do ITR",400000,"CAMPUS DA UFRRJ EM TRÊS RIOS","CAMPUS DA UFRRJ EM TRÊS RIOS","COORD. DE PROJETOS DE ENGENHARIA E ARQUITETURA","Buscando informações."]
["01/2014","S/Nº","004063/2014","Contratação de serviços para manutenção de veículos com reposição de peças e gerenciamento de serviços",400000,"CAMPUS DA UFRRJ EM TRÊS RIOS","CAMPUS DA UFRRJ EM TRÊS RIOS","DEPARTAMENTO DE CONTABILIDADE E FINANÇAS","(vazio)"]
["01/2014","S/Nº","000795/2014","Contratação emergencial de empresa prestadora de serviços continuados de limpeza, conservação e higienização para a UFRRJ",120000,"PRÓ-REITORIA DE ASSUNTOS FINANCEIROS","PRÓ-REITORIA DE ASSUNTOS FINANCEIROS","SEC. ADM. DO DECANATO DE ASSUNTOS FINANCEIROS","O processo está na PROAF e deverá seguir para arquivamento."]
["01/2014","S/Nº","003803/2014","Aquisição de materiais para manutenção de bens imóveis (IRP)",120200,"DEPARTAMENTO DE MATERIAL E SERVIÇOS AUXILIARES","DEPARTAMENTO DE MATERIAL E SERVIÇOS AUXILIARES","SEÇÃO DE CONTROLE","Vai ser encaminhado para o gestor da ata."]
["01/2014","S/Nº","004035/2014","Aquisição de cadeira escritório , material estrutura metálica, material revestimento assento e encosto tecido 100 e outros",270000,"INSTITUTO DE TECNOLOGIA","INSTITUTO DE TECNOLOGIA","INSTITUTO DE TECNOLOGIA","Buscando informações."]
["01/2014","S/Nº","002260/2014","Renovação pelo período de 12 (doze) meses da revista O Pregoeiro, com notícias, informções técnicas",120200,"DEPARTAMENTO DE MATERIAL E SERVIÇOS AUXILIARES","DEPARTAMENTO DE MATERIAL E SERVIÇOS AUXILIARES","SAPG","Buscando informações."]
["01/2014","S/Nº","002325/2014","Aquisição de empilhadeira florestal com tração 4x4, com motor de aproximadamente 80cv",260000,"INSTITUTO DE FLORESTAS","INSTITUTO DE FLORESTAS","CLOG","Pregão nº 26/2015 (antigo nº 109/2014) com provável abertura em 04/03/15."]
["01/2014","S/Nº","005472/2014","Confecção e instalação de seis grades de ferro nas janelas do Laboratório do DRRA/IZ",290000,"INSTITUTO DE ZOOTECNIA","INSTITUTO DE ZOOTECNIA","DIREÇÃO DMSA","Buscando informações."]
["01/2014","S/Nº","010614/2014","Contratação de empresa especializada no controle de cupins e outras pragas como: barata, traças, formigas, brocas, aranhas, mosquitos etc.",100000,"REITORIA","PROCURADORIA GERAL","ASTEC","Será atendido junto com a Demanda de 2015 - equipe do projeto"]
["01/2014",240,"002699/2014","Aquisição de material de expediente",140120,"ENGENHARIA FLORESTAL","ENGENHARIA FLORESTAL","DIREÇÃO DMSA","Verificando a possibilidade de atendimento juntamente com a demanda de 2015."]
["01/2014",424,"002699/2014","Aquisição de material de expediente",270000,"INSTITUTO DE TECNOLOGIA","INSTITUTO DE TECNOLOGIA","DIREÇÃO DMSA","Verificando a possibilidade de atendimento juntamente com a demanda de 2015."]
["01/2014",176,"002707/2014","Aquisição de artigos de copa e cozinha",300000,"CAMPUS DA UFRRJ EM NOVA IGUAÇU","CAMPUS DA UFRRJ EM NOVA IGUAÇU","SPP","Verificando a possibilidade de atendimento juntamente com a demanda de 2015."]
["01/2014",2,"000044/2014","Aquisição de pâo francês",130100,"RESTAURANTE UNIVERSITÁRIO - CAMPUS SEROPÉDICA","RESTAURANTE UNIVERSITÁRIO - CAMPUS SEROPÉDICA","RESTAURANTE UNIVERSITÁRIO DE SEROPÉDICA","Já houve empenho (2014NE800029) e pagamento (2014OB800840)."]
["01/2014",936,"006590/2014","Aquisição do grupo 30.11 - Material químico (solventes, ácidos, etc)",160105,"PROAP - ENGENHARIA QUÍMICA","PROAP - ENGENHARIA QUÍMICA","DIREÇÃO DMSA","A Direção está verificando a possibilidade de atendimento juntamente com a demanda de 2015."]
["01/2014",1238,"006590/2014","Aquisição do grupo 30.11 - Material químico (solventes, ácidos, etc)",160100,"PROAP - PRÓ-REITORIA DE PESQUISA E PÓS GRADUAÇÃO","DEPARTAMENTO DE ENGENHARIA","DIREÇÃO DMSA","A Direção está verificando a possibilidade de atendimento juntamente com a demanda de 2015."]
["01/2014",1800,"009046/2014","Aquisição de gás comprimido (nitrogênio líquido)",160110,"PROAP - QUÍMICA","PROGRAMA DE PÓS-GRADUAÇÃO EM QUÍMICA","DRA. IVANIR","Elaboração da minuta de edital."]
["01/2014",1103,"006266/2014","Aquisição de itens do grupo 30.17A - Acessórios de informática (cartuchos,etc)","(vazio)",null,"(vazio)","CPACS","Buscando informações."]
["01/2014",1072,"005055/2014","Aquisição de rádio comunicador etc",300000,"CAMPUS DA UFRRJ EM NOVA IGUAÇU","INSTITUTO DE ZOOTECNIA","ARQUIVO","Arquivado porque o material foi atendido através do processo 008200/2013."]
["01/2014",1056,"003666/2014","Aquisição de cartuchos de tinta",150400,"PROEXT - PROGRAMA APOIO E ACOMPANHAMENTO USO DE LAPTOPS ESCOLA POR ALUNO","PROEXT - PROGRAMA APOIO E ACOMPANHAMENTO NO USO DE LAPTOPS ESCOLA POR ALUNO ","SPP","Pesquisa de preço."]
["01/2014",230,"003653/2014","Aquisição de detergente líquido, etc",150090,"PROEXT - ESTRATÉGIA DESENVOLVIMENTO CADEIA PRODUTIVA COM ABELHAS","PROEXT - ESTRATÉGIA DESENVOLVIMENTO CADEIA PRODUTIVA COM ABELHAS","ARQUIVO","Arquivado porque os itens 3 e 4, constantes no REQMAT presentes às fls 02 do presente processo já foram solicitados através do Quiosque de Compras, conforme PEDMAT anexado às fls 26. Além disso, a aquisição dos itens 1 e 2 não será mais necessária visto que serão fornecidos pela Pró-Reitoria de Extensão e o Instituto de Zootecnia."]
["01/2014",1896,"009504/2014","Contratação de serviços de engenharia para elaboração de projeto básico e executivo de reforma das atuais dependências do Almoxarifado Central",120200,"DEPARTAMENTO DE MATERIAL E SERVIÇOS AUXILIARES","ALMOXARIFADO","ARQUIVO","O processo será cancelado e arquivado porque existe outro em tramitação."]
["01/2014",439,"003655/2014","Aquisição de caneta hidrográfica, etc - artes gráficas e desenho (grupo 30.16A)",150000,"PRÓ-REITORIA DE EXTENSÃO","PRÓ-REITORIA DE EXTNSÃO ","CPACS","Realizando re-enquadramento e em breve será encaminhado à Direção do DMSA e à PROAF para assinatura."]
["01/2014",1330,"006344/2014","Serviço de manutenção de equipamento de sistema de segurança do Almoxarifado Central",120200,"DEPARTAMENTO DE MATERIAL E SERVIÇOS AUXILIARES","ALMOXARIFADO CENTRAL","SEC. ADM. DO DEPTO DE CONTABILIDADE E FINANÇAS","Pregão nº 24/2015 (antigo nº 119/2014) com provável abertura em 09/03/15."]
["01/2014",281,"003663/2014","Aquisição de assadeira cozinha comercial, etc",150600,"PROEXT - APOIO À PRÁTICAS TRADICIONAIS NO USO DE PLANTAS MEDICINAIS","PRÓ-REITORIA DE EXTENSÃO","ARQUIVO","Arquivado porque o requerente solicitou o cancelamento do pedido constante no reqmat n°01 (fls. 01 a 07 do presente processo)."]
["01/2014",1102,"005198/2014","Contratação de empresa especializada na prestação de serviços de locação de 03 impressoras multifuncionais (carona)",100000,"REITORIA","COORDENAÇÃO DE CONTRATOS E IMPORTAÇÃO","ARQUIVO","Arquivado porque o processo (005691/2013) para locação de copiadoras teve tramitação mais célere do que esta carona e o respectivo pregão (nº 31/2015) foi aberto em 04/03/15."]
["08/2014",147,"002704/2014","Aquisição de material de expediente (papel A4, carta, ofício, etc)",260000,"INSTITUTO DE FLORESTAS","DIRETORIA","CPACS","Consolidar Pesquisas de Preços"]
["08/2014",393,"002706/2014","Aquisição de artigos de higiene e conservação",170000,"CAIC","CAIC","SPP","Verificando a possibilidade de atendimento juntamente com a demanda de 2015."]
["08/2014",171,"002706/2014","Aquisição de artigos de higiene e conservação",290000,"INSTITUTO DE ZOOTECNIA","GABINETE DA REITORIA","SPP","Verificando a possibilidade de atendimento juntamente com a demanda de 2015."]
["08/2014",441,"002706/2014","Aquisição de artigos de higiene e conservação",600000,"INSTITUTO DE CIÊNCIAS SOCIAIS APLICADAS","DIREÇÃO","SPP","Verificando a possibilidade de atendimento juntamente com a demanda de 2015."]
["08/2014",944,"004667/2014","Instalação de 26 pontos de rede RJ 45 - CAT6",240000,"INSTITUTO DE CIÊNCIAS HUMANAS E SOCIAIS","DIREÇÃO","SEÇÃO DE CONTROLE","O empenho foi emitido (2014NE802428) e transmitido à empresa. Está nas fases de liquidação e pagamento da despesa."]
["08/2014",1401,"006576/2014","Pagamento de inscrição do servidor Edmilson Rangel no evento PCASP - Entendendo o plano de contas plicado ao setor público",10310,"CAPACITAÇÃO DE SERVIDORES - RECURSOS ESPECÍFICOS","DEPARTAMENTO DE CONTABILIDADE E FINANÇAS","ARQUIVO","Desarquivado pela CODEP para realizar o relatório anual de cursos  do Governo Federal e em breve será novamente arquivado.\nArquivado porque  houve empenho (2014NE801904) e pagamento (2014OB807497)."]
["08/2014",448,"002658/2014","Aquisição de carnes",300001,"RESTAURANTE UNIVERSITÁRIO - NOVA IGUAÇU","RESTAURANTE UNIVERSITÁRIO - NOVA IGUAÇU","SSRP","Pregão nº 82/2014 finalizado em 21/11/14. Já houve empenho (2015NE800248, 2015NE800249, 2015NE800250, 2015NE800251, 2015NE800252, 2015NE800253). O processo está disponível no Restaurante Universitário do Instituto Multidisciplinar para solicitar empenhos."]
["08/2014",1396,"006577/2014","Pagamento de inscrição de servidores no 8º Congresso de secretários das universidades brasileiras - CONSUB",110000,"PRÓ-REITORIA DE ASSUNTOS ADMINISTRATIVOS","COORDENAÇÃO DE DESENVOLVIMENTO DE PESSOAS","CODEP","Já houve empenho (2014NE801521), mas o pagamento ainda não foi efetuado."]
["08/2014",958,"005725/2014","Aquisição de lâmpadas (grupo 30.29)",280000,"INSTITUTO DE VETERINÁRIA","DEPARTAMENTO DE MICROBIOLOGIA E IMUNOLOGIA VETERINÁRIA","CLOG","Já houve empenho (2014NE801699 e 2014NE801698) e  foi entregue no Almoxarifado em 04/11/14 e 05/11/14."]
["08/2014",1508,"007802/2014","Contratação de serviços de palestra motivacional do dia do servidor",10310,"CAPACITAÇÃO DE SERVIDORES - RECURSOS ESPECÍFICOS","COORDENAÇÃO DE DESENVOLVIMENTO DE PESSOAS","COORD. DE DESENSOLVIMENTO DE PESSOA","Desarquivado pela CODEP para realizar o relatório anual de cursos  do Governo Federal e em breve será novamente arquivado.\nHouve empenho (2014NE801969) e pagamento (2014OB809249)."]
["08/2014",956,"005807/2014","Aquisição de itens do grupo 30.36 - Artigos cirúrgicos e de enfermaria",220410,"LABORATÓRIO OFICIAL DE DIAGNÓSTICO FITOSSANITÁRIO","LABORATÓRIO OFICIAL DE DIAGNÓSTICO FITOSSANITÁRIO","PREGÃO","Aguardando manifestação de interesse (IRP) de outros órgãos para realizar o pregão. Pregão nº 12/2015."]
["08/2014",418,"002372/2014","Aquisição de cartuchos",120200,"DEPARTAMENTO DE MATERIAL E SERVIÇOS AUXILIARES","DEPARTAMENTO DE MATERIAL E SERVICOS AUXILIARES","CLOG","Já houve empenho (2014NE800742, 2014NE800743, 2014NE800744, 2014NE800741) e pagamento (2014OB804858, 2014OB804667, 2014OB804951)."]
["08/2014",377,"002394/2014","Aquisição de gêneros alimentícios",180000,"CTUR","CTUR","DIVISÃO DE ADMINISTRAÇÃO FINANCEIRA","Pregão nº 81/2014 finalizado em 25/11/14. O processo está disponível no Colégio Técnico da UFRRJ para solicitar empenhos."]
["08/2014",1730,"008306/2014","Aquisição de seis rádios radio transceptores",500030,"PROGRAMA INGLÊS SEM FRONTEIRAS","INGLÊS SEM FRONTEIRAS","CLOG","Já houve empenho (2014NE802333) e a data prevista de entrega é até 31/12/14. "]
["08/2014",1282,"006503/2014","Aquisição de FTIR para análise de sólidos",160001,"PRÓ - EQUIPAMENTOS","PROPPG","CLOG","Já houve empenho (2014NE802207), mas faltam informações sobre a entrega."]
["08/2014",428,"002407/2014","Contratação de serviço especializado em processamento técnico e físico de material bibliográfico",100100,"BIBLIOTECA CENTRAL","BIBLIOTECA CENTRAL","SPP","Foi reenquadrado de SRP para tradional e em função disso terá que refazer a minuta de edital."]
["08/2014",1034,"004907/2014","Aquisição de caminhonete para trabalho rural com motor a diesel",280010,"HOSPITAL VETERINÁRIO","HOSPITAL VETERINÁRIO","ALMOXARIFADO","Já houve empenho (2014NE801998, 2014NE801999, 2014NE802192), pagamentos (2015OB800232 , 2015OB800413 e 2015DF800135, 2015DF800207) e foi entregue no Almoxarifado em 19/12/14."]
["08/2014","S/Nº","010531/2014","Aquisição de seis rádios transceptores (carona)",500030,"PROGRAMA INGLÊS SEM FRONTEIRAS","COORDENAÇÃO DO INGLÊS SEM FRONTEIRAS","SEÇÃO DE CONTROLE","Já houve empenho (2014NE802274) e a data prevista de entrega é até 02/03/15."]
["08/2014",178,"002707/2014","Aquisição de artigos de copa e cozinha",220300,"DEPARTAMENTO DE CIÊNCIAS FISIOLÓGICAS","DEPARTAMENTO DE CIÊNCIAS FISIOLÓGICAS","SPP","Verificando a possibilidade de atendimento juntamente com a demanda de 2015."]
["08/2014",1848,"009266/2014","Aquisição de feno de gramineas cost cross ou tifton 85",100500,"COORDENADORIA DE DESENVOLVIMENTO DA PRODUÇÃO","COORDENADORIA DE DESENVOLVIMENTO DA PRODUÇÃO","SEÇÃO DE CONTROLE","Já houve empenho (2014NE802106), pagamento (2015OB800187) e foi entregue no Almoxarifado em 23/12/14.\nJá houve empenho (2014NE802086), pagamentos (2015OB800187 e 2015DF800040) e foi entregue no Almoxarifado em 11/12/14."]
["08/2014",977,"005738/2014","Aquisição de quadro geral 3f + n+ t 600a acompanha kit",270000,"INSTITUTO DE TECNOLOGIA","INSTITUTO DE TECNOLOGIA","ARQUIVO","Arquivado porque o material foi comprado através do cartão corporativo."]
["08/2014",1735,"003666/2014","Aquisição de cartuchos de tinta",140000,"PRÓ-REITORIA DE ENSINO E GRADUAÇÃO","DRA, NAP II, MONITORIA","SPP","Pesquisa de preço."]
["08/2014",1422,"003666/2014","Aquisição de cartuchos de tinta",210000,"INSTITUTO DE AGRONOMIA","DIRETORIA","SPP","Pesquisa de preço."]
["08/2014",763,"003139/2014","Aquisição de milho",100500,"COORDENADORIA DE DESENVOLVIMENTO DA PRODUÇÃO","COORDENADORIA ESPECIAL DE PROD. INTEGRADA ENSINO, PESQ. EXT.","ARQUIVO","Arquivado porque o material foi atendido através do processo 005817/2012."]
["06/2014",262,"006018/2014","Aquisição de equipamentos para laboratório (grupo 52.08)",280300,"DEPTO DE MICROBIOLOGIA E IMUNOLOGIA VETERINÁRIA","DEPARTAMENTO DE MICROBIOLOGIA E IMUNOLOGIA VETERINÁRIA","DIREÇÃO DMSA","Buscando informações."]
["06/2014",415,"005867/2014","Aquisição de aparelhos e utensílios domésticos (grupo 52.12)",300000,"CAMPUS DA UFRRJ EM NOVA IGUAÇU","SUPERINTENDÊNCIA DO CAMPUS","SPP","Realizando ajustes após emissão de parecer jurídico."]
["06/2014",1117,"006016/2014","Aquisição de cartuchos hp, toners e tintas (grupo 30.17A)",280400,"DEPARTAMENTO DE PARASITOLOGIA ANIMAL","DEPARTAMENTO DE PARASITOLOGIA ANIMAL","DMSA","Buscando informações."]
["06/2014",391,"002704/2014","Aquisição de material de expediente (papel A4, carta, ofício, etc)",170000,"CAIC","CAIC","CPACS","Consolidar Pesquisas de Preços"]
["06/2014",492,"002706/2014","Aquisição de artigos de higiene e conservação",280010,"HOSPITAL VETERINÁRIO","HOSPITAL VETERINÁRIO","SPP","Verificando a possibilidade de atendimento juntamente com a demanda de 2015."]
["06/2014",301,"004522/2014","Aquisição de torrador, descascador e moinho para café (grupo 52.28)",210000,"INSTITUTO DE AGRONOMIA","DIREÇÃO","SEÇÃO DE CONTROLE","Pregão nº 118/2014 finalizado em 18/11/14. Já houve empenho do descascador (2014NE802456) e a data prevista de entrega é até 06/01/15. Já houve empenho do torrador e do moinho para café (2014NE802454) e a data prevista de entrega é até 16/01/15."]
["06/2014",1336,"006279/2014","Aquisição de Steponeplus Real-time PCR System",160001,"PRÓ - EQUIPAMENTOS","PROPPG","CLOG","Realizando ajustes após emissão de parecer jurídico."]
["06/2014",1519,"002971/2014","Aquisição de protetor contra surto e tensão",100300,"PREFEITURA UNIVERSITÁRIA","DIVISÃO DE SERVIÇOS GERAIS","DIREÇÃO DMSA","Realizando nova cotação eletrônica para tentar negociar com base no preço de referência."]
["06/2014",1183,"005735/2014","Aquisição de equipamentos industriais - banho Maria, moinho, máquina de costura, fogão, liquidificador e seladora (grupo 52.28)",150000,"PRÓ-REITORIA DE EXTENSÃO","PRÓ-REITORIA DE EXTENSÃO","ASSESSORIA TECNICA/DMSA","Pesquisa de preço."]
["06/2014",1199,"005473/2014","Instalação de 5 suportes para projetores",140000,"PRÓ-REITORIA DE ENSINO E GRADUAÇÃO","COORDENAÇÃO DO CURSO DE MATEMÁTICA - CAMPUS SEROPÉDICA","ANEXADO    23083.005324/2014-71","Elaboração da minuta de edital (anexado ao 005324/2014)."]
["06/2014",1273,"005786/2014","Aquisição de frascos de PET, válvulas, frascos de vidro (embalagens para produção de xaropes, doces e geléias)",150600,"PROEXT - APOIO À PRÁTICAS TRADICIONAIS NO USO DE PLANTAS MEDICINAIS","Projeto PROEXT-MEC 2014 \"APOIO ÀS PRÁTICAS TRADICIONAIS...\"","SPP","Elaboração da minuta de edital."]
["06/2014",1184,"006354/2014","Aquisição de itens do grupo 52.42 (cavalete e tela de proteção)",150600,"PROEXT - APOIO À PRÁTICAS TRADICIONAIS NO USO DE PLANTAS MEDICINAIS","PROJETO PROEXT-MEC 2014 \"ESTRATÉGIAS PARA DESENVOLVIMENTO DE CADEIA PRODUTIVA COM ABELHAS POR MEIOO DA CAPACITAÇÃO E ASSISTÊNCIA TÉCNICA\"","SEÇÃO DE CONTROLE","Já houve empenho (2014NE802003) e  foi entregue no Almoxarifado em 12/11/14."]
["06/2014",160,"002393/2014","Aquisição de pães e bolos",130100,"RESTAURANTE UNIVERSITÁRIO - CAMPUS SEROPÉDICA","RESTAURANTE UNIVERSITÁRIO - CAMPUS SEROPÉDICA","RESTAURANTE UNIVERSITÁRIO DO CAMPUS DE NOVA IGUAÇU","Era o pregão nº 74/2014, porém todos os itens foram cancelados na aceitação da proposta porque os preços foram superiores aos estipulados pela Administração. O novo pregão (nº 160/2014) foi finalizado em 16/12/14. O processo está disponível no Restaurante Universitário do Instituto Multidisciplinar para solicitar empenhos."]
["06/2014",611,"003009/2014","Aquisição de alimentos estocáveis",130100,"RESTAURANTE UNIVERSITÁRIO - CAMPUS SEROPÉDICA","RESTAURANTE UNIVERSITÁRIO - CAMPUS SEROPÉDICA","PROAES","Pregão nº 153/2014 finalizado em 22/12/14. Já houve empenho (2015NE800218, 2015NE800219, 2015NE800213, 2015NE800214, 2015NE800215, 2015NE800216, 2015NE800217). O processo está disponível no Restaurante Universitário de Seropédica para solicitar empenhos."]
["06/2014",422,"002701/2014","Aquisição de café, açúcar, coador e adoçante",110200,"SEÇÃO DE ARQUIVO E PROTOCOLO GERAL","SEÇÃO DE ARQUIVO E PROTOCOLO GERAL","CLOG","Pregão nº 88/2014 finalizado em 03/11/14. Já houve empenho (2014NE802417, 2015NE800302) e pagamento (2015OB800319). O processo está disponível na Seção de Sistema de Registro de Preços para solicitar empenhos."]
["06/2014",145,"002701/2014","Aquisição de café, açúcar, coador e adoçante",260000,"INSTITUTO DE FLORESTAS","INSTITUTO DE FLORESTAS","CLOG","Pregão nº 88/2014 finalizado em 03/11/14. Já houve empenho (2014NE802417, 2015NE800302) e pagamento (2015OB800319). O processo está disponível na Seção de Sistema de Registro de Preços para solicitar empenhos."]
["06/2014",217,"002701/2014","Aquisição de café, açúcar, coador e adoçante",270400,"DEPARTAMENTO DE TECNOLOGIA DE ALIMENTOS","DEPARTAMENTO DE TECNOLOGIA DE ALIMENTOS","CLOG","Pregão nº 88/2014 finalizado em 03/11/14. Já houve empenho (2014NE802417, 2015NE800302) e pagamento (2015OB800319). O processo está disponível na Seção de Sistema de Registro de Preços para solicitar empenhos."]
["06/2014",342,"002699/2014","Aquisição de material de expediente",160000,"PRÓ-REITORIA DE PESQUISA E PÓS GRADUAÇÃO","PRÓ-REITORIA DE PESQUISA E PÓS GRADUAÇÃO","DIREÇÃO DMSA","Verificando a possibilidade de atendimento juntamente com a demanda de 2015."]
["06/2014",243,"002699/2014","Aquisição de material de expediente",220300,"DEPARTAMENTO DE CIÊNCIAS FISIOLÓGICAS","DEPARTAMENTO DE CIÊNCIAS FISIOLÓGICAS","DIREÇÃO DMSA","Verificando a possibilidade de atendimento juntamente com a demanda de 2015."]
["06/2014",169,"002699/2014","Aquisição de material de expediente",290000,"INSTITUTO DE ZOOTECNIA","INSTITUTO DE ZOOTECNIA","DIREÇÃO DMSA","Verificando a possibilidade de atendimento juntamente com a demanda de 2015."]
["06/2014",196,"002703/2014","Aquisição de material de artes gráficas e desenho",280200,"DEPARTAMENTO DE MEDICINA E CIRURGIA VETERINÁRIA","DEPARTAMENTO DE MEDICINA E CIRURGIA VETERINÁRIA","SSRP","Será atendido junto com a Demanda de 2015 - equipe do projeto"]
["06/2014",1284,"006507/2014","Aquisição de sistema protean I12 IEF, 90-240 vac",160001,"PRÓ - EQUIPAMENTOS","PROPPG","CLOG","Já houve empenho (2014NE802210), mas faltam informações sobre a entrega."]
["06/2014","S/Nº","002701/2014","Aquisição de café, açúcar, coador e adoçante",400000,"CAMPUS DA UFRRJ EM TRÊS RIOS","CAMPUS DA UFRRJ EM TRÊS RIOS","CLOG","Pregão nº 88/2014 finalizado em 03/11/14. Já houve empenho (2014NE802417, 2015NE800302) e pagamento (2015OB800319). O processo está disponível na Seção de Sistema de Registro de Preços para solicitar empenhos."]
["06/2014","S/Nº","006046/2014","Aquisição de itens do grupo 30.11 - Material químico (demais setores)",220410,"LABORATÓRIO OFICIAL DE DIAGNÓSTICO FITOSSANITÁRIO","LABORATÓRIO OFICIAL DE DIAGNÓSTICO FITOSSANITÁRIO","CADMIN","Buscando informações."]
["06/2014","S/Nº","004724/2014","Aquisição de quadro de distribuição de sobrepor com barramento 1004 para 28 disjuntores din+geral e outros",120100,"DEPARTAMENTO DE CONTABILIDADE E FINANÇAS","DEPARTAMENTO DE CONTABILIDADE E FINANÇAS","SEÇÃO DE CONTROLE","Buscando informações."]
["06/2014","S/Nº","003137/2014","Aquisição de ventilador de parede oscilante 60 cm bivolt",270000,"INSTITUTO DE TECNOLOGIA","INSTITUTO DE TECNOLOGIA","SEÇÃO DE CONTROLE","Já houve empenho (2014NE801387), pagamentos (2014OB806995 e 2014DF801832) e foi entregue no Almoxarifado em 15/09/14."]
["06/2014","S/Nº","006035/2014","Manifestacao de interesse em processo de srp (contratação de serviço de fornecimento de alimentação) - IRP",120200,"DEPARTAMENTO DE MATERIAL E SERVIÇOS AUXILIARES","DEPARTAMENTO DE MATERIAL E SERVIÇOS AUXILIARES","DIVISÃO DE ADMINISTRAÇÃO FINANCEIRA","O processo já está disponível na Pró-reitoria de Extensão para solicitar empenhos."]
["06/2014",370,"002707/2014","Aquisição de artigos de copa e cozinha",100100,"BIBLIOTECA CENTRAL","BIBLIOTECA CENTRAL","SPP","Verificando a possibilidade de atendimento juntamente com a demanda de 2015."]
["06/2014",351,"002707/2014","Aquisição de artigos de copa e cozinha",130000,"PRÓ-REITORIA DE ASSUNTOS ESTUDANTIS","PRÓ-REITORIA DE ASSUNTOS ESTUDANTIS","SPP","Verificando a possibilidade de atendimento juntamente com a demanda de 2015."]
["06/2014",359,"002707/2014","Aquisição de artigos de copa e cozinha",210200,"DEPARTAMENTO DE GEOCIÊNCIAS","DEPARTAMENTO DE GEOCIÊNCIAS","SPP","Verificando a possibilidade de atendimento juntamente com a demanda de 2015."]
["06/2014",289,"002707/2014","Aquisição de artigos de copa e cozinha",260200,"DEPARTAMENTO DE PRODUTOS FLORESTAIS","DEPARTAMENTO DE PRODUTOS FLORESTAIS","SPP","Verificando a possibilidade de atendimento juntamente com a demanda de 2015."]
["06/2014",1217,"006356/2014","Aquisição dos itens do grupo 30.16 - Material de expediente (papel em geral, etc)",160105,"PROAP - ENGENHARIA QUÍMICA","PROGRAMA DE PÓS-GRADUAÇÃO EM ENGENHARIA QUÍMICA","ANEXADO    23083.006343/2014-16","Consolidar Pesquisa de Preço (anexado ao 006343/2014)."]
["06/2014",973,"005736/2014","Aquisição de bebedouro industrial",240000,"INSTITUTO DE CIÊNCIAS HUMANAS E SOCIAIS","INSTITUTO DE CIÊNCIAS HUMANAS E SOCIAIS","ANEXADO    23083.005867/2014-98","Realizando ajustes após emisssão do parecer jurídico (anexado ao 005867/2014)."]
["06/2014",681,"003008/2014","Aquisição de arame farpado com distância entre as farpas de no máximo 125mm",100500,"COORDENADORIA DE DESENVOLVIMENTO DA PRODUÇÃO","COORDENADORIA DE DESENVOLVIMENTO DA PRODUÇÃO","ARQUIVO","Arquivado porque  houve empenho (2014NE800861) e pagamento (2014OB804762 e 2014DF801441)."]
["06/2014",1811,"009173/2014","Reparo e mautenção de estufa de secagem e esterelização",160112,"PROAP - ZOOTECNIA","PROGRAMA DE PÓS-GRADUAÇÃO EM ZOOTECNIA","SPP","Pesquisa de preço."]
["06/2014",466,"002675/2014","Conserto de quarenta e oito microscópios",220100,"DEPARTAMENTO DE BIOLOGIA ANIMAL","COORD. DA AREA DE HISTOLOGIA E EMBRIOLOGIA","ARQUIVO","Já houve empenho(2014NE800832) e pagamento(2014OB805137)"]
["05/2014",185,"006018/2014","Aquisição de equipamentos para laboratório (grupo 52.08)",280300,"DEPTO DE MICROBIOLOGIA E IMUNOLOGIA VETERINÁRIA","DEPARTAMENTO DE MICROBIOLOGIA E IMUNOLOGIA VETERINÁRIA","DIREÇÃO DMSA","Buscando informações."]
["05/2014",912,"006021/2014","Aquisição de equipamentos agrícolas (grupo 52.40)",160050,"JARDIM BOTÂNICO","JARDIM BOTÂNICO","ASTEC","Pregão 34/2015 - Elaboração da minuta de edital."]
["05/2014",980,"006017/2014","Aquisição de artigos de esporte e recreação (grupo 30.14)",150080,"PROEXT-MEC 2014 - MÃOS QUE CRIAM - PROJETO DE CAPACITAÇÃO PARA PROMOÇÃO SOCIAL","PRÓ-REITORIAS DE EXTENSÃO","SEÇÃO DE CONTROLE","Já houve empenho (2014NE802103), mas o prazo de entrega está vencido e um ofício de cobrança foi emitido à empresa em 09/12/14."]
["05/2014",1052,"006016/2014","Aquisição de cartuchos hp, toners e tintas (grupo 30.17A)",100600,"COORDENADORIA DE PLANEJAMENTO","COORDENADORIA DE PLANEJAMENTO","DMSA","Buscando informações."]
["05/2014",1309,"005967/2014","Pagamento de inscrição de Cristiane Venâncio de Oliveira Martins no 8º Congresso Empresarial Aberje Rio de Janeiro",100000,"REITORIA","COORDENADORIA DE COMUNICAÇÃO SOCIAL","ARQUIVO","Arquivado porque  houve empenho (2014NE801736) e pagamento (2014OB806917)."]
["05/2014",360,"002704/2014","Aquisição de material de expediente (papel A4, carta, ofício, etc)",210200,"DEPARTAMENTO DE GEOCIÊNCIAS","DEPARTAMENTO DE GEOCIÊNCIAS","CPACS","Consolidar Pesquisas de Preços"]
["05/2014",288,"002704/2014","Aquisição de material de expediente (papel A4, carta, ofício, etc)",260200,"DEPARTAMENTO DE PRODUTOS FLORESTAIS","DEPARTAMENTO DE PRODUTOS FLORESTAIS","CPACS","Consolidar Pesquisas de Preços"]
["05/2014",219,"002704/2014","Aquisição de material de expediente (papel A4, carta, ofício, etc)",270400,"DEPARTAMENTO DE TECNOLOGIA DE ALIMENTOS","DEPARTAMENTOS DE TECNOLOGIA DE ALIMENTOS","CPACS","Consolidar Pesquisas de Preços"]
["05/2014",334,"002704/2014","Aquisição de material de expediente (papel A4, carta, ofício, etc)",280200,"DEPARTAMENTO DE MEDICINA E CIRURGIA VETERINÁRIA","DEPARTAMENTO DE MEDICINA E CIRURGIA VETERINÁRIA","CPACS","Consolidar Pesquisas de Preços"]
["05/2014",112,"002704/2014","Aquisição de material de expediente (papel A4, carta, ofício, etc)",300001,"RESTAURANTE UNIVERSITÁRIO - NOVA IGUAÇU","RESTAURANTE UNIVERSITÁRIO - NOVA IGUAÇU","CPACS","Consolidar Pesquisas de Preços"]
["05/2014",446,"002704/2014","Aquisição de material de expediente (papel A4, carta, ofício, etc)",600000,"INSTITUTO DE CIÊNCIAS SOCIAIS APLICADAS","DIREÇÃO","CPACS","Consolidar Pesquisas de Preços"]
["05/2014",371,"002706/2014","Aquisição de artigos de higiene e conservação",100100,"BIBLIOTECA CENTRAL","BIBLIOTECA CENTRAL","SPP","Verificando a possibilidade de atendimento juntamente com a demanda de 2015."]
["05/2014",270,"002706/2014","Aquisição de artigos de higiene e conservação",120200,"DEPARTAMENTO DE MATERIAL E SERVIÇOS AUXILIARES","SEÇÃO DE CONTROLE / ALMOXARIFADO CENTRAL / SETOR DE COBRANÇAS","SPP","Verificando a possibilidade de atendimento juntamente com a demanda de 2015."]
["05/2014",298,"002706/2014","Aquisição de artigos de higiene e conservação",180000,"CTUR","CTUR","SPP","Verificando a possibilidade de atendimento juntamente com a demanda de 2015."]
["05/2014",180,"002706/2014","Aquisição de artigos de higiene e conservação",230100,"DEPARTAMENTO DE FÍSICA","DEPARTAMENTO DE FÍSICA","SPP","Verificando a possibilidade de atendimento juntamente com a demanda de 2015."]
["05/2014",117,"002706/2014","Aquisição de artigos de higiene e conservação",240000,"INSTITUTO DE CIÊNCIAS HUMANAS E SOCIAIS","DIREÇÃO","SPP","Verificando a possibilidade de atendimento juntamente com a demanda de 2015."]
["05/2014",168,"002706/2014","Aquisição de artigos de higiene e conservação",290000,"INSTITUTO DE ZOOTECNIA","DIRETORIA DO IZ","SPP","Verificando a possibilidade de atendimento juntamente com a demanda de 2015."]
["05/2014",487,"002706/2014","Aquisição de artigos de higiene e conservação",400000,"CAMPUS DA UFRRJ EM TRÊS RIOS","DIREÇÃO, TRANSPORTE, PROTOCOLO/PROGRAD/DEST, BIBLIOTECA, DP, NPJ E INFORMÁTICA","SPP","Verificando a possibilidade de atendimento juntamente com a demanda de 2015."]
["05/2014",1078,"005135/2014","Aquisição de plaqueta laminada de patrimônio (grupo 30.59)",120200,"DEPARTAMENTO DE MATERIAL E SERVIÇOS AUXILIARES","CLOG / ALMOXARIFADO CENTRAL","CLOG","Pregão nº 114/2014 finalizado em 06/11/14. Já houve empenho (2014NE802206), mas o prazo de entrega está vencido e um ofício de cobrança foi emitido à empresa em 16/12/14"]
["05/2014",852,"003361/2014","Contratação de pessoa jurídica para assistência técnica e manutenção de dois grupos geradores e painéis eletrônicos",100300,"PREFEITURA UNIVERSITÁRIA","DIVISÃO DE SERVIÇOS GERAIS","SPP","Realizando ajustes após emissão de parecer jurídico."]
["05/2014",779,"003190/2014","Aquisição de materiais agrícolas (grupo 30.99)",100500,"COORDENADORIA DE DESENVOLVIMENTO DA PRODUÇÃO","CEPIEPE","COORDENADORIA ESPECIAL DE PRODUÇÃO INTEGRADA ENSINO, PESQUISA E  EXTENSÃO","Pregão nº 95/2014 finalizado em 29/12/14. O processo está disponível na Coordenadoria Especial de Produção Integrada Ensino, Pesquisa e Extensão para solicitar empenhos."]
["05/2014",1321,"004445/2014","Aquisição de baterias para motocicletas",100060,"DIVISÃO DE GUARDA E VIGILÂNCIA","DIVISÃO DE GUARDA E VIGILÂNCIA","SEÇÃO DE CONTROLE","Já houve empenho (2014NE801583) e foi entregue no Almoxarifado em 30/09/14."]
["05/2014",465,"002674/2014","Conserto de dois no-breaks",220100,"DEPARTAMENTO DE BIOLOGIA ANIMAL","ÁREA DE HISTOLOGIA E EMBRIOLOGIA","SEÇÃO DE CONTROLE","Já houve empenho (2014NE802023) e  foi entregue no Almoxarifado em 19/12/14."]
["05/2014",1416,"006680/2014","Conserto de câmara fria para conservação de sementes",160106,"PROAP - FITOTECNIA","PROGRAMA DE PÓS-GRADUAÇÃO EM FITOTECNIA","ANEXADO    23083.006058/2014-01","O empenho já foi emitido (2014NE802290) e transmitido à empresa. A prestação do serviço já pode ser iniciada (20 dias para execução). (anexado ao 006058/2014)."]
["05/2014",990,"005807/2014","Aquisição de itens do grupo 30.36 - Artigos cirúrgicos e de enfermaria",280400,"DEPARTAMENTO DE PARASITOLOGIA ANIMAL","DEPARTAMENTO DE PARASITOLOGIA ANIMAL","PREGÃO","Aguardando manifestação de interesse (IRP) de outros órgãos para realizar o pregão. Pregão nº 12/2015."]
["05/2014",1185,"006354/2014","Aquisição de itens do grupo 52.42 (cavalete e tela de proteção)",150600,"PROEXT - APOIO À PRÁTICAS TRADICIONAIS NO USO DE PLANTAS MEDICINAIS","Projeto PROEXT-MEC 2014 \"APOIO ÀS PRÁTICAS TRADICIONAIS...\"","SEÇÃO DE CONTROLE","Já houve empenho (2014NE802003) e  foi entregue no Almoxarifado em 12/11/14."]
["05/2014",1643,"008024/2014","Aquisição de cartuchos",280010,"HOSPITAL VETERINÁRIO","HOSPITAL VETERINÁRIO","ARQUIVO","Arquivado porque o material está sendo atendido pelo processo 003666/2014."]
["05/2014",1643,"003666/2014","Aquisição de cartuchos de tinta",140530,"DOCÊNCIA NA EDUCAÇÃO INFANTIL","INSTITUTO MULTIDISCIPLINAR - CURSO DE PÓS-GRADUAÇÃO \"DOCÊNCIA NA EDUCAÇÃO INFANTIL\"","SPP","Pesquisa de preço."]
["05/2014",361,"003179/2014","Aquisição de gás medicinal",220410,"LABORATÓRIO OFICIAL DE DIAGNÓSTICO FITOSSANITÁRIO","LABORATÓRIO OFICIAL DE DIAGNÓSTICO FITOSSANITÁRIO","ANEXADO    23083.003153/2014-45","Pregão nº 13/2015 (antigo nº 99/2014) finalizado em 22/01/15. Está na SSRP para realizar as cópias das atas e em breve um gestor será designado (anexado ao 003153/2014)."]
["05/2014",67,"002700/2014","Aquisição de gás liquefeito de petróleo",220410,"LABORATÓRIO OFICIAL DE DIAGNÓSTICO FITOSSANITÁRIO","LABORATÓRIO OFICIAL DE DIAGNÓSTICO FITOSSANITÁRIO","DIREÇÃO DMSA","Pregão nº 138/2014 finalizado em 14/11/14. O processo está disponível na Seção de Sistema de Registro de Preços para solicitar empenhos."]
["05/2014",144,"002700/2014","Aquisição de gás liquefeito de petróleo",260000,"INSTITUTO DE FLORESTAS","INSTITUTO DE FLORESTAS","DIREÇÃO DMSA","Pregão nº 138/2014 finalizado em 14/11/14. O processo está disponível na Seção de Sistema de Registro de Preços para solicitar empenhos."]
["05/2014",154,"002701/2014","Aquisição de café, açúcar, coador e adoçante",250000,"INSTITUTO DE EDUCAÇÃO","INSTITUTO DE EDUCAÇÃO","CLOG","Pregão nº 88/2014 finalizado em 03/11/14. Já houve empenho (2014NE802417, 2015NE800302) e pagamento (2015OB800319). O processo está disponível na Seção de Sistema de Registro de Preços para solicitar empenhos."]
["05/2014",311,"002699/2014","Aquisição de material de expediente",210000,"INSTITUTO DE AGRONOMIA","INSTITUTO DE AGRONOMIA","DIREÇÃO DMSA","Verificando a possibilidade de atendimento juntamente com a demanda de 2015."]
["05/2014",397,"002703/2014","Aquisição de material de artes gráficas e desenho",140000,"PRÓ-REITORIA DE ENSINO E GRADUAÇÃO","PRÓ-REITORIA DE ENSINO E GRADUAÇÃO","SSRP","Será atendido junto com a Demanda de 2015 - equipe do projeto"]
["05/2014",390,"002703/2014","Aquisição de material de artes gráficas e desenho",170000,"CAIC","CAIC","SSRP","Será atendido junto com a Demanda de 2015 - equipe do projeto"]
["05/2014",423,"002703/2014","Aquisição de material de artes gráficas e desenho",270000,"INSTITUTO DE TECNOLOGIA","INSTITUTO DE TECNOLOGIA","SSRP","Será atendido junto com a Demanda de 2015 - equipe do projeto"]
["05/2014",1721,"008327/2014","Serviço com fornecimento de divisórias",500030,"PROGRAMA INGLÊS SEM FRONTEIRAS","INGLÊS SEM FRONTEIRAS","DRA. JAQUELINE","Aguardando solicitação de nova dotação orçamentária junto à PROAF."]
["05/2014","S/Nº","002425/2014","Aquisição de carnes",130100,"RESTAURANTE UNIVERSITÁRIO - CAMPUS SEROPÉDICA","RESTAURANTE UNIVERSITÁRIO - CAMPUS SEROPÉDICA","DIREÇÃO DMSA","Pregão nº 87/2014 finalizado em 07/11/14. Já houve empenho (2014NE802353, 2014NE802354, 2014NE802355, 2014NE802356, 2014NE802357, 2014NE802358, 2014NE802359, 2014NE802360, 2014NE802361, 2014NE802363) e pagamento (2015OB800183, 2015OB800197). O processo está disponível na Pró-reitoria de Assuntos Estudantis para solicitar empenhos."]
["05/2014","S/Nº","006008/2014","Aquisição de material hidráulico (grupo 30.24)",210300,"DEPARTAMENTO DE SOLOS","DEPARTAMENTO DE SOLOS","ASTEC","Elaboração da minuta de edital."]
["05/2014","S/Nº","004585/2014","Aquisição futura de vidraria",120200,"DEPARTAMENTO DE MATERIAL E SERVIÇOS AUXILIARES","DIRETORIA DO DEPARTAMENTO DE MATERIAL E SERVIÇOS AUXILIARES","SSRP","Aguardando o pregão ser realizado."]
["05/2014","S/Nº","003094/2014","Recuperação da rede de gás do Laboratório de Microbiologia e Fermentação",270000,"INSTITUTO DE TECNOLOGIA","DEPARTAMENTO DE TECNOLOGIA E ALIMENTOS","ARQUIVO","Já houve empenho (2014NE800708) e pagamento (2014OB804537)"]
["05/2014",354,"002699/2014","Aquisição de material de expediente",130000,"PRÓ-REITORIA DE ASSUNTOS ESTUDANTIS","PRÓ-REITORIA DE ASSUNTOS ESTUDANTIS","DIREÇÃO DMSA","Verificando a possibilidade de atendimento juntamente com a demanda de 2015."]
["05/2014",501,"003188/2014","Aquisição de medicamentos de uso veterinário",280010,"HOSPITAL VETERINÁRIO","HOSPITAL VETERINÁRIO","SEÇÃO DE CONTROLE","Pregão nº 142/2014 finalizado em 29/12/14. O processo está disponível na Seção de Sistema de Registro de Preços para solicitar empenhos. "]
["05/2014",1465,"009584/2014","Aquisição de materiais de alguns itens do grupo 30.31 - Insumos agrícolas (formicida e semente de espécie de milho híbrido)",160106,"PROAP - FITOTECNIA","PROGRAMA DE PÓS-GRADUAÇÃO EM FITOTECNIA","DIREÇÃO DMSA","Buscando informações."]
["05/2014",1264,"006590/2014","Aquisição do grupo 30.11 - Material químico (solventes, ácidos, etc)",150600,"PROEXT - APOIO À PRÁTICAS TRADICIONAIS NO USO DE PLANTAS MEDICINAIS","PROJETO PROEXT - MEC \"APOIO AS PRÁTICAS TRADICIONAIS, USO DE PLANTAS MEDICINAIS E SISTEMAS AGROALIMENTARES\"","DIREÇÃO DMSA","A Direção está verificando a possibilidade de atendimento juntamente com a demanda de 2015."]
["05/2014",1963,"010456/2014","Aquisição de vinte divisórias em madeira compensada resinada espessura 6mm, estruturada em madeira de lei 3x3",500030,"PROGRAMA INGLÊS SEM FRONTEIRAS","PROGRAMA INGLÊS SEM FRONTEIRAS","ANEXADO    23083.009790/2014-25","Já houve empenho (2014NE802293), anulação parcial do empenho (2014NE802390) e a data prevista de entrega é até 15/03/15.\nJá houve empenho (2014NE802296) e a data prevista de entrega é até 15/03/15.\nJá houve empenho (2014NE802301) e a data prevista de entrega é até 15/03/15.\nA SSRP está verificando se existem caronas para atendimento das longarinas e posterior tomada de decisão entre a Direção do DMSA e PROAEST. (anexado no 009790/2014)"]
["05/2014",904,"003666/2014","Aquisição de cartuchos de tinta",150090,"PROEXT - ESTRATÉGIA DESENVOLVIMENTO CADEIA PRODUTIVA COM ABELHAS","PROEXT - ESTRATÉGIA DESENVOLVIMENTO CADEIA PRODUTIVA COM ABELHAS","SPP","Pesquisa de preços."]
["05/2014",1812,"009173/2014","Reparo e mautenção de estufa de secagem e esterelização",160112,"PROAP - ZOOTECNIA","PROGRAMA DE PÓS-GRADUAÇÃO EM ZOOTECNIA","SPP","Pesquisa de preço."]
["03/2014",223,"006056/2014","Aquisição de material de artes gráficas, desenho e expediente (grupos 30.16 e 30.16B)",160102,"PROAP - CIÊNCIAS AMBIENTAIS E FLORESTAIS","PROGRAMA DE PÓS-GRADUAÇÃO EM CIÊNCIAS AMBIENTAIS E FLORESTAIS","SSRP","Verificando a possibilidade de atendimento juntamente com a demanda de 2015."]
["03/2014",293,"005919/2014","Pagamento de inscrição da Profª. Katia Cilene Tabai no XXIV Congresso Brasileiro de Ciência e Tecnologia de Alimentos",600000,"INSTITUTO DE CIÊNCIAS SOCIAIS APLICADAS","ICSA - DEDH","SAPG","Já houve empenho (2014NE801400) e pagamento (2015OB800581)."]
["03/2014",1030,"006085/2014","Serviço de instalação de aparelhos de ar condicionado",160107,"PROAP - MEDICINA VETERINÁRIA","PROGRAMA DE PÓS-GRADUAÇÃO EM MEDICINA VETERINÁRIA","SAPG","O empenho já foi emitido (2014NE802065) e a empresa está realizando o serviço."]
["03/2014",1148,"006356/2014","Aquisição dos itens do grupo 30.16 - Material de expediente (papel em geral, etc)",150400,"PROEXT - PROGRAMA APOIO E ACOMPANHAMENTO USO DE LAPTOPS ESCOLA POR ALUNO","PROEXT - PROGRAMA APOIO E ACOMPANHAMENTO NO USO DE LAPTOPS ESCOLA POR ALUNO ","ANEXADO    23083.006343/2014-14","Consolidar Pesquisa de Preço (anexado ao 006343/2014)."]
["03/2014",1320,"005968/2014","Aquisição de mobiliário em geral (grupo 52.42)",160106,"PROAP - FITOTECNIA","PROGRAMA DE PÓS-GRADUAÇÃO EM FITOTECNIA","DIREÇÃO DMSA","Verificando a possibilidade de atendimento juntamente com a demanda de 2015."]
["03/2014",355,"002704/2014","Aquisição de material de expediente (papel A4, carta, ofício, etc)",130000,"PRÓ-REITORIA DE ASSUNTOS ESTUDANTIS","SECRETARIA","CPACS","Consolidar Pesquisas de Preços"]
["03/2014",303,"002704/2014","Aquisição de material de expediente (papel A4, carta, ofício, etc)",210000,"INSTITUTO DE AGRONOMIA","SECRETARIA ADMINISTRATIVA DO INSTITUTO","CPACS","Consolidar Pesquisas de Preços"]
["03/2014",184,"002704/2014","Aquisição de material de expediente (papel A4, carta, ofício, etc)",230100,"DEPARTAMENTO DE FÍSICA","DEPARTAMENTO DE FÍSICA","CPACS","Consolidar Pesquisas de Preços"]
["03/2014",116,"002704/2014","Aquisição de material de expediente (papel A4, carta, ofício, etc)",240000,"INSTITUTO DE CIÊNCIAS HUMANAS E SOCIAIS","DIREÇÃO","CPACS","Consolidar Pesquisas de Preços"]
["03/2014",152,"002704/2014","Aquisição de material de expediente (papel A4, carta, ofício, etc)",250000,"INSTITUTO DE EDUCAÇÃO","DIREÇÃO","CPACS","Consolidar Pesquisas de Preços"]
["03/2014",318,"002704/2014","Aquisição de material de expediente (papel A4, carta, ofício, etc)",250020,"LICENCIATURA EM EDUCAÇÃO DO CAMPO - PROCAMPO","INSTITUTO DE EDUCAÇÃO - DEPARTAMENTO DE TEORIA E PLANEJAMENTO DE ENSINO (DTPE)","CPACS","Consolidar Pesquisas de Preços"]
["03/2014",349,"002706/2014","Aquisição de artigos de higiene e conservação",100300,"PREFEITURA UNIVERSITÁRIA","SECRETARIA","SPP","Verificando a possibilidade de atendimento juntamente com a demanda de 2015."]
["03/2014",253,"002706/2014","Aquisição de artigos de higiene e conservação",120400,"LAVANDERIA","LAVANDERIA","SPP","Verificando a possibilidade de atendimento juntamente com a demanda de 2015."]
["03/2014",345,"002706/2014","Aquisição de artigos de higiene e conservação",160000,"PRÓ-REITORIA DE PESQUISA E PÓS GRADUAÇÃO","PRÓ-REITORIA DE PESQUISA E PÓS GRADUAÇÃO","SPP","Verificando a possibilidade de atendimento juntamente com a demanda de 2015."]
["03/2014",122,"002706/2014","Aquisição de artigos de higiene e conservação",220100,"DEPARTAMENTO DE BIOLOGIA ANIMAL","DEPARTAMENTO DE BIOLOGIA ANIMAL","SPP","Verificando a possibilidade de atendimento juntamente com a demanda de 2015."]
["03/2014",312,"002706/2014","Aquisição de artigos de higiene e conservação",260000,"INSTITUTO DE FLORESTAS","PPGPDS - PROGRAMA DE PÓS-GRADUAÇÃO EM DESENVOLVIMENTO SUSTENTÁVEL","SPP","Verificando a possibilidade de atendimento juntamente com a demanda de 2015."]
["03/2014",193,"002706/2014","Aquisição de artigos de higiene e conservação",280200,"DEPARTAMENTO DE MEDICINA E CIRURGIA VETERINÁRIA","DEPARTAMENTO DE MEDICINA E CIRURGIA VETERINÁRIA","SPP","Verificando a possibilidade de atendimento juntamente com a demanda de 2015."]
["03/2014",102,"002706/2014","Aquisição de artigos de higiene e conservação",280300,"DEPTO DE MICROBIOLOGIA E IMUNOLOGIA VETERINÁRIA","DEPTO DE MICROBIOLOGIA E IMUNOLOGIA VETERINÁRIA","SPP","Verificando a possibilidade de atendimento juntamente com a demanda de 2015."]
["03/2014",366,"002706/2014","Aquisição de artigos de higiene e conservação",280400,"DEPARTAMENTO DE PARASITOLOGIA ANIMAL","DEPARTAMENTO DE PARASITOLOGIA ANIMAL","SPP","Verificando a possibilidade de atendimento juntamente com a demanda de 2015."]
["03/2014",111,"002706/2014","Aquisição de artigos de higiene e conservação",300001,"RESTAURANTE UNIVERSITÁRIO - NOVA IGUAÇU","RESTAURANTE UNIVERSITÁRIO - NOVA IGUAÇU","SPP","Verificando a possibilidade de atendimento juntamente com a demanda de 2015."]
["03/2014",205,"002709/2014","Aquisição de gaiolas metabólicas para ratos",220300,"DEPARTAMENTO DE CIÊNCIAS FISIOLÓGICAS","DEPARTAMENTO DE CIÊNCIAS FISIOLÓGICAS","SEÇÃO DE CONTROLE","Pregão nº 110/2014 finalizado em 24/11/14. Já houve empenho (2014NE802604) e a data prevista de entrega é até 16/04/15. "]
["03/2014",205,"007036/2014","Aquisição de gaiolas metabólicas para ratos",220300,"DEPARTAMENTO DE CIÊNCIAS FISIOLÓGICAS","DEPARTAMENTO DE CIÊNCIAS FISIOLÓGICAS","ARQUIVO","Arquivado porque o material foi atendido pelo processo 002709/2014 (pregão nº 110/2014)."]
["03/2014",1324,"006172/2014","Pagamento de inscrição do servidor Edmilson Rangel no II Curso de excel avançado aplicado ao setor público",10310,"CAPACITAÇÃO DE SERVIDORES - RECURSOS ESPECÍFICOS","DEPARTAMENTO DE CONTABILIDADE E FINANÇAS","SAPG","O requerente não participou do curso no período de 13 a 17/10/14 e solicitou o aproveitamento do processo para realizar o mesmo curso no período de 06 a 10/04/15."]
["03/2014",873,"005735/2014","Aquisição de equipamentos industriais - banho Maria, moinho, máquina de costura, fogão, liquidificador e seladora (grupo 52.28)",150000,"PRÓ-REITORIA DE EXTENSÃO","PRÓ-REITORIA DE EXTENSÃO","ASSESSORIA TECNICA/DMSA","Pesquisa de preço."]
["03/2014",1182,"005735/2014","Aquisição de equipamentos industriais - banho Maria, moinho, máquina de costura, fogão, liquidificador e seladora (grupo 52.28)",150000,"PRÓ-REITORIA DE EXTENSÃO","PRÓ-REITORIA DE EXTENSÃO","ASSESSORIA TECNICA/DMSA","Pesquisa de preço."]
["03/2014",226,"002701/2014","Aquisição de café, açúcar, coador e adoçante",140000,"PRÓ-REITORIA DE ENSINO E GRADUAÇÃO","PRÓ-REITORIA DE ENSINO E GRADUAÇÃO","CLOG","Pregão nº 88/2014 finalizado em 03/11/14. Já houve empenho (2014NE802417, 2015NE800302) e pagamento (2015OB800319). O processo está disponível na Seção de Sistema de Registro de Preços para solicitar empenhos."]
["03/2014",242,"002701/2014","Aquisição de café, açúcar, coador e adoçante",140120,"ENGENHARIA FLORESTAL","ENGENHARIA FLORESTAL","CLOG","Pregão nº 88/2014 finalizado em 03/11/14. Já houve empenho (2014NE802417, 2015NE800302) e pagamento (2015OB800319). O processo está disponível na Seção de Sistema de Registro de Preços para solicitar empenhos."]
["03/2014",388,"002701/2014","Aquisição de café, açúcar, coador e adoçante",170000,"CAIC","CAIC","CLOG","Pregão nº 88/2014 finalizado em 03/11/14. Já houve empenho (2014NE802417, 2015NE800302) e pagamento (2015OB800319). O processo está disponível na Seção de Sistema de Registro de Preços para solicitar empenhos."]
["03/2014",166,"002701/2014","Aquisição de café, açúcar, coador e adoçante",290000,"INSTITUTO DE ZOOTECNIA","INSTITUTO DE ZOOTECNIA","CLOG","Pregão nº 88/2014 finalizado em 03/11/14. Já houve empenho (2014NE802417, 2015NE800302) e pagamento (2015OB800319). O processo está disponível na Seção de Sistema de Registro de Preços para solicitar empenhos."]
["03/2014",172,"002701/2014","Aquisição de café, açúcar, coador e adoçante",300000,"CAMPUS DA UFRRJ EM NOVA IGUAÇU","CAMPUS DA UFRRJ EM NOVA IGUAÇU","CLOG","Pregão nº 88/2014 finalizado em 03/11/14. Já houve empenho (2014NE802417, 2015NE800302) e pagamento (2015OB800319). O processo está disponível na Seção de Sistema de Registro de Preços para solicitar empenhos."]
["03/2014",268,"002699/2014","Aquisição de material de expediente",120200,"DEPARTAMENTO DE MATERIAL E SERVIÇOS AUXILIARES","DEPARTAMENTO DE MATERIAL E SERVIÇOS AUXILIARES","DIREÇÃO DMSA","Verificando a possibilidade de atendimento juntamente com a demanda de 2015."]
["03/2014",228,"003664/2014","Aquisição de papel A4 e papel A3",150600,"PROEXT - APOIO À PRÁTICAS TRADICIONAIS NO USO DE PLANTAS MEDICINAIS","PROGRAMA PROEXT-MEC 2014 ","ARQUIVO","Arquivado porque as solitações foram realizadas pelos Coordenadores através do Quiosque de Compras."]
["03/2014",246,"002699/2014","Aquisição de material de expediente",190000,"CAMPUS DR. LEONEL MIRANDA","CAMPUS DR. LEONEL MIRANDA","DIREÇÃO DMSA","Verificando a possibilidade de atendimento juntamente com a demanda de 2015."]
["03/2014",357,"002699/2014","Aquisição de material de expediente",210200,"DEPARTAMENTO DE GEOCIÊNCIAS","DEPARTAMENTO DE GEOCIÊNCIAS","DIREÇÃO DMSA","Verificando a possibilidade de atendimento juntamente com a demanda de 2015."]
["03/2014",286,"002699/2014","Aquisição de material de expediente",260200,"DEPARTAMENTO DE PRODUTOS FLORESTAIS","DEPARTAMENTO DE PRODUTOS FLORESTAIS","DIREÇÃO DMSA","Verificando a possibilidade de atendimento juntamente com a demanda de 2015."]
["03/2014",220,"002699/2014","Aquisição de material de expediente",270400,"DEPARTAMENTO DE TECNOLOGIA DE ALIMENTOS","DEPARTAMENTO DE TECNOLOGIA DE ALIMENTOS","DIREÇÃO DMSA","Verificando a possibilidade de atendimento juntamente com a demanda de 2015."]
["03/2014",490,"002699/2014","Aquisição de material de expediente",280010,"HOSPITAL VETERINÁRIO","HOSPITAL VETERINÁRIO","DIREÇÃO DMSA","Verificando a possibilidade de atendimento juntamente com a demanda de 2015."]
["03/2014",373,"002703/2014","Aquisição de material de artes gráficas e desenho",100100,"BIBLIOTECA CENTRAL","BIBLIOTECA CENTRAL","SSRP","Será atendido junto com a Demanda de 2015 - equipe do projeto"]
["03/2014",485,"002703/2014","Aquisição de material de artes gráficas e desenho",400000,"CAMPUS DA UFRRJ EM TRÊS RIOS","CAMPUS DA UFRRJ EM TRÊS RIOS","SSRP","Será atendido junto com a Demanda de 2015 - equipe do projeto"]
["03/2014",1645,"008023/2014","Aquisição de bloco de recados e outros",140530,"DOCÊNCIA NA EDUCAÇÃO INFANTIL","INSTITUTO MULTIDISCIPLINAR - CURSO DE PÓS-GRADUAÇÃO \"DOCÊNCIA NA EDUCAÇÃO INFANTIL\"","DIREÇÃO DMSA","Buscando informações."]
["03/2014","S/Nº","002703/2014","Aquisição de material de artes gráficas e desenho",100200,"IMPRENSA UNIVERSITÁRIA","IMPRENSA UNIVERSITÁRIA","SSRP","Será atendido junto com a Demanda de 2015 - equipe do projeto"]
["03/2014","S/Nº","002707/2014","Aquisição de artigos de copa e cozinha",220410,"LABORATÓRIO OFICIAL DE DIAGNÓSTICO FITOSSANITÁRIO","LABORATÓRIO OFICIAL DE DIAGNÓSTICO FITOSSANITÁRIO","SPP","Verificando a possibilidade de atendimento juntamente com a demanda de 2015."]
["03/2014","S/Nº","006285/2014","Aquisição de microfone de lapela, sem fio, UHF de controle sintetizado Pll com no mínimo 188 canais selecionáveis",150070,"PROEXT - OBSERVATÓRIO DE POLÍTICAS DEMOCRÁTICAS DE ACESSO E PERMANÊNCIA NA EDUCAÇÃO SUPERIOR","PRÓ-REITORIA DE EXTENSÃO","CLOG","Já houve empenho (2014NE801693), pagamento (2014OB809139) e foi entregue no Almoxarifado em 21/11/14."]
["03/2014","S/Nº","002424/2014","Aquisição de pão de forma, etc",130100,"RESTAURANTE UNIVERSITÁRIO - CAMPUS SEROPÉDICA","PRÓ-REITORIA DE ASSUNTOS ESTUDANTIS","PROAES","Buscando informações."]
["03/2014","S/Nº","004584/2014","Aquisição de material de expediente",120200,"DEPARTAMENTO DE MATERIAL E SERVIÇOS AUXILIARES","DIRETORIA DO DEPARTAMENTO DE MATERIAL E SERVIÇOS AUXILIARES","SSRP","Já houve empenho (2014NE802311), pagamento (2014OB809822) e foi entregue no Almoxarifado em 02/12/14.\nJá houve empenho (2014NE801925), pagamento (2014OB809821) e foi entregue no Almoxarifado em 05/12/14."]
["03/2014",276,"002699/2014","Aquisição de material de expediente",180000,"CTUR","CTUR","DIREÇÃO DMSA","Verificando a possibilidade de atendimento juntamente com a demanda de 2015."]
["03/2014",427,"002707/2014","Aquisição de artigos de copa e cozinha",270000,"INSTITUTO DE TECNOLOGIA","INSTITUTO DE TECNOLOGIA","SPP","Verificando a possibilidade de atendimento juntamente com a demanda de 2015."]
["03/2014",209,"002707/2014","Aquisição de artigos de copa e cozinha",270000,"INSTITUTO DE TECNOLOGIA","INSTITUTO DE TECNOLOGIA","SPP","Verificando a possibilidade de atendimento juntamente com a demanda de 2015."]
["03/2014",442,"002707/2014","Aquisição de artigos de copa e cozinha",600000,"INSTITUTO DE CIÊNCIAS SOCIAIS APLICADAS","INSTITUTO DE CIÊNCIAS SOCIAIS APLICADAS","SPP","Verificando a possibilidade de atendimento juntamente com a demanda de 2015."]
["03/2014",881,"006359/2014","Aquisição dos itens do grupo 52.40 - Equipamento agrícola (arado,etc)",150080,"PROEXT - MÃOS QUE CRIAM - PROJETO DE CAPACITAÇÃO PARA PROMOÇÃO SOCIAL","PRÓ-REITORIA DE EXTENSÃO - PROJETO \"MÃOS QUE CRIAM\"","CLOG","Aguardando dispensa."]
["03/2014",1215,"006356/2014","Aquisição dos itens do grupo 30.16 - Material de expediente (papel em geral, etc)",160105,"PROAP - ENGENHARIA QUÍMICA","PROGRAMA DE PÓS-GRADUAÇÃO EM ENGENHARIA QUÍMICA","ANEXADO    23083.006343/2014-15","Consolidar Pesquisa de Preço (anexado ao 006343/2014)."]
["03/2014",947,"005734/2014","Aquisição de fita nylon para impressora matricial, cor da tinta da fita preto",120100,"DEPARTAMENTO DE CONTABILIDADE E FINANÇAS","DEPARTAMENTO DE CONTABILIDADE E FINANÇAS","ANEXADO    23083.006016/2014-62","Buscando informações (anexado ao 006016/2014)."]
["03/2014",1057,"005199/2014","Aquisição de mídia cartão de memória, pen drive, dimensões 59.7mm x 22.3mm x 9.5 mm",150070,"PROEXT - OBSERVATÓRIO DE POLÍTICAS DEMOCRÁTICAS DE ACESSO E PERMANÊNCIA NA EDUCAÇÃO SUPERIOR","PROEXT - OBSERV POLÍTICAS DE DEMOCRAT DE ACESSO E PERMANÊNCIA EDUC. SUPERIOR","ARQUIVO","Arquivado porque o material foi atendido através do processo 002078/2014."]
["03/2014",1964,"010486/2014","Aquisição de cento e cinquenta pen drives capacidade 32 gb",150070,"PROEXT - OBSERVATÓRIO DE POLÍTICAS DEMOCRÁTICAS DE ACESSO E PERMANÊNCIA NA EDUCAÇÃO SUPERIOR","PROEXT - OBSERV POLÍTICAS DE DEMOCRAT DE ACESSO E PERMANÊNCIA EDUC. SUPERIOR","CLOG","Já houve empenho (2014NE802320) e foi entregue no Almoxarifado em 13/01/15."]
["03/2014",1925,"010106/2014","Contratação de empresa especializada na prestação de serviços continuados de vigilância e segurança armada",400000,"CAMPUS DA UFRRJ EM TRÊS RIOS","CAMPUS DA UFRRJ EM TRÊS RIOS","DRA. JAQUELINE","Emissão de parecer Jurídico"]
["03/2014",1468,"001009/2014","Prestação de serviços continuados de limpeza, conservação e higienização nas dependências da UFRRJ, Campus Seropédica/RJ",120000,"PRÓ-REITORIA DE ASSUNTOS FINANCEIROS","PRÓ-REITORIA DE ASSUNTOS FINANCEIROS","DIVISÃO DE ADMINISTRAÇÃO FINANCEIRA","Repactuação do contrato."]
["03/2014",1018,"004813/2014","Aquisição de suítes de escritório, contendo planilha eletrônica, programa de apresentações",150070,"PROEXT - OBSERVATÓRIO DE POLÍTICAS DEMOCRÁTICAS DE ACESSO E PERMANÊNCIA NA EDUCAÇÃO SUPERIOR","PRÓ-REITORIA DE EXTENSÃO","ARQUIVO","Arquivado porque o material foi atendido pelo pregão n°55/2013, processo 004424/2013."]
["04/2014",324,"002704/2014","Aquisição de material de expediente (papel A4, carta, ofício, etc)",180000,"CTUR","CTUR","CPACS","Consolidar Pesquisas de Preços"]
["04/2014",1028,"005968/2014","Aquisição de mobiliário em geral (grupo 52.42)",160107,"PROAP - MEDICINA VETERINÁRIA","PROGRAMA DE PÓS-GRADUAÇÃO EM MEDICINA VETERINÁRIA","DIREÇÃO DMSA","Verificando a possibilidade de atendimento juntamente com a demanda de 2015."]
["04/2014",1087,"006016/2014","Aquisição de cartuchos hp, toners e tintas (grupo 30.17A)",250300,"DEPARTAMENTO DE TEORIA E PLANEJAMENTO DE ENSINO","DEPARTAMENTO DE TEORIA E PLANEJAMENTO DE ENSINO","DMSA","Buscando informações."]
["04/2014",372,"002704/2014","Aquisição de material de expediente (papel A4, carta, ofício, etc)",100100,"BIBLIOTECA CENTRAL","BIBLIOTECA CENTRAL","CPACS","Consolidar Pesquisas de Preços"]
["04/2014",350,"002704/2014","Aquisição de material de expediente (papel A4, carta, ofício, etc)",100300,"PREFEITURA UNIVERSITÁRIA","SECRETARIA","CPACS","Consolidar Pesquisas de Preços"]
["04/2014",429,"002704/2014","Aquisição de material de expediente (papel A4, carta, ofício, etc)",110000,"PRÓ-REITORIA DE ASSUNTOS ADMINISTRATIVOS","SEÇÃO DE ARQUIVO E PROTOCOLO GERAL","CPACS","Consolidar Pesquisas de Preços"]
["04/2014",425,"002704/2014","Aquisição de material de expediente (papel A4, carta, ofício, etc)",270000,"INSTITUTO DE TECNOLOGIA","DEPARTAMENTO DE ARQUITETURA E URBANISMO","CPACS","Consolidar Pesquisas de Preços"]
["04/2014",489,"002704/2014","Aquisição de material de expediente (papel A4, carta, ofício, etc)",280010,"HOSPITAL VETERINÁRIO","HOSPITAL VETERINÁRIO","CPACS","Consolidar Pesquisas de Preços"]
["04/2014",101,"002704/2014","Aquisição de material de expediente (papel A4, carta, ofício, etc)",280300,"DEPTO DE MICROBIOLOGIA E IMUNOLOGIA VETERINÁRIA","DEPARTAMENTO DE MICROBIOLOGIA","CPACS","Consolidar Pesquisas de Preços"]
["04/2014",167,"002704/2014","Aquisição de material de expediente (papel A4, carta, ofício, etc)",290000,"INSTITUTO DE ZOOTECNIA","DIRETORIA DO IZ","CPACS","Consolidar Pesquisas de Preços"]
["04/2014",565,"002706/2014","Aquisição de artigos de higiene e conservação",100200,"IMPRENSA UNIVERSITÁRIA","IMPRENSA UNIVERSITÁRIA","SPP","Verificando a possibilidade de atendimento juntamente com a demanda de 2015."]
["04/2014",353,"002706/2014","Aquisição de artigos de higiene e conservação",130000,"PRÓ-REITORIA DE ASSUNTOS ESTUDANTIS","SECRETARIA","SPP","Verificando a possibilidade de atendimento juntamente com a demanda de 2015."]
["04/2014",245,"002706/2014","Aquisição de artigos de higiene e conservação",190000,"CAMPUS DR. LEONEL MIRANDA","DIREÇÃO","SPP","Verificando a possibilidade de atendimento juntamente com a demanda de 2015."]
["04/2014",60,"002706/2014","Aquisição de artigos de higiene e conservação",220410,"LABORATÓRIO OFICIAL DE DIAGNÓSTICO FITOSSANITÁRIO","LABORATÓRIO OFICIAL DE DIAGNÓSTICO FITOSSANITÁRIO","SPP","Verificando a possibilidade de atendimento juntamente com a demanda de 2015."]
["04/2014",143,"002706/2014","Aquisição de artigos de higiene e conservação",260000,"INSTITUTO DE FLORESTAS","DIRETORIA","SPP","Verificando a possibilidade de atendimento juntamente com a demanda de 2015."]
["04/2014",218,"002706/2014","Aquisição de artigos de higiene e conservação",270400,"DEPARTAMENTO DE TECNOLOGIA DE ALIMENTOS","DEPARTAMENTO DE TECNOLOGIA DE ALIMENTOS","SPP","Verificando a possibilidade de atendimento juntamente com a demanda de 2015."]
["04/2014",174,"002706/2014","Aquisição de artigos de higiene e conservação",300000,"CAMPUS DA UFRRJ EM NOVA IGUAÇU","SUPERINTENDÊNCIA DO CAMPUS","SPP","Verificando a possibilidade de atendimento juntamente com a demanda de 2015."]
["04/2014",1020,"004814/2014","Aquisição de tablet de 10,1\" e 7\"",150070,"PROEXT - OBSERVATÓRIO DE POLÍTICAS DEMOCRÁTICAS DE ACESSO E PERMANÊNCIA NA EDUCAÇÃO SUPERIOR","PRÓ-REITORIA DE EXTENSÃO","PRÓ-REITORIA DE PLANEJAMENTO, AVALIAÇÃO E DESENVOLVIMENTO","Enviado à COTIC para atendimento da nova legislação."]
["04/2014",1322,"004447/2014","Aquisição de componente (percursor) interno das 2 espingardas calibre 12",100060,"DIVISÃO DE GUARDA E VIGILÂNCIA","DIVISÃO DE GUARDA E VIGILÂNCIA","DIVISÃO DE GUARDA E VIGILÂNCIA","Já houve empenho (2014NE801581) e foi entregue no  Almoxarifado em 25/09/14."]
["04/2014",1222,"007530/2014","Aquisição de memória portátil microcomputador (grupo 30.17B)",160105,"PROAP - ENGENHARIA QUÍMICA","PPGEQ","COORD. DO CURSO DE POS-GRADUAÇÃO EM ENGENHARIA QUÍMICA","Buscando informações."]
["04/2014",306,"007547/2014","Aquisição de racks e mini-isolador para ratos",220300,"DEPARTAMENTO DE CIÊNCIAS FISIOLÓGICAS","DEPARTAMENTO DE CIÊNCIAS FISIOLÓGICAS","SPP","Pesquisa de preço."]
["04/2014",346,"002700/2014","Aquisição de gás liquefeito de petróleo",160000,"PRÓ-REITORIA DE PESQUISA E PÓS GRADUAÇÃO","PRÓ-REITORIA DE PESQUISA E PÓS GRADUAÇÃO","DIREÇÃO DMSA","Pregão nº 138/2014 finalizado em 14/11/14. O processo está disponível na Seção de Sistema de Registro de Preços para solicitar empenhos."]
["04/2014",192,"002700/2014","Aquisição de gás liquefeito de petróleo",280200,"DEPARTAMENTO DE MEDICINA E CIRURGIA VETERINÁRIA","DEPARTAMENTO DE MEDICINA E CIRURGIA VETERINÁRIA","DIREÇÃO DMSA","Pregão nº 138/2014 finalizado em 14/11/14. O processo está disponível na Seção de Sistema de Registro de Preços para solicitar empenhos."]
["04/2014",113,"002699/2014","Aquisição de material de expediente",300001,"RESTAURANTE UNIVERSITÁRIO - NOVA IGUAÇU","RESTAURANTE UNIVERSITÁRIO - NOVA IGUAÇU","DIREÇÃO DMSA","Verificando a possibilidade de atendimento juntamente com a demanda de 2015."]
["04/2014",445,"002699/2014","Aquisição de material de expediente",600000,"INSTITUTO DE CIÊNCIAS SOCIAIS APLICADAS","INSTITUTO DE CIÊNCIAS SOCIAIS APLICADAS","DIREÇÃO DMSA","Verificando a possibilidade de atendimento juntamente com a demanda de 2015."]
["04/2014",304,"002703/2014","Aquisição de material de artes gráficas e desenho",210000,"INSTITUTO DE AGRONOMIA","INSTITUTO DE AGRONOMIA","SSRP","Será atendido junto com a Demanda de 2015 - equipe do projeto"]
["04/2014",287,"002703/2014","Aquisição de material de artes gráficas e desenho",260200,"DEPARTAMENTO DE PRODUTOS FLORESTAIS","DEPARTAMENTO DE PRODUTOS FLORESTAIS","SSRP","Será atendido junto com a Demanda de 2015 - equipe do projeto"]
["04/2014",93,"001931/2014","Pagamento de anuidade de Associação Nacional de Pós-graduaçãoo em Ciências Sociais, referente à 2014",240000,"INSTITUTO DE CIÊNCIAS HUMANAS E SOCIAIS","PROGRAMA DE PÓS-GRADUAÇÃO EM CIÊNCIAS SOCIAIS","ARQUIVO","Arquivado porque  houve empenho (2014NE000447) e pagamento (2014OB808074)."]
["04/2014","S/Nº","002422/2014","Aquisição de frutas, legumes e verduras",130100,"RESTAURANTE UNIVERSITÁRIO - CAMPUS SEROPÉDICA","RESTAURANTE UNIVERSITÁRIO - CAMPUS SEROPÉDICA","PROAES","Pregão nº 71/2014 finalizado em 29/07/14. Já houve empenho (2014NE801281, 2014NE801282, 2014NE801283, 2014NE801284, 2014NE801285, 2014NE801511, 2014NE801512, 2014NE801513, 2014NE801514, 2014NE801515, 2014NE801516, 2014NE801517, 2014NE801518, 2014NE801519, 2014NE801520, 2014NE1908, 2014NE801909, 2014NE801910, 2014NE801911, 2014NE801912, 2014NE802220, 2014NE802221, 2014NE802222, 2014NE802223, 2014NE802224, 2014NE802260, 2014NE802261, 2014NE802338, 2014NE802339, 2014NE802340, 2014NE802341, 2014NE802619, 2014NE802633, 2014NE802640, 2014NE802642, 2014NE802644, 2014NE802646, 2014NE801286, 2014NE801287, 2014NE801288, 2014NE801289, 2014NE801290, 2014NE801291, 2014NE801292, 2014NE801522, 2014NE801523, 2014NE801524, 2014NE801525, 2014NE801526, 2014NE801527, 2014NE801528, 2014NE801529, 2014NE801913, 2014NE801914, 2014NE801915, 2014NE801916, 2014NE801917, 2014NE802225, 2014NE802226, 2014NE802227, 2014NE802228, 2014NE802229, 2014NE802262, 2014NE802336, 2014NE802337, 2014NE802342, 2014NE802635, 2014NE802638, 2015NE800292, 2015NE800293, 2015NE800294, 2015NE800295) e pagamento (2014OB808371, 2014OB808637, 2014OB000067, 2014OB808800, 2014OB000069, 2014OB808801, 2014OB809315, 2014OB809697, 2014OB809698, 2014OB809701, 2014OB809824, 2014OB809825, 2014OB809826, 2014OB809827, 2014OB809828, 2014OB809829, 2014OB809838, 2014OB806690, 2014OB806810, 2014OB807480, 2014OB807481, 2014OB808040, 2014OB808344, 2014OB809137, 2015OB800533 ). O processo está disponível na Pró-reitoria de Assuntos Estudantis para solicitar empenhos."]
["04/2014","S/Nº","006046/2014","Aquisição de itens do grupo 30.11 - Material químico (demais setores)",280400,"DEPARTAMENTO DE PARASITOLOGIA ANIMAL","DEPARTAMENTO DE PARASITOLOGIA ANIMAL","CADMIN","Buscando informações."]
["04/2014","S/Nº","001126/2014","Aquisição de transformador trifásico, potência de 300 kva, para tensão primária (superior) a 13.2kv e outros",230000,"INSTITUTO DE CIÊNCIAS EXATAS","INSTITUTO DE CIÊNCIAS EXATAS","ALMOXARIFADO","Já houve empenho (2014NE800282), pagamentos (2014OB804890 e 2014DF801465) e foi entregue no Almoxarifado em 08/04/14.\nJá houve empenho (2014NE800283), pagamento (2014OB802664) e foi entregue no Almoxarifado em 29/04/14."]
["04/2014","S/Nº","001591/2014","Aquisição de semem do reprodutor gir leiteiro casper te kubera, código 11gl070 e outros",100500,"COORDENADORIA DE DESENVOLVIMENTO DA PRODUÇÃO","COORDENADORIA ESPECIAL DE PROD. INTEGRADA ENSINO, PESQ. EXT.","CLOG","Já houve empenho (2014NE800709), pagamentos (2014OB804696 e 2014DF801420) e foi entregue no Almoxarifado em 16/06/14."]
["04/2014",389,"002699/2014","Aquisição de material de expediente",170000,"CAIC","CAIC","DIREÇÃO DMSA","Verificando a possibilidade de atendimento juntamente com a demanda de 2015."]
["04/2014",269,"002707/2014","Aquisição de artigos de copa e cozinha",120200,"DEPARTAMENTO DE MATERIAL E SERVIÇOS AUXILIARES","DEPARTAMENTO DE MATERIAL E SERVIÇOS AUXILIARES","SPP","Verificando a possibilidade de atendimento juntamente com a demanda de 2015."]
["04/2014",252,"002707/2014","Aquisição de artigos de copa e cozinha",120400,"LAVANDERIA","LAVANDERIA","SPP","Verificando a possibilidade de atendimento juntamente com a demanda de 2015."]
["04/2014",225,"002707/2014","Aquisição de artigos de copa e cozinha",140000,"PRÓ-REITORIA DE ENSINO E GRADUAÇÃO","PRÓ-REITORIA DE ENSINO E GRADUAÇÃO","SPP","Verificando a possibilidade de atendimento juntamente com a demanda de 2015."]
["04/2014",241,"002707/2014","Aquisição de artigos de copa e cozinha",140120,"ENGENHARIA FLORESTAL","ENGENHARIA FLORESTAL","SPP","Verificando a possibilidade de atendimento juntamente com a demanda de 2015."]
["04/2014",181,"002707/2014","Aquisição de artigos de copa e cozinha",230100,"DEPARTAMENTO DE FÍSICA","DEPARTAMENTO DE FÍSICA","SPP","Verificando a possibilidade de atendimento juntamente com a demanda de 2015."]
["04/2014",119,"002707/2014","Aquisição de artigos de copa e cozinha",240000,"INSTITUTO DE CIÊNCIAS HUMANAS E SOCIAIS","INSTITUTO DE CIÊNCIAS HUMANAS E SOCIAIS","SPP","Verificando a possibilidade de atendimento juntamente com a demanda de 2015."]
["04/2014",153,"002707/2014","Aquisição de artigos de copa e cozinha",250000,"INSTITUTO DE EDUCAÇÃO","INSTITUTO DE EDUCAÇÃO","SPP","Verificando a possibilidade de atendimento juntamente com a demanda de 2015."]
["04/2014",313,"002707/2014","Aquisição de artigos de copa e cozinha",260000,"INSTITUTO DE FLORESTAS","INSTITUTO DE FLORESTAS","SPP","Verificando a possibilidade de atendimento juntamente com a demanda de 2015."]
["04/2014",486,"002707/2014","Aquisição de artigos de copa e cozinha",400000,"CAMPUS DA UFRRJ EM TRÊS RIOS","CAMPUS DA UFRRJ EM TRÊS RIOS","SPP","Verificando a possibilidade de atendimento juntamente com a demanda de 2015."]
["04/2014",1952,"010294/2014","Aquisição de poltrona de auditório, encosto médio e com posicionamento em 3 posições e outros (carona)",400000,"CAMPUS DA UFRRJ EM TRÊS RIOS","CAMPUS DA UFRRJ EM TRÊS RIOS","SEC.  ADM. DO DECANATO DE ASSUNTOS FINANCEIROS","Já houve empenho (2014NE802271, 2014NE802272, 2014NE802273) , encaminhado para o almoxarifado para envio da Nota de empenho."]
["04/2014",930,"005733/2014","Aquisição de licença definitiva para uso do pacote Microsoft Office compatível com sistema operacional Windows 8",100600,"COORDENADORIA DE PLANEJAMENTO","COORDENADORIA DE PLANEJAMENTO","PRÓ-REITORIA DE PLANEJAMENTO, AVALIAÇÃO E DESENVOLVIMENTO","Buscando informações."]
["04/2014",1965,"010486/2014","Aquisição de memória portátil e outros",500030,"PROGRAMA INGLÊS SEM FRONTEIRAS","PROGRAMA INGLÊS SEM FRONTEIRAS","CLOG","Já houve empenho (2014NE802321) e foi entregue no Almoxarifado em 13/01/15."]
["04/2014",1058,"003666/2014","Aquisição de cartuchos de tinta",150600,"PROEXT - APOIO À PRÁTICAS TRADICIONAIS NO USO DE PLANTAS MEDICINAIS","PROGRAMA PROEXT MEC 2014","SPP","Pesquisa de preço."]
["04/2014",1928,"010107/2014","Contratação de empresa especializada na prestação de serviços continuados de asseio e conservação, com fornecimento",400000,"CAMPUS DA UFRRJ EM TRÊS RIOS","CAMPUS DA UFRRJ EM TRÊS RIOS","SPP","Pesquisa de preço."]
["87/2014",857,"004526/2014","Fornecimento e instalação de 9 persianas verticais",150000,"PRÓ-REITORIA DE EXTENSÃO","DEPARTAMENTO DE LOGÍSTICA E INFRAESTRUTURA","PRO-REITORIA DE ASSUNTOS FINANCEIROS","Pregão nº 49/2014 finalizado em 07/11/14. Analisando as insconsistências apontadas pela gestora do contrato (quantitativo e especificações do contrato) para tentar saná-las e em breve o processo será encaminhado à Direação do DMSA. (Anexado ao 5649/2013-72)"]
["02/2014",79,"006056/2014","Aquisição de material de artes gráficas, desenho e expediente (grupos 30.16 e 30.16B)",160112,"PROAP - ZOOTECNIA","PROGRAMA DE PÓS-GRADUAÇÃO EM ZOOTECNIA","SSRP","Verificando a possibilidade de atendimento juntamente com a demanda de 2015."]
["02/2014",138,"006056/2014","Aquisição de material de artes gráficas, desenho e expediente (grupos 30.16 e 30.16B)",160117,"PROAP - MULTICÊNTRICO EM CIÊNCIAS FISIOLÓGICAS","INSTITUTO DE BIOLOGIA","SSRP","Verificando a possibilidade de atendimento juntamente com a demanda de 2015."]
["02/2014",203,"006018/2014","Aquisição de equipamentos para laboratório (grupo 52.08)",220300,"DEPARTAMENTO DE CIÊNCIAS FISIOLÓGICAS","DEPARTAMENTO DE CIÊNCIAS FISIOLÓGICAS","DIREÇÃO DMSA","Buscando informações."]
["02/2014",212,"006056/2014","Aquisição de material de artes gráficas, desenho e expediente (grupos 30.16 e 30.16B)",160119,"PROAP - PSICOLOGIA","PROGRAMA DE PÓS-GRADUAÇÃO EM PSICOLOGIA","SSRP","Verificando a possibilidade de atendimento juntamente com a demanda de 2015."]
["02/2014",224,"006056/2014","Aquisição de material de artes gráficas, desenho e expediente (grupos 30.16 e 30.16B)",160102,"PROAP - CIÊNCIAS AMBIENTAIS E FLORESTAIS","PROGRAMA DE PÓS-GRADUAÇÃO EM CIÊNCIAS AMBIENTAIS E FLORESTAIS","SSRP","Verificando a possibilidade de atendimento juntamente com a demanda de 2015."]
["02/2014",432,"003145/2014","Aquisição de gás liquefeito de petróleo",130100,"RESTAURANTE UNIVERSITÁRIO - CAMPUS SEROPÉDICA","RESTAURANTE UNIVERSITÁRIO - CAMPUS SEROPÉDICA","SEC. ADM. DO DEPTO DE CONTABILIDADE E FINANÇAS","Pregão nº 94/2014 finalizado em 06/11/14. O processo está disponível na Pró-reitoria de Assuntos Estudantis para solicitar empenhos."]
["02/2014",1080,"006058/2014","Conserto de câmaras de germinação",160106,"PROAP - FITOTECNIA","INSTITUTO DE AGRONOMIA - PROGRAMA DE PÓS-GRADUAÇÃO EM FITOTECNIA","SAPG","O empenho já foi emitido (2014NE802290) e transmitido à empresa. A prestação do serviço já pode ser iniciada (20 dias para execução)."]
["02/2014",1294,"006000/2014","Pagamento de inscrição da Profª. Katia Cilene Tabai no XXIII Congresso Brasileiro de Nutrição",600000,"INSTITUTO DE CIÊNCIAS SOCIAIS APLICADAS","ICSA - DEDH","SETOR DE COBRANÇA","Já houve empenho (2014NE801382), mas o pagamento ainda não foi efetuado."]
["02/2014",239,"002704/2014","Aquisição de material de expediente (papel A4, carta, ofício, etc)",140120,"ENGENHARIA FLORESTAL","COORDENAÇÃO DO CURSO DE ENGENHARIA FLORESTAL","CPACS","Consolidar Pesquisas de Preços"]
["02/2014",70,"002704/2014","Aquisição de material de expediente (papel A4, carta, ofício, etc)",220410,"LABORATÓRIO OFICIAL DE DIAGNÓSTICO FITOSSANITÁRIO","LABORATÓRIO OFICIAL DE DIAGNÓSTICO FITOSSANITÁRIO","CPACS","Consolidar Pesquisas de Preços"]
["02/2014",152,"002699/2014","Aquisição de material de expediente",230100,"DEPARTAMENTO DE FÍSICA","DEPARTAMENTO DE FÍSICA","DIREÇÃO DMSA","Verificando a possibilidade de atendimento juntamente com a demanda de 2015."]
["02/2014",315,"002704/2014","Aquisição de material de expediente (papel A4, carta, ofício, etc)",260000,"INSTITUTO DE FLORESTAS","PPGPDS - PROGRAMA DE PÓS-GRADUAÇÃO EM DESENVOLVIMENTO SUSTENTÁVEL","CPACS","Consolidar Pesquisas de Preços"]
["02/2014",210,"002704/2014","Aquisição de material de expediente (papel A4, carta, ofício, etc)",270000,"INSTITUTO DE TECNOLOGIA","DIRETORIA","CPACS","Consolidar Pesquisas de Preços"]
["02/2014",173,"002704/2014","Aquisição de material de expediente (papel A4, carta, ofício, etc)",300000,"CAMPUS DA UFRRJ EM NOVA IGUAÇU","SUPERINTÊNDENCIA DO CAMPUS NOVA IGUAÇU","CPACS","Consolidar Pesquisas de Preços"]
["02/2014",227,"002706/2014","Aquisição de artigos de higiene e conservação",140000,"PRÓ-REITORIA DE ENSINO E GRADUAÇÃO","PROGRAD/DEST/PAT","SPP","Verificando a possibilidade de atendimento juntamente com a demanda de 2015."]
["02/2014",310,"002706/2014","Aquisição de artigos de higiene e conservação",210000,"INSTITUTO DE AGRONOMIA","SECRETARIA ADMINISTRATIVA DO INSTITUTO","SPP","Verificando a possibilidade de atendimento juntamente com a demanda de 2015."]
["02/2014",426,"002706/2014","Aquisição de artigos de higiene e conservação",270000,"INSTITUTO DE TECNOLOGIA","DEPARTAMENTO DE ARQUITETURA E URBANISMO","SPP","Verificando a possibilidade de atendimento juntamente com a demanda de 2015."]
["02/2014",942,"004446/2014","Revisão de antenas de comunicação instaladas no interior do Campus da UFRRJ",100060,"DIVISÃO DE GUARDA E VIGILÂNCIA","DIVISÃO DE GUARDA E VIGILÂNCIA","ARQUIVO","Arquivado porque houve empenho e pagamento."]
["02/2014",62,"004379/2014","Aquisição de rack 8u",280400,"DEPARTAMENTO DE PARASITOLOGIA ANIMAL","DEPARTAMENTO DE PARASITOLOGIA ANIMAL","SEÇÃO DE CONTROLE","Já houve empenho (2014NE802005) e foi entregue no Almoxarifado em 05/11/14."]
["02/2014",110,"002087/2014","Aquisição de gêneros alimentícios - amendoim, arroz, café (grupo 30.07)",300001,"RESTAURANTE UNIVERSITÁRIO - NOVA IGUAÇU","RESTAURANTE UNIVERSITÁRIO - NOVA IGUAÇU","RESTAURANTE UNIVERSITÁRIO DO CAMPUS DE NOVA IGUAÇU","Pregão nº 104/2014 finalizado em 09/10/14. O processo está disponível no Restaurante Universitário do Campus de Nova Iguaçu para solicitar empenhos."]
["02/2014",1339,"006398/2014","Contratação de serviço de manutenção de sistema de segurança eletrônico",120200,"DEPARTAMENTO DE MATERIAL E SERVIÇOS AUXILIARES","ALMOXARIFADO CENTRAL","DIVISÃO DE ADMINISTRAÇÃO FINANCEIRA","Já houve empenho (2014NE801962) e a previsão de início da prestação do serviço é até 06/02/15."]
["02/2014",215,"003204/2014","Aquisição de gêneros alimentícios",270400,"DEPARTAMENTO DE TECNOLOGIA DE ALIMENTOS","DEPARTAMENTO DE TECNOLOGIA DE ALIMENTOS","DIREÇÃO DMSA","Pregão nº 14/2015 (antigo nº 117/2014) iniciado em 02/02/15."]
["02/2014",386,"003205/2014","Aquisição de gêneros alimentícios",170000,"CAIC","CAIC","CAIC","Pregão nº 135/2014 finalizado em 01/12/14. O processo está disponível no CAIC para solicitar empenhos. "]
["02/2014",363,"002701/2014","Aquisição de café, açúcar, coador e adoçante",100200,"IMPRENSA UNIVERSITÁRIA","IMPRENSA UNIVERSITÁRIA","CLOG","Pregão nº 88/2014 finalizado em 03/11/14. Já houve empenho (2014NE802417, 2015NE800302) e pagamento (2015OB800319). O processo está disponível na Seção de Sistema de Registro de Preços para solicitar empenhos."]
["02/2014",267,"002701/2014","Aquisição de café, açúcar, coador e adoçante",120200,"DEPARTAMENTO DE MATERIAL E SERVIÇOS AUXILIARES","DEPARTAMENTO DE MATERIAL E SERVIÇOS AUXILIARES","CLOG","Pregão nº 88/2014 finalizado em 03/11/14. Já houve empenho (2014NE802417, 2015NE800302) e pagamento (2015OB800319). O processo está disponível na Seção de Sistema de Registro de Preços para solicitar empenhos."]
["02/2014",344,"002701/2014","Aquisição de café, açúcar, coador e adoçante",160000,"PRÓ-REITORIA DE PESQUISA E PÓS GRADUAÇÃO","PRÓ-REITORIA DE PESQUISA E PÓS GRADUAÇÃO","CLOG","Pregão nº 88/2014 finalizado em 03/11/14. Já houve empenho (2014NE802417, 2015NE800302) e pagamento (2015OB800319). O processo está disponível na Seção de Sistema de Registro de Preços para solicitar empenhos."]
["02/2014",277,"002701/2014","Aquisição de café, açúcar, coador e adoçante",180000,"CTUR","CTUR","CLOG","Pregão nº 88/2014 finalizado em 03/11/14. Já houve empenho (2014NE802417, 2015NE800302) e pagamento (2015OB800319). O processo está disponível na Seção de Sistema de Registro de Preços para solicitar empenhos."]
["02/2014",244,"002701/2014","Aquisição de café, açúcar, coador e adoçante",190000,"CAMPUS DR. LEONEL MIRANDA","CAMPUS DR. LEONEL MIRANDA","CLOG","Pregão nº 88/2014 finalizado em 03/11/14. Já houve empenho (2014NE802417, 2015NE800302) e pagamento (2015OB800319). O processo está disponível na Seção de Sistema de Registro de Preços para solicitar empenhos."]
["02/2014",285,"002701/2014","Aquisição de café, açúcar, coador e adoçante",260200,"DEPARTAMENTO DE PRODUTOS FLORESTAIS","DEPARTAMENTO DE PRODUTOS FLORESTAIS","CLOG","Pregão nº 88/2014 finalizado em 03/11/14. Já houve empenho (2014NE802417, 2015NE800302) e pagamento (2015OB800319). O processo está disponível na Seção de Sistema de Registro de Preços para solicitar empenhos."]
["02/2014",165,"002701/2014","Aquisição de café, açúcar, coador e adoçante",290000,"INSTITUTO DE ZOOTECNIA","INSTITUTO DE ZOOTECNIA","CLOG","Pregão nº 88/2014 finalizado em 03/11/14. Já houve empenho (2014NE802417, 2015NE800302) e pagamento (2015OB800319). O processo está disponível na Seção de Sistema de Registro de Preços para solicitar empenhos."]
["02/2014",444,"002701/2014","Aquisição de café, açúcar, coador e adoçante",600000,"INSTITUTO DE CIÊNCIAS SOCIAIS APLICADAS","INSTITUTO DE CIÊNCIAS SOCIAIS APLICADAS","CLOG","Pregão nº 88/2014 finalizado em 03/11/14. Já houve empenho (2014NE802417, 2015NE800302) e pagamento (2015OB800319). O processo está disponível na Seção de Sistema de Registro de Preços para solicitar empenhos."]
["02/2014",500,"003182/2014","Aquisição de medicamentos de uso humano",280010,"HOSPITAL VETERINÁRIO","HOSPITAL VETERINÁRIO","SPP","Pesquisa de preço."]
["02/2014",374,"002699/2014","Aquisição de material de expediente",100100,"BIBLIOTECA CENTRAL","BIBLIOTECA CENTRAL","DIREÇÃO DMSA","Verificando a possibilidade de atendimento juntamente com a demanda de 2015."]
["02/2014",254,"002699/2014","Aquisição de material de expediente",120400,"LAVANDERIA","LAVANDERIA","DIREÇÃO DMSA","Verificando a possibilidade de atendimento juntamente com a demanda de 2015."]
["02/2014",115,"002699/2014","Aquisição de material de expediente",240000,"INSTITUTO DE CIÊNCIAS HUMANAS E SOCIAIS","INSTITUTO DE CIÊNCIAS HUMANAS E SOCIAIS","DIREÇÃO DMSA","Verificando a possibilidade de atendimento juntamente com a demanda de 2015."]
["02/2014",151,"002699/2014","Aquisição de material de expediente",250000,"INSTITUTO DE EDUCAÇÃO","INSTITUTO DE EDUCAÇÃO","DIREÇÃO DMSA","Verificando a possibilidade de atendimento juntamente com a demanda de 2015."]
["02/2014",103,"002699/2014","Aquisição de material de expediente",280300,"DEPTO DE MICROBIOLOGIA E IMUNOLOGIA VETERINÁRIA","DEPTO DE MICROBIOLOGIA E IMUNOLOGIA VETERINÁRIA","DIREÇÃO DMSA","Verificando a possibilidade de atendimento juntamente com a demanda de 2015."]
["02/2014",484,"002699/2014","Aquisição de material de expediente",400000,"CAMPUS DA UFRRJ EM TRÊS RIOS","CAMPUS DA UFRRJ EM TRÊS RIOS","DIREÇÃO DMSA","Verificando a possibilidade de atendimento juntamente com a demanda de 2015."]
["02/2014",356,"002703/2014","Aquisição de material de artes gráficas e desenho",130000,"PRÓ-REITORIA DE ASSUNTOS ESTUDANTIS","PRÓ-REITORIA DE ASSUNTOS ESTUDANTIS","SSRP","Será atendido junto com a Demanda de 2015 - equipe do projeto"]
["02/2014",121,"002703/2014","Aquisição de material de artes gráficas e desenho",220100,"DEPARTAMENTO DE BIOLOGIA ANIMAL","DEPARTAMENTO DE BIOLOGIA ANIMAL","SSRP","Será atendido junto com a Demanda de 2015 - equipe do projeto"]
["02/2014",317,"002703/2014","Aquisição de material de artes gráficas e desenho",250020,"LICENCIATURA EM EDUCAÇÃO DO CAMPO - PROCAMPO","LICENCIATURA EM EDUCAÇÃO DO CAMPO - PROCAMPO","SSRP","Será atendido junto com a Demanda de 2015 - equipe do projeto"]
["02/2014",309,"003830/2014","Instalação e fornecimento de dois mil metros de mangueira tipo lâmpada led de alto brilho",100300,"PREFEITURA UNIVERSITÁRIA","PREFEITURA","REITORIA","Pregão nº 154/2014 finalizado em 24/11/14. Houve empenho (2014NE802433) e pagamento (2014OB809865). "]
["02/2014","S/Nº","005729/2014","Aquisição de licenciamento de uso de software arcgls for desktop concurrent e outros",400000,"CAMPUS DA UFRRJ EM TRÊS RIOS","CAMPUS DA UFRRJ EM TRÊS RIOS","COINFO","Buscando informações."]
["02/2014","S/Nº","006046/2014","Aquisição de itens do grupo 30.11 - Material químico (demais setores)",120100,"DEPARTAMENTO DE CONTABILIDADE E FINANÇAS","DEPARTAMENTO DE CONTABILIDADE E FINANÇAS","CADMIN","Buscando informações."]
["02/2014","S/Nº","005199/2014","Aquisição de mídia cartão de memória, pen drive, dimensões 59.7mm x 22.3mm x 9.5 mm",250020,"LICENCIATURA EM EDUCAÇÃO DO CAMPO - PROCAMPO","LICENCIATURA EM EDUCAÇÃO DO CAMPO - PROCAMPO","ARQUIVO","Arquivado porque o material foi atendido através do processo 002078/2014."]
["02/2014","S/Nº","003661/2014","Aquisição de botijão de gás",100500,"COORDENADORIA DE DESENVOLVIMENTO DA PRODUÇÃO","COORDENADORIA DE DESENVOLVIMENTO DA PRODUÇÃO","ANEXADO    23083.002205/2013-85","Já houve empenho (2014NE800853), pagamento (2014OB804976 e 2014DF801476) e foi entregue no Almoxarifado em 24/06/14.\nJá houve empenho (2013NE802827), pagamento (2014OB800670 e 2014DF800308) e foi entregue no Almoxarifado em 26/12/13. (Anexado ao 002205/2013)"]
["02/2014","S/Nº","002445/2014","Contrataçao de empresa para efetuar publicações de avisos de editais de licitação (publicaçao no Jornal O Dia)",120200,"DEPARTAMENTO DE MATERIAL E SERVIÇOS AUXILIARES","DEPARTAMENTO DE MATERIAL E SERVIÇOS AUXILIARES","ARQUIVO","Arquivado porque  houve empenho (2014NE800481) e pagamentos (2014OB802341, 2014OB803274, 2014OB804979 e 2014OB805941)."]
["02/2014","S/Nº","002050/2014","Solicitação de licitação do restautante e lanchonete do ICHS",120000,"PRÓ-REITORIA DE ASSUNTOS FINANCEIROS","PRÓ-REITORIA DE ASSUNTOS FINANCEIROS","SEC. ADM. DO DECANATO DE ASSUNTOS FINANCEIROS","Emissão de parecer técnico."]
["02/2014","S/Nº","003804/2014","Aquisição de materiais elétrico e eletrônico",120200,"DEPARTAMENTO DE MATERIAL E SERVIÇOS AUXILIARES","DEPARTAMENTO DE MATERIAL E SERVIÇOS AUXILIARES","DIREÇÃO DMSA","O processo foi encaminhado da SSRP à SAPG para abrir anexo em 03/09/14 e desde então não retornou."]
["02/2014","S/Nº","002261/2014","Renovação da revista Licicon e contratação dos serviços de consultoria em licitações e contratos administrativos",120200,"DEPARTAMENTO DE MATERIAL E SERVIÇOS AUXILIARES","DEPARTAMENTO DE MATERIAL E SERVIÇOS AUXILIARES","SCD","Buscando informações."]
["02/2014",194,"002699/2014","Aquisição de material de expediente",280200,"DEPARTAMENTO DE MEDICINA E CIRURGIA VETERINÁRIA","DEPARTAMENTO DE MEDICINA E CIRURGIA VETERINÁRIA","DIREÇÃO DMSA","Verificando a possibilidade de atendimento juntamente com a demanda de 2015."]
["02/2014",348,"002707/2014","Aquisição de artigos de copa e cozinha",100300,"PREFEITURA UNIVERSITÁRIA","PREFEITURA","SPP","Verificando a possibilidade de atendimento juntamente com a demanda de 2015."]
["02/2014",367,"002707/2014","Aquisição de artigos de copa e cozinha",280400,"DEPARTAMENTO DE PARASITOLOGIA ANIMAL","DEPARTAMENTO DE PARASITOLOGIA ANIMAL","SPP","Verificando a possibilidade de atendimento juntamente com a demanda de 2015."]
["02/2014",963,"006355/2014","Aquisição dos itens do grupo 52.33 - Equipamentos eletro-eletrônicos",150080,"PROEXT - MÃOS QUE CRIAM - PROJETO DE CAPACITAÇÃO PARA PROMOÇÃO SOCIAL","PRÓ-REITORIA DE EXTENSÃO - PROJETO \"MÃOS QUE CRIAM\"","CLOG","Já houve empenho (2014NE801883), pagamento (2014OB808794) e foi entregue no Almoxarifado em 05/11/14.\nJá houve empenho (2014NE801882), pagamento (2014OB808736) e foi entregue no Almoxarifado em 04/11/14."]
["02/2014",963,"006353/2014","Aquisição de agulha, tipo agulha hipodérmica, tamanho 13 x 4,5, material corpo em aco inox e etc",160107,"PROAP - MEDICINA VETERINÁRIA","PROGRAMA DE PÓS-GRADUAÇÃO EM MEDICINA VETERINÁRIA","DIREÇÃO DMSA","Aguardando avaliação da Direção após pesquisa de preços."]
["02/2014",1935,"010080/2014","Aquisição de cadeira de encosto baixo, com l duplo em tubo 7/8, sem regulagem e outros",220200,"DEPARTAMENTO DE BOTÂNICA","DEPARTAMENTO DE BOTÂNICA","DIREÇÃO DMSA","Buscando informações."]
["02/2014",754,"003666/2014","Aquisição de cartuchos de tinta",150070,"PROEXT - OBSERVATÓRIO DE POLÍTICAS DEMOCRÁTICAS DE ACESSO E PERMANÊNCIA NA EDUCAÇÃO SUPERIOR","PROEXT - OBSERVATÓRIO DE POLÍTICAS DEMOCRÁTICAS DE ACESSO E PERMANÊNCIA NA EDUCAÇÃO SUPERIOR","SPP","Pesquisa de preço."]
["02/2014",1849,"009341/2014","Locação de espaço de hotel (2 dias) para realização do V Seminário de Avaliação do PPGEDUC",250000,"INSTITUTO DE EDUCAÇÃO","INSTITUTO DE EDUCAÇÃO","SAPG","Houve empenho (2014NE802438) e pagamento (2015OB800259)."]
["02/2014",1737,"008354/2014","Solicitação de transporte rodoviário com 44 lugares",180000,"CTUR","CTUR","ARQUIVO","Arquivado porque o pedido será atendido através do processo 008337/2012."]
["02/2014",440,"003657/2014","Material de expediente - Aquisição de alfinete mapa, material aço, material cabeça plástico, formato redondo, etc (grupo 30.16)",150000,"PRÓ-REITORIA DE EXTENSÃO","PRÓ-REITORIA DE EXTENSÃO","CPACS","Equipe CPACS está verificando a possibilidade de juntar os processos 003657, 006343, 002699, 002704, 006056."]
["07/2014",416,"002707/2014","Aquisição de artigos de copa e cozinha",300000,"CAMPUS DA UFRRJ EM NOVA IGUAÇU","CAMPUS DA UFRRJ EM NOVA IGUAÇU","SPP","Verificando a possibilidade de atendimento juntamente com a demanda de 2015."]
["07/2014",416,"006022/2014","Aquisição de equipamentos eletro-eletrônicos (grupo 52.33)",300000,"CAMPUS DA UFRRJ EM NOVA IGUAÇU","SUPERINTENDÊNCIA DO CAMPUS","SPP","Pesquisa de preço."]
["07/2014",1044,"006016/2014","Aquisição de cartuchos hp, toners e tintas (grupo 30.17A)",250000,"INSTITUTO DE EDUCAÇÃO","DIREÇÃO","DMSA","Buscando informações."]
["07/2014",1110,"005968/2014","Aquisição de mobiliário em geral (grupo 52.42)",210000,"INSTITUTO DE AGRONOMIA","DIRETORIA","DIREÇÃO DMSA","Verificando a possibilidade de atendimento juntamente com a demanda de 2015."]
["07/2014",177,"002704/2014","Aquisição de material de expediente (papel A4, carta, ofício, etc)",220300,"DEPARTAMENTO DE CIÊNCIAS FISIOLÓGICAS","SECRETARIA","CPACS","Consolidar Pesquisas de Preços"]
["07/2014",358,"002706/2014","Aquisição de artigos de higiene e conservação",210200,"DEPARTAMENTO DE GEOCIÊNCIAS","DEPARTAMENTO DE GEOCIÊNCIAS","SPP","Verificando a possibilidade de atendimento juntamente com a demanda de 2015."]
["07/2014",290,"002706/2014","Aquisição de artigos de higiene e conservação",260200,"DEPARTAMENTO DE PRODUTOS FLORESTAIS","DEPARTAMENTO DE PRODUTOS FLORESTAIS","SPP","Verificando a possibilidade de atendimento juntamente com a demanda de 2015."]
["07/2014",1370,"006592/2014","Pagamento de inscrição dos servidores Reginal Zão e André Levino no curso de Retenções de tributos pelos órgãos e entidades da administração pública",10310,"CAPACITAÇÃO DE SERVIDORES - RECURSOS ESPECÍFICOS","DEPARTAMENTO DE CONTABILIDADE E FINANÇAS","ARQUIVO","Desarquivado pela CODEP para realizar o relatório anual de cursos  do Governo Federal e em breve será novamente arquivado.\nArquivado porque  houve empenho (2014NE801687) e pagamento (2014GR800108)."]
["07/2014",932,"005204/2014","Aquisição de artigos cirúrgicos e de enfermaria (somente para o Hospital Veterinário (grupo 30.36)",280010,"HOSPITAL VETERINÁRIO","HOSPITAL VETERINÁRIO","SPP","Pesquisa de preço."]
["07/2014",1269,"005735/2014","Aquisição de equipamentos industriais - banho Maria, moinho, máquina de costura, fogão, liquidificador e seladora (grupo 52.28)",150600,"PROEXT - APOIO À PRÁTICAS TRADICIONAIS NO USO DE PLANTAS MEDICINAIS","Projeto PROEXT-MEC 2014","ASSESSORIA TECNICA/DMSA","Pesquisa de preço."]
["07/2014",955,"006390/2014","Aquisição de material químico sujeito à controle governamental (grupo 30.11A)",220410,"LABORATÓRIO OFICIAL DE DIAGNÓSTICO FITOSSANITÁRIO","LABORATÓRIO OFICIAL DE DIAGNÓSTICO FITOSSANITÁRIO","ASSESSORIA TECNICA/DMSA","Realizando ajustes na minuta de edital após solicitação de aumento do quantitativo e reenquadramento como SRP, realizadas pelo Pró-reitora de Assuntos Financeiros."]
["07/2014",1486,"007514/2014","Contratação de serviço de coffee break ",140530,"DOCÊNCIA NA EDUCAÇÃO INFANTIL","CURSO DE PÓS-GRADUAÇÃO \"DOCÊNCIA NA EDUCAÇÃO INFANTIL\"","ARQUIVO","Arquivado porque  houve empenho (2014NE801963 e 2014NE801964) e pagamento (2014OB808318 e 2014OB808318)."]
["07/2014",369,"002700/2014","Aquisição de gás liquefeito de petróleo",100100,"BIBLIOTECA CENTRAL","BIBLIOTECA CENTRAL","DIREÇÃO DMSA","Pregão nº 138/2014 finalizado em 14/11/14. O processo está disponível na Seção de Sistema de Registro de Preços para solicitar empenhos."]
["07/2014",146,"002699/2014","Aquisição de material de expediente",260000,"INSTITUTO DE FLORESTAS","INSTITUTO DE FLORESTAS","DIREÇÃO DMSA","Verificando a possibilidade de atendimento juntamente com a demanda de 2015."]
["07/2014",161,"002392/2014","Aquisição de gêneros alimentícios - Queijo minas frescal (grupo 30.07)",300001,"RESTAURANTE UNIVERSITÁRIO - NOVA IGUAÇU","RESTAURANTE UNIVERSITÁRIO - NOVA IGUAÇU","RESTAURANTE UNIVERSITÁRIO DO CAMPUS DE NOVA IGUAÇU","Pregão nº 73/2014 finalizado em 16/09/14. O processo está disponível no Restaurante Universitário do Instituto Multidisciplinar para solicitar empenhos."]
["07/2014",1283,"006502/2014","Aquisição de sistema de concentração de amostras",160001,"PRÓ - EQUIPAMENTOS","PROPPG","CLOG","Já houve empenho (2014NE802213) e a data prevista de entrega é até 09/03/15. "]
["07/2014",1911,"009727/2014","Pagamento de inscrição  do servidor Sandro Luis Freire no XIV Coloquio Internacional de Gestão Universitária",100400,"COORDENADORIA DE INFORMÁTICA","COTIC","SAPG","Houve empenho (2014NE802154) e pagamento (2014OB809507 e 2014DF802346)."]
["07/2014",1938,"010415/2014","Aquisição de cartuchos",140020,"PARFOR","PARFOR","CLOG","Já houve empenho (2014NE802307) e a data prevista de entrega é até 04/01/15. "]
["07/2014",1938,"010416/2014","Aquisição de cartucho",140020,"PARFOR","PARFOR","CLOG","Já houve empenho (2014NE802280) e foi entregue no Almoxarifado em 16/12/14."]
["07/2014",1802,"009047/2014","Aquisição de gás hélio comprimido",160110,"PROAP - QUÍMICA","PROGRAMA DE PÓS-GRADUAÇÃO EM QUÍMICA","COORD. DO CURSO DE POS-GRADUAÇÃO EM QUÍMICA ORGÂNICA","Já houve empenho (2014NE802308), mas o prazo de entrega está vencido e um ofício de cobrança foi emitido à empresa em 06/02/15."]
["07/2014","S/Nº","002705/2014","Aquisição de medicamentos de uso veterinário",220300,"DEPARTAMENTO DE CIÊNCIAS FISIOLÓGICAS","DEPARTAMENTO DE CIÊNCIAS FISIOLÓGICAS","SPP","Realizando ajustes após emissão de parecer jurídico."]
["07/2014","S/Nº","002108/2014","Contratação de serviço de alimentação - almoço e jantar, na forma de quentinhas, durante 90 dias",130100,"RESTAURANTE UNIVERSITÁRIO - CAMPUS SEROPÉDICA","RESTAURANTE UNIVERSITÁRIO - CAMPUS SEROPÉDICA","PROAES","Já houve empenho (2014NE800549), anulação parcial do empenho (2014NE801070) e pagamentos (2014OB803910, 2014OB803530, 2014OB803133, 2014OB802778, 2014OB804203 e 2014OB802607)."]
["07/2014","S/Nº","002243/2014","Aquisição de álcool etílico hidratado combustivel e outros",100300,"PREFEITURA UNIVERSITÁRIA","PREFEITURA UNIVERSITÁRIA","ARQUIVO","Buscando informações."]
["07/2014","S/Nº","004486/2014","Fornecimento e instalação de cabo óptico multimodo,etc",270000,"INSTITUTO DE TECNOLOGIA","INSTITUTO DE TECNOLOGIA","COINFO","Buscando informações."]
["07/2014",421,"002707/2014","Aquisição de artigos de copa e cozinha",110200,"SEÇÃO DE ARQUIVO E PROTOCOLO GERAL","SEÇÃO DE ARQUIVO E PROTOCOLO GERAL","SPP","Verificando a possibilidade de atendimento juntamente com a demanda de 2015."]
["07/2014",392,"002707/2014","Aquisição de artigos de copa e cozinha",170000,"CAIC","CAIC","SPP","Verificando a possibilidade de atendimento juntamente com a demanda de 2015."]
["07/2014",299,"002707/2014","Aquisição de artigos de copa e cozinha",180000,"CTUR","CTUR","SPP","Verificando a possibilidade de atendimento juntamente com a demanda de 2015."]
["07/2014",170,"002707/2014","Aquisição de artigos de copa e cozinha",290000,"INSTITUTO DE ZOOTECNIA","INSTITUTO DE ZOOTECNIA","SPP","Verificando a possibilidade de atendimento juntamente com a demanda de 2015."]
["07/2014",1149,"006359/2014","Aquisição dos itens do grupo 52.40 - Equipamento agrícola (arado, etc)",150080,"PROEXT - MÃOS QUE CRIAM - PROJETO DE CAPACITAÇÃO PARA PROMOÇÃO SOCIAL","PRÓ-REITORIA DE EXTENSÃO - PROJETO \"MÃOS QUE CRIAM\"","CLOG","(vazio)"]
["07/2014",1219,"006358/2014","Aquisição dos itens do grupo 30.35 - Material de laboratório (frascos, etc)",160105,"PROAP - ENGENHARIA QUÍMICA","PROGRAMA DE PÓS-GRADUAÇÃO EM ENGENHARIA QUÍMICA","DIREÇÃO DMSA","Aguardando avaliação da Direção após pesquisa de preços."]
["07/2014",1219,"008809/2014","Aquisição de materiais dos itens 18, 19, 21 e 22 do reqmat 07, processo 006358/2014, que não foram comprados",160105,"PROAP - ENGENHARIA QUÍMICA","PROGRAMA DE PÓS-GRADUAÇÃO EM ENGENHARIA QUÍMICA","DIREÇÃO DMSA","Buscando solução para uso do recurso do PROAP 2014."]
["07/2014",1059,"003666/2014","Aquisição de cartuchos de tinta",150080,"PROEXT - MÃOS QUE CRIAM - PROJETO DE CAPACITAÇÃO PARA PROMOÇÃO SOCIAL","PRÓ-REITORIA DE EXTENSÃO - PROJETO \"MÃOS QUE CRIAM\"","SPP","Pesquisa de preço."]
["07/2014",1731,"008025/2014","Aquisição de livros",500030,"PROGRAMA INGLÊS SEM FRONTEIRAS","PROGRAMA INGLÊS SEM FRONTEIRAS","ANEXADO    23083.007599/2014-50","Atualizando a Pesquisa de Preços e atendendo recomendações do Parecer da PROGER (anexado ao 007599/2014)."]
["07/2014",1209,"005475/2014","Contratação de execução de cursos in company (gestão e fiscalização de contratos para 30 servidores)",110000,"PRÓ-REITORIA DE ASSUNTOS ADMINISTRATIVOS","COORDENADORIA DE DESENVOLVIMENTO DE PESSOA","ARQUIVO","Já houve empenho (2014NE000356) e pagamento (2014GR800105/2014GR800104)"]
["78/2014",1484,"007073/2014","Pagamento de inscrição do servidor Duclério José no 41° FONAI-TEC",100000,"REITORIA","AUDITORIA INTERNA","ARQUIVO","Desarquivado pela CODEP para realizar o relatório anual de cursos  do Governo Federal e em breve será novamente arquivado.\nArquivado porque  houve empenho (2014NE801685) e pagamento (2014OB809153)."]
["78/2014","S/Nº","003939/2014","Obras nos Laboratórios de Microbiologia de Alimentos e Fermentações para o conserto de vazamento de gás",270000,"INSTITUTO DE TECNOLOGIA","DEPARTAMENTO DE TECNOLOGIA DE ALIMENTOS","ARQUIVO","Arquivado porque a contratação da empresa para adequação da tubulação e conserto do vazamento de gás nos Laboratórios de Microbiologia de Alimentos e Fermentações do DTA já foi efetuada através do processo 003094/2014 e gerou a emissão da nota de empenho 2014NE800708. Além disso, o referido empenho já foi transmitido à empresa e a previsão de início dos serviços é na próxima semana (despacho em 04/06/14)."]
["249/2014",1431,"007142/2014","Pagamento de inscrição dos servidores Gabriel Esteves e Janaina da Silva no 8º Congresso de secretários das universidades brasileiras",140000,"PRÓ-REITORIA DE ENSINO E GRADUAÇÃO","PRÓ-REITORIA DE GRADUAÇÃO","ARQUIVO","Desarquivado pela CODEP para realizar o relatório anual de cursos  do Governo Federal e em breve será novamente arquivado.\nArquivado porque  houve empenho (2014NE801509) e pagamento (2014GR800110)."]
["115/2014",921,"005725/2014","Aquisição de lâmpadas (grupo 30.29)",150000,"PRÓ-REITORIA DE EXTENSÃO","DEPARTAMENTO DE LOGÍSTICA E INFRAESTRUTURA","CLOG","Já houve empenho (2014NE801699 e 2014NE801698) e  foi entregue no Almoxarifado em 04/11/14 e 05/11/14."]
["115/2014","S/Nº","008758/2014","Construção de edificação de um pavimento para atender ao curso de educacao física",250000,"INSTITUTO DE EDUCAÇÃO","INSTITUTO DE EDUCAÇÃO","PRÓ-REITORIA DE PLANEJAMENTO, AVALIAÇÃO E DESENVOLVIMENTO","Buscando informações."]
["89/2014",1246,"005474/2014","Fornecimento e instalação de 39m² de parede de divisória",220300,"DEPARTAMENTO DE CIÊNCIAS FISIOLÓGICAS","DEPARTAMENTO DE CIÊNCIAS FISIOLÓGICAS","SPP","atualização da pesquisa de preços."]
["89/2014","S/Nº","005054/2014","Contratação de serviço de coffee break para duas atividades de extensão: encerramento do curso etc",300000,"CAMPUS DA UFRRJ EM NOVA IGUAÇU","INSTITUTO MULTIDISCIPLINAR DE NOVA IGUAÇU","DIREÇÃO DO IM","Buscando informações."]
["131/2014",1013,"005726/2014","Aquisição de artigos cirúrgicos e de enfermaria (somente para o Posto Médico (grupo 30.36)",100070,"POSTO MÉDICO","DIVISÃO DE SAÚDE","ASTEC","Elaboração da minuta de edital."]
["131/2014",1841,"008940/2014","Aquisição de marcador de campo",150100,"PRAÇA DE DESPORTOS","DEPARTAMENTO DE ESPORTES E LAZER","DIREÇÃO DMSA","Buscando informações."]
["09/2014",891,"006025/2014","Aquisição de dois martelos perfuradores",130000,"PRÓ-REITORIA DE ASSUNTOS ESTUDANTIS","PRÓ-REITORIA DE ASSUNTOS ESTUDANTIS","CLOG","Já houve empenho (2014NE802605) e pagamento (2015OB801678)."]
["09/2014",179,"002706/2014","Aquisição de artigos de higiene e conservação",220300,"DEPARTAMENTO DE CIÊNCIAS FISIOLÓGICAS","DEPARTAMENTO DE CIÊNCIAS FISIOLÓGICAS","SPP","Verificando a possibilidade de atendimento juntamente com a demanda de 2015."]
["09/2014",179,"002706/2014","Aquisição de artigos de higiene e conservação",220300,"DEPARTAMENTO DE CIÊNCIAS FISIOLÓGICAS","SECRETARIA","SPP","Verificando a possibilidade de atendimento juntamente com a demanda de 2015."]
["09/2014",959,"005735/2014","Aquisição de equipamentos industriais - banho Maria, moinho, máquina de costura, fogão, liquidificador e seladora (grupo 52.28)",280300,"DEPTO DE MICROBIOLOGIA E IMUNOLOGIA VETERINÁRIA","DEPTO DE MICROBIOLOGIA E IMUNOLOGIA VETERINÁRIA","ASSESSORIA TECNICA/DMSA","Pesquisa de preço."]
["09/2014",1031,"004882/2014","Aquisição de trailer para transporte de animais",280010,"HOSPITAL VETERINÁRIO","HOSPITAL VETERINÁRIO","DIVISÃO DE ADMINISTRAÇÃO FINANCEIRA","Pregão nº 09/2015 (antigo nº 130/2014) com provável abertura em 02/03/15."]
["09/2014",1738,"008288/2014","Contratação de pessoa jurídica para prestação de serviço de banda musical",10310,"CAPACITAÇÃO DE SERVIDORES - RECURSOS ESPECÍFICOS","COORDENAÇÃO DE DESENVOLVIMENTO DE PESSOAS","ARQUIVO","Arquivado porque  houve empenho (2014NE802044) e pagamento (2014OB808988)."]
["09/2014",419,"002371/2014","Aquisição de cartucho de tinta impressora HP ref. C9388-A",120200,"DEPARTAMENTO DE MATERIAL E SERVIÇOS AUXILIARES","DEPARTAMENTO DE MATERIAL E SERVICOS AUXILIARES","CLOG","Buscando informações."]
["09/2014",449,"002657/2014","Aquisição de frutas, legumes e verduras",300001,"RESTAURANTE UNIVERSITÁRIO - NOVA IGUAÇU","RESTAURANTE UNIVERSITÁRIO - NOVA IGUAÇU","RESTAURANTE UNIVERSITÁRIO DO CAMPUS DE NOVA IGUAÇU","Pregão nº 89/2014 finalizado em 30/07/14. O processo está disponível no Restaurante Universitário do Instituto Multidisciplinar para solicitar empenhos."]
["09/2014",186,"002701/2014","Aquisição de café, açúcar, coador e adoçante",160010,"EDITORA UNIVERSIDADE RURAL","EDITORA UNIVERSIDADE RURAL","CLOG","Pregão nº 88/2014 finalizado em 03/11/14. Já houve empenho (2014NE802417, 2015NE800302) e pagamento (2015OB800319). O processo está disponível na Seção de Sistema de Registro de Preços para solicitar empenhos."]
["09/2014",1276,"005684/2014","Aquisição de servidor de cálculo intel supermicro com switch hub 16 - Pró-equipamentos/Capes",160001,"PRÓ - EQUIPAMENTOS","PROPPG","SCD","Realizando ajustes após emissão de parecer jurídico."]
["09/2014","S/Nº","006046/2014","Aquisição de itens do grupo 30.11 - Material químico (demais setores)",220100,"DEPARTAMENTO DE BIOLOGIA ANIMAL","DEPARTAMENTO DE BIOLOGIA ANIMAL","CADMIN","Buscando informações."]
["09/2014","S/Nº","005200/2014","Instalação de 16 aparelhos ar condicionados split (12 de 80.000 btus e 4 de 60.000 btus)",270000,"INSTITUTO DE TECNOLOGIA","INSTITUTO DE TECNOLOGIA","DEPARTAMENTO DE CONTABILIDADE E FINANÇAS","Buscando informações."]
["09/2014",340,"002707/2014","Aquisição de artigos de copa e cozinha",180000,"CTUR","CTUR","SPP","Verificando a possibilidade de atendimento juntamente com a demanda de 2015."]
["09/2014",148,"002707/2014","Aquisição de artigos de copa e cozinha",260000,"INSTITUTO DE FLORESTAS","INSTITUTO DE FLORESTAS","SPP","Verificando a possibilidade de atendimento juntamente com a demanda de 2015."]
["09/2014",937,"004258/2014","Aquisição de livros",170000,"CAIC","CAIC","CLOG","Pregão nº 10/2015 (antigo nº 140/2014) iniciado em 05/03/15."]
["09/2014",1775,"008694/2014","Aquisição de materiais químicos",280010,"HOSPITAL VETERINÁRIO","INSTITUTO DE VETERINÁRIA","SEÇÃO DE CONTROLE","Já houve empenho (2014NE802488) e foi entregue no Almoxarifado em 22/12/14."]
["09/2014",1775,"008694/2014","Aquisição de materiais químicos",300000,"CAMPUS DA UFRRJ EM NOVA IGUAÇU","CAMPUS DA UFRRJ EM NOVA IGUAÇU","SEÇÃO DE CONTROLE","Já houve empenho (2014NE802490) e foi entregue no Almoxarifado em 22/12/14."]
["09/2014",1808,"009589/2014","Conserto de trinta de cinco projetores",140000,"PRÓ-REITORIA DE ENSINO E GRADUAÇÃO","PRÓ-REITORIA DE ENSINO E GRADUAÇÃO","DIREÇÃO DMSA","Buscando informações."]
["30/2014",1337,"006343/2014","Aquisição de materiais de expediente e pasta vetro-laterial (grupos 30.16B e 30.16)",100200,"IMPRENSA UNIVERSITÁRIA","IMPRENSA UNIVERSITÁRIA","CPACS","Consolidar Pesquisas de Preços"]
["30/2014",1479,"007504/2014","Aquisição de ordenhadeira móvel (grupo 52.40)",180000,"CTUR","CTUR","CLOG","Já houve empenho (2014NE802182) e a data prevista de entrega é até 23/12/14."]
["30/2014",1987,"010608/2014","Aquisição de itens do grupo 30.22 - Artigos para higiene e conservação",300000,"CAMPUS DA UFRRJ EM NOVA IGUAÇU","CAMPUS DA UFRRJ EM NOVA IGUAÇU","CLOG","Já houve empenho (2014NE802495), mas o prazo de entrega está vencido desde 04/01/15."]
["30/2014",1764,"009584/2014","Aquisição de materiais de alguns itens do grupo 30.31 - Insumos agrícolas (adubo químico e fertilizante)",290000,"INSTITUTO DE ZOOTECNIA","DIREÇÃO DO INSTITUTO DE ZOOTECNIA","DIREÇÃO DMSA","Buscando informações."]
["277/2014",1221,"006343/2014","Aquisição de materiais de expediente e pasta vetro-laterial (grupos 30.16B e 30.16)",110300,"DEPARTAMENTO DE PESSOAL","SECRETARIA","CPACS","Consolidar Pesquisas de Preços"]
["31/2014",1343,"006363/2014","Aquisição de tintas para máquina RISO",100200,"IMPRENSA UNIVERSITÁRIA","IMPRENSA UNIVERSITÁRIA","SPP","Realizando ajustes após emissão de parecer jurídico."]
["31/2014",1535,"007860/2014","Aquisição de tela arame galvanizado (emergencial)",180000,"CTUR","CTUR","CLOG","Já houve empenho (2014NE802588) e a data prevista de entrega é até 20/02/15. "]
["31/2014","S/Nº","004677/2014","Contratação da empresa gerenciadora para apoio técnico e fiscal das obras de construcao e reforma dos prédios nos Campis",120000,"PRÓ-REITORIA DE ASSUNTOS FINANCEIROS","PREFEITURA UNIVERSITÁRIA","SEC. ADM. DO DECANATO DE ASSUNTOS FINANCEIROS","Buscando informações."]
["31/2014",1423,"003666/2014","Aquisição de cartuchos de tinta",290000,"INSTITUTO DE ZOOTECNIA","DIRETORIA","SPP","Pesquisa de preço."]
["167/2014",1354,"006390/2014","Aquisição de material químico sujeito à controle governamental (grupo 30.11A)",230300,"DEPARTAMENTO DE QUÍMICA","DEPARTAMENTO DE QUÍMICA","ASSESSORIA TECNICA/DMSA","Realizando ajustes na minuta de edital após solicitação de aumento do quantitativo e reenquadramento como SRP, realizadas pelo Pró-reitora de Assuntos Financeiros."]
["166/2014",1353,"006087/2014","Aquisição de material químico (grupo 30.11)",230300,"DEPARTAMENTO DE QUÍMICA","DEPARTAMENTO DE QUÍMICA","SPP","Pesquisa de preço."]
["42/2014",1460,"007272/2014","Serviço de instalação e programação de 4 (quatro) placas de 8 ramais Corp 16000",260000,"INSTITUTO DE FLORESTAS","DIRETORIA","INSTITUTO DE FLORESTAS","As propostas serão solicitadas em breve para realização de dispensa."]
["237/2014",1421,"007037/2014","Conserto e manutenção de impressora Xerox PHASER 6180",110300,"DEPARTAMENTO DE PESSOAL","SECRETARIA ADMINISTRATIVA","ARQUIVO","Arquivado porque o Departamento de Pessoal informou não haver mais interesse em consertar a impressora, pois não há mais peça no mercado."]
["108/2014",1389,"007693/2014","Aquisição em caráter de urgência de cartucho para impressora",100300,"PREFEITURA UNIVERSITÁRIA","DIVISÃO DE OBRAS","SEÇÃO DE CONTROLE","Já houve empenho (2014NE802156) e foi entregue no Almoxarifado em 25/11/14."]
["108/2014",1553,"007938/2014","Pagamento de inscrição para a Servidora Maria Viviana no XII Encontro Nacional da Associação de Estudos Regionais e Urbanos",600000,"INSTITUTO DE CIÊNCIAS SOCIAIS APLICADAS","DEPARTAMENTO DE CIÊNCIAS ECONÔMICAS","DEPARTAMENTO DE CIÊNCIAS ECONÔMICAS","Já houve empenho (2014NE801895), mas o pagamento ainda não foi efetuado."]
["59/2014",1173,"005324/2014","Instalação de data show multimídia",280000,"INSTITUTO DE VETERINÁRIA","DIRETORIA DO IV","ASTEC","Elaboração da minuta de edital."]
["107/2014",1554,"007937/2014","Pagamento de inscrição para o servidor Joilson no XII Encontro Nacional da Associação Brasileira de Estudos Regionais e Urbanos",600000,"INSTITUTO DE CIÊNCIAS SOCIAIS APLICADAS","DEPARTAMENTO DE CIÊNCIAS ECONÔMICAS","DEPARTAMENTO DE CIÊNCIAS ECONÔMICAS","Já houve empenho (2014NE801893), mas o pagamento ainda não foi efetuado."]
["64/2014",395,"004381/2014","Manutenção preventiva referente ao analisador genético 3500",160114,"PROAP - CIÊNCIAS VETERINÁRIAS","CURSO DE PÓS-GRADUAÇÃO EM CIÊNCIAS VETERINÁRIAS/LAB. DE BIOLOGIA MOLECULAR","DIVISÃO DE ADMINISTRAÇÃO FINANCEIRA","Buscando informações."]
["64/2014","S/Nº","001762/2014","Aquisição de ácido acético, aspecto físico límpido transparente, peso molecular 60,05 e outros",230300,"DEPARTAMENTO DE QUÍMICA","DEPARTAMENTO DE QUÍMICA","CLOG","Já houve empenho (2014NE800833), pagamento (2014OB805108) e foi entregue no Almoxarifado em 23/07/14.\nJá houve empenho (2014NE800836), pagamento (2014OB805125) e foi entregue no Almoxarifado em 24/07/14.\nJá houve empenho (2014NE800834), pagamentos (2014OB807567 e 2014DF801934) e foi entregue no Almoxarifado em 16/08/14.\nJá houve empenho (2014NE800835), pagamentos (2015OB800335 e 2015DF800183) e foi entregue no Almoxarifado em 08/01/15."]
["48/2014","S/Nº","007877/2014","Pagamento de inscrição do servidor Carlos Alberto Gomes da Rocha no curso de como resumir, indexar e classificar documentos",110200,"SEÇÃO DE ARQUIVO E PROTOCOLO GERAL","SEÇÃO DE ARQUIVO E PROTOCOLO GERAL","ARQUIVO","Já houve empenho (2014NE801894), mas o pagamento ainda não foi efetuado."]
["48/2014","S/Nº","006044/2014","Contratação de empresa prestadora de serviço para manutenção do elevador do Pavilhão Central",100300,"PREFEITURA UNIVERSITÁRIA","PREFEITURA UNIVERSITÁRIA","CPACS","Pesquisa de preço."]
["01/2013",1298,"006018/2014","Aquisição de equipamentos para laboratório (grupo 52.08)",100000,"REITORIA","DEQUIM - ICE","DIREÇÃO DMSA","Buscando informações."]
["02/2013",1299,"006018/2014","Aquisição de equipamentos para laboratório (grupo 52.08)",100000,"REITORIA","DEQUIM - ICE - BIOQUÍMICA","DIREÇÃO DMSA","Buscando informações."]
["07/2013",1304,"006018/2014","Aquisição de equipamentos para laboratório (grupo 52.08)",100000,"REITORIA","DEQUIM - ICE - ANÁLISE INSTRUMENTAL","DIREÇÃO DMSA","Buscando informações."]
["479/2014",1916,"009793/2014","Inscrição de Raquel Ramos de Souza Ferreira no curso de libras língua brasileira de sinais",10310,"CAPACITAÇÃO DE SERVIDORES - RECURSOS ESPECÍFICOS","DEPARTAMENTO PESSOAL","ARQUIVO","Já houve empenho (2014NE802166), mas o pagamento ainda não foi efetuado."]
["41/2014",1830,"009127/2014","Pagamento de inscrição da professora Lívia Nolasco Macedo no curso de análise sensorial de leite e derivados",180000,"CTUR","CTUR","DIREÇÃO DMSA","Já houve empenho (2014NE802437), mas o pagamento ainda não foi efetuado."]
["129/2014",1818,"009163/2014","Aquisição de cloro granulado",150100,"PRAÇA DE DESPORTOS","DEPARTAMENTO DE ESPORTES E LAZER-PROEXT","ARQUIVO","Já houve empenho (2014NE802496) e a data prevista de entrega é até 04/01/15. "]
["S/Nº","S/Nº","006067/2014","Serviço de instalação e manutenção de rede elétrica, cabeamento lógico, telefônico e manutenção de grupo gerador",200000,"PRÓ-REITORIA DE PLANEJAMENTO, AVALIAÇÃO E DESENVOLVIMENTO INSTITUCIONAL","PRÓ-REITORIA DE PLANEJAMENTO, AVALIAÇÃO E DESENVOLVIMENTO INSTITUCIONAL","CPACS","Buscando informações."]
["S/Nº","S/Nº","007152/2014","Aquisição de veículos de transporte não especializado tipo Pick-up",100060,"DIVISÃO DE GUARDA E VIGILÂNCIA","DIVISÃO DE GUARDA E VIGILÂNCIA","ANEXADO    23083.004907/2014-85","Já houve empenho (2014NE801998, 2014NE801999, 2014NE802192), pagamentos (2015OB800232 , 2015OB800413 e 2015DF800135, 2015DF800207) e foi entregue no Almoxarifado em 19/12/14. (anexado ao 004907/2014)."]
["S/Nº","S/Nº","007553/2013","Contratação de serviços de restauração e encadernação de livros pertecentes ao acervo da Biblioteca Central",100100,"BIBLIOTECA CENTRAL","BIBLIOTECA CENTRAL","SEC. ADM. DO DEPTO DE CONTABILIDADE E FINANÇAS","Analisando manifestação de interesse (IRP) de outros órgãos. Pregão nº 15/2015 (antigo nº 133/2014) com provável abertura em 13/01/15."]
["S/Nº","S/Nº","000256/2014","Aquisição de revista Síntese Responsabilidade Pública",100000,"REITORIA","PROCURADORIA GERAL","ARQUIVO","Arquivado porque  houve empenho (2014NE800304) e pagamento (2014OB803688 e 2014DF801211)."]
["S/Nº","S/Nº","000257/2014","Aquisição de boletim de direito administrativo e boletim de licitações e contratos 2014",100000,"REITORIA","PROCURADORIA GERAL","ARQUIVO","Arquivado porque  houve empenho (2014NE800368) e pagamento (2014OB804980 e 2014DF801479)."]
["S/Nº","S/Nº","010568/2014","Aquisição de lâmina para microscopia - fosca, lapidada, 26x70mm, caixa com 50 unidades e outros",280010,"HOSPITAL VETERINÁRIO","HOSPITAL VETERINÁRIO","SEÇÃO DE CONTROLE","Já houve empenhos (2014NE802481 e 2014NE802487), mas o prazo de entrega está vencido e um ofício de cobrança foi emitido à empresa em 23/01/15.\nJá houve empenho (2014NE802482), mas o prazo de entrega está vencido desde 05/01/15.\nJá houve empenho (2014NE802484) e foi entregue no Almoxarifado em 06/01/15.\nJá houve empenho (2014NE802486) e foi entregue no Almoxarifado em 30/12/14."]
["S/Nº","S/Nº","006033/2014","Aquisição de materiais para manutenção de bens móveis - ferragens em geral e afins (IRP)",120200,"DEPARTAMENTO DE MATERIAL E SERVIÇOS AUXILIARES","DEPARTAMENTO DE MATERIAL E SERVIÇOS AUXILIARES","SSRP","O pregão do órgão gerenciador ainda não foi realizado."]
["S/Nº","S/Nº","008655/2014","Aquisição de materiais para manutenção de bens imóveis (material hidráulico e afins) - IRP",120200,"DEPARTAMENTO DE MATERIAL E SERVIÇOS AUXILIARES","DEPARTAMENTO DE MATERIAL E SERVIÇOS AUXILIARES","CPACS","Aguardando a ata assinada pelo órgão gerenciadorda IRP."]
["S/Nº","S/Nº","009153/2014","Aquisição de material de higiene e limpeza (IRP)",120200,"DEPARTAMENTO DE MATERIAL E SERVIÇOS AUXILIARES","DEPARTAMENTO DE MATERIAL E SERVIÇOS AUXILIARES","SSRP","Aguardando a ata assinada pelo órgão gerenciadorda IRP."]
["S/Nº","S/Nº","007182/2014","Aquisição de 12 automóveis",210000,"INSTITUTO DE AGRONOMIA","INSTITUTO DE AGRONOMIA","SEC. ADM. DO DECANATO DE ASSUNTOS FINANCEIROS","Já houve empenho (2014NE801671), pagamentos (2015OB800136 e 2015DF800023) e foi entregue no Almoxarifado em 15/12/14."]
["S/Nº","S/Nº","007182/2014","Aquisição de 12 automóveis",220000,"INSTITUTO DE BIOLOGIA","INSTITUTO DE BIOLOGIA","SEC. ADM. DO DECANATO DE ASSUNTOS FINANCEIROS","Já houve empenho (2014NE801671), pagamentos (2015OB800136 e 2015DF800023) e foi entregue no Almoxarifado em 15/12/14."]
["S/Nº","S/Nº","007182/2014","Aquisição de 12 automóveis",230000,"INSTITUTO DE CIÊNCIAS EXATAS","INSTITUTO DE CIÊNCIAS EXATAS","SEC. ADM. DO DECANATO DE ASSUNTOS FINANCEIROS","Já houve empenho (2014NE801671), pagamentos (2015OB800136 e 2015DF800023) e foi entregue no Almoxarifado em 15/12/14."]
["S/Nº","S/Nº","007182/2014","Aquisição de 12 automóveis",240000,"INSTITUTO DE CIÊNCIAS HUMANAS E SOCIAIS","INSTITUTO DE CIÊNCIAS HUMANAS E SOCIAIS","SEC. ADM. DO DECANATO DE ASSUNTOS FINANCEIROS","Já houve empenho (2014NE801671), pagamentos (2015OB800136 e 2015DF800023) e foi entregue no Almoxarifado em 15/12/14."]
["S/Nº","S/Nº","007182/2014","Aquisição de 12 automóveis",250000,"INSTITUTO DE EDUCAÇÃO","INSTITUTO DE EDUCAÇÃO","SEC. ADM. DO DECANATO DE ASSUNTOS FINANCEIROS","Já houve empenho (2014NE801671), pagamentos (2015OB800136 e 2015DF800023) e foi entregue no Almoxarifado em 15/12/14."]
["S/Nº","S/Nº","007182/2014","Aquisição de 12 automóveis",270000,"INSTITUTO DE TECNOLOGIA","INSTITUTO DE TECNOLOGIA","SEC. ADM. DO DECANATO DE ASSUNTOS FINANCEIROS","Já houve empenho (2014NE801671), pagamentos (2015OB800136 e 2015DF800023) e foi entregue no Almoxarifado em 15/12/14."]
["S/Nº","S/Nº","007182/2014","Aquisição de 12 automóveis",280000,"INSTITUTO DE VETERINÁRIA","INSTITUTO DE VETERINÁRIA","SEC. ADM. DO DECANATO DE ASSUNTOS FINANCEIROS","Já houve empenho (2014NE801671), pagamentos (2015OB800136 e 2015DF800023) e foi entregue no Almoxarifado em 15/12/14."]
["S/Nº","S/Nº","007182/2014","Aquisição de 12 automóveis",290000,"INSTITUTO DE ZOOTECNIA","INSTITUTO DE ZOOTECNIA","SEC. ADM. DO DECANATO DE ASSUNTOS FINANCEIROS","Já houve empenho (2014NE801671), pagamentos (2015OB800136 e 2015DF800023) e foi entregue no Almoxarifado em 15/12/14."]
["S/Nº","S/Nº","007182/2014","Aquisição de 12 automóveis",300000,"CAMPUS DA UFRRJ EM NOVA IGUAÇU","CAMPUS DA UFRRJ EM NOVA IGUAÇU","SEC. ADM. DO DECANATO DE ASSUNTOS FINANCEIROS","Já houve empenho (2014NE801671), pagamentos (2015OB800136 e 2015DF800023) e foi entregue no Almoxarifado em 15/12/14."]
["S/Nº","S/Nº","007182/2014","Aquisição de 12 automóveis",400000,"CAMPUS DA UFRRJ EM TRÊS RIOS","CAMPUS DA UFRRJ EM TRÊS RIOS","SEC. ADM. DO DECANATO DE ASSUNTOS FINANCEIROS","Já houve empenho (2014NE801671), pagamentos (2015OB800136 e 2015DF800023) e foi entregue no Almoxarifado em 15/12/14."]
["S/Nº","S/Nº","007182/2014","Aquisição de 12 automóveis",600000,"INSTITUTO DE CIÊNCIAS SOCIAIS APLICADAS","INSTITUTO DE CIÊNCIAS SOCIAIS APLICADAS","SEC. ADM. DO DECANATO DE ASSUNTOS FINANCEIROS","Já houve empenho (2014NE801671), pagamentos (2015OB800136 e 2015DF800023) e foi entregue no Almoxarifado em 15/12/14."]
["S/Nº","S/Nº","007182/2014","Aquisição de 12 automoveis.reqmat.s/n/ichs/icsa/ie/ice/it ia/iv/iz/ib/if/itr/im...alexis rosa nummer e outros",260000,"INSTITUTO DE FLORESTAS","INSTITUTO DE FLORESTAS","SEC. ADM. DO DECANATO DE ASSUNTOS FINANCEIROS","Já houve empenho (2014NE801671), pagamentos (2015OB800136 e 2015DF800023) e foi entregue no Almoxarifado em 15/12/14."]
["S/Nº","S/Nº","002827/2014","Aquisição de cartuchos",100000,"REITORIA","REITORIA","SAPG","Já houve empenho (2014NE800771), pagamento (2014OB808377) e foi entregue no Almoxarifado em 15/07/14."]
["S/Nº","S/Nº","002827/2014","Aquisição de cartuchos",110000,"PRÓ-REITORIA DE ASSUNTOS ADMINISTRATIVOS","PRÓ-REITORIA DE ASSUNTOS ADMINISTRATIVOS","SAPG","Já houve empenho (2014NE800771), pagamento (2014OB808377) e foi entregue no Almoxarifado em 15/07/14."]
["S/Nº","S/Nº","002827/2014","Aquisição de cartuchos",120100,"DEPARTAMENTO DE CONTABILIDADE E FINANÇAS","DEPARTAMENTO DE CONTABILIDADE E FINANÇAS","SAPG","Já houve empenho (2014NE800771), pagamento (2014OB808377) e foi entregue no Almoxarifado em 15/07/14."]
["S/Nº","S/Nº","002827/2014","Aquisição de cartuchos",240000,"INSTITUTO DE CIÊNCIAS HUMANAS E SOCIAIS","INSTITUTO DE CIÊNCIAS HUMANAS E SOCIAIS","SAPG","Já houve empenho (2014NE800771), pagamento (2014OB808377) e foi entregue no Almoxarifado em 15/07/14."]
["S/Nº","S/Nº","002827/2014","Aquisição de cartuchos",280000,"INSTITUTO DE VETERINÁRIA","INSTITUTO DE VETERINÁRIA","SAPG","Já houve empenho (2014NE800771), pagamento (2014OB808377) e foi entregue no Almoxarifado em 15/07/14."]
["S/Nº","S/Nº","002827/2014","Aquisição de cartuchos",600000,"INSTITUTO DE CIÊNCIAS SOCIAIS APLICADAS","INSTITUTO DE CIÊNCIAS SOCIAIS APLICADAS","SAPG","Já houve empenho (2014NE800771), pagamento (2014OB808377) e foi entregue no Almoxarifado em 15/07/14."]
["S/Nº","S/Nº","002827/2014","Aquisição de cartuchos",220200,"DEPARTAMENTO DE BOTÂNICA","DEPARTAMENTO DE BOTÂNICA","SAPG","Já houve empenho (2014NE800771), pagamento (2014OB808377) e foi entregue no Almoxarifado em 15/07/14."]
["S/Nº","S/Nº","002827/2014","Aquisição de cartuchos",120210,"ESTOQUE","ESTOQUE","SAPG","Já houve empenho (2014NE800771), pagamento (2014OB808377) e foi entregue no Almoxarifado em 15/07/14."]
["S/Nº","S/Nº","002827/2014","Aquisição de cartuchos",140117,"ENGENHARIA DE AGRIMENSURA E CARTOGRÁFICA","ENGENHARIA DE AGRIMENSURA E CARTOGRAFICA","SAPG","Já houve empenho (2014NE800771), pagamento (2014OB808377) e foi entregue no Almoxarifado em 15/07/14."]
["S/Nº","S/Nº","004584/2014","Aquisição de material de expediente",100200,"IMPRENSA UNIVERSITÁRIA","IMPRENSA UNIVERSITÁRIA","SSRP","Já houve empenho (2014NE802310), pagamento (2015OB800575) e foi entregue no Almoxarifado em 15/01/15."]
["S/Nº","S/Nº","004584/2014","Aquisição de material de expediente",500030,"PROGRAMA INGLÊS SEM FRONTEIRAS","PROGRAMA INGLÊS SEM FRONTEIRAS","SSRP","Já houve empenho (2014NE802315), pagamento (2015OB800230) e foi entregue no Almoxarifado em 02/12/14.\nJá houve empenho (2014NE802312) e foi entregue no Almoxarifado em 15/01/15.\nJá houve empenho (2014NE802314) e foi entregue no Almoxarifado em 14/01/15."]
["S/Nº","S/Nº","004584/2014","Aquisição de material de expediente",140515,"ESPECIALIZAÇÃO UNIAPRO","ESPECIALIZAÇÃO UNIAPRO","SSRP","Já houve empenho (2014NE802316), pagamento (2015OB800575) e foi entregue no Almoxarifado em 15/01/15.\nJá houve empenho (2014NE802317), pagamentos (2015OB800306 e 2015DF800166) e foi entregue no Almoxarifado em 05/01/15."]
["S/Nº","S/Nº","004584/2014","Aquisição de material de expediente (copo descartável)",220410,"LABORATÓRIO OFICIAL DE DIAGNÓSTICO FITOSSANITÁRIO","LABORATÓRIO OFICIAL DE DIAGNÓSTICO FITOSSANITÁRIO","SSRP","Já houve empenho (2014NE801928), pagamento (2014OB809871) e foi entregue no Almoxarifado em 05/12/14."]
["S/Nº","S/Nº","004584/2014","Aquisição de material de expediente (copo descartável)",140510,"CONSELHO ESCOLAR","CONSELHO ESCOLAR","SSRP","Já houve empenho (2014NE801926), pagamento (2014OB809821) e foi entregue no Almoxarifado em 05/12/14."]
["S/Nº","S/Nº","004584/2014","Aquisição de material de expediente (copo descartável)",160111,"PROAP - TECNOLOGIA DE ALIMENTOS","PROAP - TECNOLOGIA DE ALIMENTOS","SSRP","Já houve empenho (2014NE801927), pagamento (2014OB809834) e foi entregue no Almoxarifado em 05/12/14."]
["S/Nº","S/Nº","004583/2014","Aquisição de móveis e equipamentos de uso geral",180000,"CTUR","CTUR","CLOG","Já houve empenhos (2014NE802421, 2014NE802423, 2014NE802425 e 2014NE802426), mas o prazo de entrega está vencido e um ofício de cobrança foi emitido à empresa em 05/03/15.\nJá houve empenho (2014NE802424), pagamento (2015OB800559) e foi entregue no Almoxarifado em 26/01/15."]
["S/Nº","S/Nº","004583/2014","Aquisição de móveis e equipamentos de uso geral",500030,"PROGRAMA INGLÊS SEM FRONTEIRAS","PROGRAMA INGLÊS SEM FRONTEIRAS","CLOG","Já houve empenho (2014NE802283), mas o prazo de entrega está vencido e um ofício de cobrança foi emitido à empresa em 05/03/15."]
["S/Nº","S/Nº","002446/2014","Conserto do eletrocardiógrafo",100070,"POSTO MÉDICO","DIVISÃO DE SAÚDE","ARQUIVO","Já houve empenho (2014NE801119) e pagamento (2015OB800753)."]
["S/Nº",1878,"009339/2014","Aquisição de bebedouro industrial - Material do grupo 52.12 aparelhos e utensílios domésticos - (carona)",220410,"LABORATÓRIO OFICIAL DE DIAGNÓSTICO FITOSSANITÁRIO","LABORATÓRIO OFICIAL DE DIAGNÓSTICO FITOSSANITÁRIO","SSRP","Já houve empenho (2014NE802167), mas o prazo de entrega está vencido desde 23/12/14."]
["S/Nº",229,"003664/2014","Aquisição de papel A4 e papel A3",150090,"PROEXT - ESTRATÉGIA DESENVOLVIMENTO CADEIA PRODUTIVA COM ABELHAS","PROEXT - ESTRATÉGIA DESENVOLVIMENTO CADEIA PRODUTIVA COM ABELHAS","ARQUIVO","Arquivado porque as solitações foram realizadas pelos Coordenadores através do Quiosque de Compras."]
["S/Nº",776,"003666/2014","Aquisição de cartuchos de tinta",150080,"PROEXT - MÃOS QUE CRIAM - PROJETO DE CAPACITAÇÃO PARA PROMOÇÃO SOCIAL","PRÓ-REITORIA DE EXTENSÃO - PROJETO \"MÃOS QUE CRIAM\"","SPP","Pesquisa de preço."]
["08/2013",890,"010043/2013","Aquisição de adaptador para uma tomada padrão antigo e etc",500404,"PRONATEC - COLÉGIO TÉCNICO","PRONATEC - COLÉGIO TÉCNICO","DIREÇÃO DMSA","Os pedidos desse processo foram inseridos no 002078/2013 do DMSA e está verificando a possibilidade de atendimento juntamente com a demanda de 2015."]
["12/2013",78,"002078/2013","Aquisição de material do grupo 30.17 (adaptador 2P+T do padrão novo para o padrão antigo e etc.)",120200,"DEPARTAMENTO DE MATERIAL E SERVIÇOS AUXILIARES","DEPARTAMENTO DE MATERIAL E SERVIÇOS AUXILIARES","DIREÇÃO DMSA","Verificando a possibilidade de atendimento juntamente com a demanda de 2015."]
["18/2013","S/Nº","000352/2014","Aquisição de rede para cabelo cor preta e outros",300000,"CAMPUS DA UFRRJ EM NOVA IGUAÇU","CAMPUS DA UFRRJ EM NOVA IGUAÇU","RESTAURANTE UNIVERSITÁRIO DO CAMPUS DE NOVA IGUAÇU","Pregão nº 62/2014 finalizado em 10/09/14. O processo está disponível no Restaurante Universitário do IM para solicitar empenhos."]
["19/2013","S/Nº","000353/2014","Aquisição de álcool etílico 70, frascos de 500 ml e outros",300000,"CAMPUS DA UFRRJ EM NOVA IGUAÇU","CAMPUS DA UFRRJ EM NOVA IGUAÇU","PROAES","Pregão nº 51/2014 finalizado em 05/06/14. O processo está disponível no Restaurante Universitário do IM para solicitar empenhos."]
["137/2014","S/Nº","010515/2014","Aquisição de dez bolas de vôlei de areia/praia, etc",150100,"PRAÇA DE DESPORTOS","PRAÇA DE DESPORTOS","CLOG","Já houve empenho (2014NE802281), pagamentos (2015OB800181 e 2015DF800035) e foi entregue no Almoxarifado em 16/12/14."]
["137/2014",1858,"010414/2014","Aquisição de bola de futsal masculina adulto, oficial para jogos internacionais e outras",150100,"PRAÇA DE DESPORTOS","DEPARTAMENTO DE ESPORTES E LAZER","CLOG","Já houve empenho (2014NE802299) e foi entregue no Almoxarifado em 21/01/15."]
["137/2014",1858,"010493/2014","Aquisição de bola de futsal masculino adulto, etc",150100,"PRAÇA DE DESPORTOS","DEPARTAMENTO DE ESPORTES E LAZER","ARQUIVO","Já houve empenho (2014NE802295), pagamento (2015OB800249) e foi entregue no Almoxarifado em 06/01/15."]
["130/2014",1793,"008974/2014","Aquisição de cloro gasoso",150100,"PRAÇA DE DESPORTOS","DEPARTAMENTO DE ESPORTES E LAZER","SPP","Buscando informações."]
["124/2014",1841,"008940/2014","Aquisição de trator cortador de grama dirigível, roçadeira, reboque para cortador, etc",150100,"PRAÇA DE DESPORTOS","DEPARTAMENTO DE ESPORTES E LAZER","DIREÇÃO DMSA","Buscando informações."]
["30/2013",638,"009166/2014","Aquisição de material de equipamentos de epi",130100,"RESTAURANTE UNIVERSITÁRIO - CAMPUS SEROPÉDICA","RESTAURANTE UNIVERSITÁRIO - CAMPUS SEROPÉDICA","CLOG","Cotação eletrônica nº 04/2015 finalizada em 04/03/15, mas os preços ofertados estão acima do preço de referência."]
["329/2014",1392,"003666/2014","Aquisição de cartuchos de tinta",110300,"DEPARTAMENTO DE PESSOAL","SECRETARIA","SPP","Pesquisa de preço."]
["279/2014",1917,"009789/2014","Serviços de recuperação do assoalho de madeira e acabamento das salas 125, 126,127 e 128 do P1",100000,"REITORIA","REITORIA","CADMIN","Realizando ajustes após emissão de parecer jurídico."]
["49/2014",1777,"009587/2014","Reforma de portas, janelas e confecção de balcão de mdf para DPA/IZ",290000,"INSTITUTO DE ZOOTECNIA","INSTITUTO DE ZOOTECNIA","SCD","Análise e posterior encaminhamento à PROAF para autorização da despesa"]
["247/2014",1836,"009267/2014","Adequação do espaco físico da sala da Coordenação do Curso de Química",230300,"DEPARTAMENTO DE QUÍMICA","DEPARTAMENTO DE QUÍMICA","SPP","Pesquisa de preço."]
["144/2014",1019,"005013/2014","Contratação de empresa especializada em serviços de vigilância patrimonial armada e segurança para atender a UFRRJ",100060,"DIVISÃO DE GUARDA E VIGILÂNCIA","REITORIA/DGV","SPP","Pesquisa de preço."]
["183/2014","S/Nº","010435/2014","Aquisição de softwares administrativos especializados",100400,"COORDENADORIA DE INFORMÁTICA","COORDENADORIA DE INFORMÁTICA","SPP","Enquadramento"]
["184/2014","S/Nº","010436/2014","Serviço de instalação e manutenção de rede elétrica de cabeamento lógico",100400,"COORDENADORIA DE INFORMÁTICA","COORDENADORIA DE INFORMÁTICA","SPP","Pesquisa de preço."]
["365/2014","S/Nº","011220/2014","Abertura de processo de licitação - Fotocopiadora no IE",250000,"INSTITUTO DE EDUCAÇÃO","SETOR DE CANTINAS","DR. PAULINO","Emissão de parecer Jurídico"]
["26/2013","S/Nº","000793/2014","Aquisição de concentrado protéico, lácteo e energético, contendo vitaminas minerais e aminoácidos para uso na fabricação de rações, etc",100000,"REITORIA","COORDENADORIA ESPECIAL DE PROD. INTEGRADA ENSINO, PESQ. EXT.","COORDENADORIA ESPECIAL DE PRODUÇÃO INTEGRADA ENSINO, PESQUISA E  EXTENSÃO","Buscando informações."]
["27/2013","S/Nº","000794/2014","Aquisição de adubo quimico - fórmula n-p-k-14-8 embalados em sacos de 50 kg e outros",100500,"COORDENADORIA DE DESENVOLVIMENTO DA PRODUÇÃO","COORDENADORIA ESPECIAL DE PROD. INTEGRADA ENSINO, PESQ. EXT.","COORDENADORIA ESPECIAL DE PROD. INTEGRADA ENSINO, PESQ. EXT","Já houve empenho (2014NE801701), pagamentos (2014OB809699 e 2014DF802404) e foi entregue no Almoxarifado em 26/11/14.\nJá houve empenho (2014NE801702), pagamento (2014OB808435) e foi entregue no Almoxarifado em 05/11/14.\nJá houve empenho (2014NE801703), mas o prazo de entrega está vencido e um ofício de cobrança foi emitido à empresa em 29/10/14."]
["25/2013","S/Nº","000792/2014","Aquisição de milho em grãos máximo 14 de umidade, saco de 50 kg e outros",100000,"REITORIA","COORDENADORIA ESPECIAL DE PROD. INTEGRADA ENSINO, PESQ. EXT.","SSRP","Já houve empenho (2014NE800998), pagamento (2014OB805578) e entregas no Almoxarifado em 25/07/14, 01/08/14 e 11/08/14.\nJá houve empenho (2014NE801531), pagamento (2014OB807984) e entregas no Almoxarifado em 30/09/14 e 05/10/14.\nJá houve empenho (2014NE802104), pagamento (2015OB800172) e entregas no Almoxarifado em 21/11/14 e 06/12/14.\nJá houve empenho (2014NE800997), mas o prazo de entrega está vencido e um ofício de cobrança foi emitido à empresa em 04/03/15.\nJá houve empenho (2014NE800999), pagamentos (2014OB805559 e 2014DF801574) e foi entregue no Almoxarifado em 24/07/14.\nJá houve empenho (2014NE802107) e foi entregue no Almoxarifado em 03/02/15."]
["134/2014","S/Nº","004123/2014","Reparo na tela que cerca o CAIC",170000,"CAIC","CAIC","PROAES","Buscando informações."]
["117/2014","S/Nº","007100/2014","Contratação de empresa especializada para prestação de apoio técnico ao desenvolvimento de sistemas",100400,"COORDENADORIA DE INFORMÁTICA","COORDENADORIA DE INFORMÁTICA","COINFO","Buscando informações."]
["95/2014","S/Nº","005446/2014","Fornecimento de upgrades de equipamentos existentes de armazenamento de dados",100400,"COORDENADORIA DE INFORMÁTICA","COORDENADORIA DE INFORMÁTICA","ARQUIVO","Buscando informações."]
["120/2014","S/Nº","006268/2014","Contratação de empresa para desenvolvimento de software, de acordo com reqmat n°02 - Pró-reitoria de Extensão",120200,"DEPARTAMENTO DE MATERIAL E SERVIÇOS AUXILIARES","PRÓ-REITORIA DE EXTENSÃO","COORDENADORIA DE TECNOLOGIA DA INFORMAÇÃO E COMUNICAÇÃO","Buscando informações."]

{"sheet":"Gráfico e outros 06-03-15","index":95,"n_rows":95,"n_cols":16,"rows_kept":95,"cut":false,"hidden":false,"merged":[]}
["Setor","QTD de processos"]
["CLOG",41,null,null,null,null,null,null,null,null,null,null,null,null,null,"Centros de custo com pedidos"]
["DIREÇÃO DMSA",36,null,null,null,null,null,null,null,null,null,null,null,null,null,10000]
["SEÇÃO DE CONTROLE",30,null,null,null,null,null,null,null,null,null,null,null,null,null,10310]
["SPP",27,null,null,null,null,null,null,null,null,null,null,null,null,null,100000]
["ASTEC",27,null,null,null,null,null,null,null,null,null,null,null,null,null,100060]
["SCD",17,null,null,null,null,null,null,null,null,null,null,null,null,null,100070]
["SSRP",15,null,null,null,null,null,null,null,null,null,null,null,null,null,100090]
["PREGÃO",11,null,null,null,null,null,null,null,null,null,null,null,null,null,100100]
["CPL",8,null,null,null,null,null,null,null,null,null,null,null,null,null,100200]
["CPACS",6,null,null,null,null,null,null,null,null,null,null,null,null,null,100300]
["ALMOXARIFADO",4,null,null,null,null,null,null,null,null,null,null,null,null,null,100400]
["CADMIN",4,null,null,null,null,null,null,null,null,null,null,null,null,null,100500]
["DMSA",3,null,null,null,null,null,null,null,null,null,null,null,null,null,100600]
["CCI",3,null,null,null,null,null,null,null,null,null,null,null,null,null,110000]
["SETOR DE COBRANÇA",1,null,null,null,null,null,null,null,null,null,null,null,null,null,110200]
["TOTAL",{"$f":"SUM(B2:B16)","v":233},null,null,null,null,null,null,null,null,null,null,null,null,null,110300]
[null,null,null,null,null,null,null,null,null,null,null,null,null,null,null,120000]
[null,null,null,null,null,null,null,null,null,null,null,null,null,null,null,120100]
[null,null,null,null,null,null,null,null,null,null,null,null,null,null,null,120200]
[null,null,null,null,null,null,null,null,null,null,null,null,null,null,null,120210]
[null,null,null,null,null,null,null,null,null,null,null,null,null,null,null,120400]
[null,null,null,null,null,null,null,null,null,null,null,null,null,null,null,130000]
[null,null,null,null,null,null,null,null,null,null,null,null,null,null,null,130100]
[null,null,null,null,null,null,null,null,null,null,null,null,null,null,null,140000]
[null,null,null,null,null,null,null,null,null,null,null,null,null,null,null,140020]
[null,null,null,null,null,null,null,null,null,null,null,null,null,null,null,140113]
[null,null,null,null,null,null,null,null,null,null,null,null,null,null,null,140117]
[null,null,null,null,null,null,null,null,null,null,null,null,null,null,null,140120]
[null,null,null,null,null,null,null,null,null,null,null,null,null,null,null,140132]
[null,null,null,null,null,null,null,null,null,null,null,null,null,null,null,140134]
[null,null,null,null,null,null,null,null,null,null,null,null,null,null,null,140510]
[null,null,null,null,null,null,null,null,null,null,null,null,null,null,null,140515]
[null,null,null,null,null,null,null,null,null,null,null,null,null,null,null,140530]
[null,null,null,null,null,null,null,null,null,null,null,null,null,null,null,150000]
[null,null,null,null,null,null,null,null,null,null,null,null,null,null,null,150070]
[null,null,null,null,null,null,null,null,null,null,null,null,null,null,null,150080]
[null,null,null,null,null,null,null,null,null,null,null,null,null,null,null,150090]
[null,null,null,null,null,null,null,null,null,null,null,null,null,null,null,150100]
[null,null,null,null,null,null,null,null,null,null,null,null,null,null,null,150200]
[null,null,null,null,null,null,null,null,null,null,null,null,null,null,null,150400]
[null,null,null,null,null,null,null,null,null,null,null,null,null,null,null,150600]
[null,null,null,null,null,null,null,null,null,null,null,null,null,null,null,160000]
[null,null,null,null,null,null,null,null,null,null,null,null,null,null,null,160001]
[null,null,null,null,null,null,null,null,null,null,null,null,null,null,null,160010]
[null,null,null,null,null,null,null,null,null,null,null,null,null,null,null,160050]
[null,null,null,null,null,null,null,null,null,null,null,null,null,null,null,160100]
[null,null,null,null,null,null,null,null,null,null,null,null,null,null,null,160102]
[null,null,null,null,null,null,null,null,null,null,null,null,null,null,null,160105]
[null,null,null,null,null,null,null,null,null,null,null,null,null,null,null,160106]
[null,null,null,null,null,null,null,null,null,null,null,null,null,null,null,160107]
[null,null,null,null,null,null,null,null,null,null,null,null,null,null,null,160110]
[null,null,null,null,null,null,null,null,null,null,null,null,null,null,null,160111]
[null,null,null,null,null,null,null,null,null,null,null,null,null,null,null,160112]
[null,null,null,null,null,null,null,null,null,null,null,null,null,null,null,160114]
[null,null,null,null,null,null,null,null,null,null,null,null,null,null,null,160117]
[null,null,null,null,null,null,null,null,null,null,null,null,null,null,null,160119]
[null,null,null,null,null,null,null,null,null,null,null,null,null,null,null,170000]
[null,null,null,null,null,null,null,null,null,null,null,null,null,null,null,180000]
[null,null,null,null,null,null,null,null,null,null,null,null,null,null,null,190000]
[null,null,null,null,null,null,null,null,null,null,null,null,null,null,null,200000]
[null,null,null,null,null,null,null,null,null,null,null,null,null,null,null,210000]
[null,null,null,null,null,null,null,null,null,null,null,null,null,null,null,210100]
[null,null,null,null,null,null,null,null,null,null,null,null,null,null,null,210200]
[null,null,null,null,null,null,null,null,null,null,null,null,null,null,null,210300]
[null,null,null,null,null,null,null,null,null,null,null,null,null,null,null,220000]
[null,null,null,null,null,null,null,null,null,null,null,null,null,null,null,220100]
[null,null,null,null,null,null,null,null,null,null,null,null,null,null,null,220200]
[null,null,null,null,null,null,null,null,null,null,null,null,null,null,null,220300]
[null,null,null,null,null,null,null,null,null,null,null,null,null,null,null,220410]
[null,null,null,null,null,null,null,null,null,null,null,null,null,null,null,220500]
[null,null,null,null,null,null,null,null,null,null,null,null,null,null,null,230000]
[null,null,null,null,null,null,null,null,null,null,null,null,null,null,null,230100]
[null,null,null,null,null,null,null,null,null,null,null,null,null,null,null,230300]
[null,null,null,null,null,null,null,null,null,null,null,null,null,null,null,240000]
[null,null,null,null,null,null,null,null,null,null,null,null,null,null,null,250000]
[null,null,null,null,null,null,null,null,null,null,null,null,null,null,null,250020]
[null,null,null,null,null,null,null,null,null,null,null,null,null,null,null,250300]
[null,null,null,null,null,null,null,null,null,null,null,null,null,null,null,260000]
[null,null,null,null,null,null,null,null,null,null,null,null,null,null,null,260200]
[null,null,null,null,null,null,null,null,null,null,null,null,null,null,null,270000]
[null,null,null,null,null,null,null,null,null,null,null,null,null,null,null,270400]
[null,null,null,null,null,null,null,null,null,null,null,null,null,null,null,280000]
[null,null,null,null,null,null,null,null,null,null,null,null,null,null,null,280010]
[null,null,null,null,null,null,null,null,null,null,null,null,null,null,null,280100]
[null,null,null,null,null,null,null,null,null,null,null,null,null,null,null,280200]
[null,null,null,null,null,null,null,null,null,null,null,null,null,null,null,280300]
[null,null,null,null,null,null,null,null,null,null,null,null,null,null,null,280400]
[null,null,null,null,null,null,null,null,null,null,null,null,null,null,null,290000]
[null,null,null,null,null,null,null,null,null,null,null,null,null,null,null,300000]
[null,null,null,null,null,null,null,null,null,null,null,null,null,null,null,300001]
[null,null,null,null,null,null,null,null,null,null,null,null,null,null,null,400000]
[null,null,null,null,null,null,null,null,null,null,null,null,null,null,null,500030]
[null,null,null,null,null,null,null,null,null,null,null,null,null,null,null,500404]
[null,null,null,null,null,null,null,null,null,null,null,null,null,null,null,600000]